<?xml version="1.0" encoding="UTF-8"?>
<svg width="96px" height="96px" viewBox="0 0 96 96" version="1.1" xmlns="http://www.w3.org/2000/svg" xmlns:xlink="http://www.w3.org/1999/xlink">
    <!-- Generator: Sketch 46.2 (44496) - http://www.bohemiancoding.com/sketch -->
    <title>Presentation</title>
    <desc>Created with Sketch.</desc>
    <defs></defs>
    <g id="Screens" stroke="none" stroke-width="1" fill="none" fill-rule="evenodd">
        <g id="MyPresentation----New" transform="translate(-128.000000, -123.000000)" stroke-width="2" stroke="#9B9B9B">
            <polygon id="Presentation" points="176 198.331579 203.81 216 196.43 182.7 221 160.294737 188.645 157.405263 176 126 163.355 157.405263 131 160.294737 155.57 182.7 148.19 216"></polygon>
        </g>
    </g>
</svg>