ISO-10303-21;
HEADER;
/* Generated by software containing ST-Developer
 * from STEP Tools, Inc. (www.steptools.com) 
 */

FILE_DESCRIPTION(
/* description */ (''),
/* implementation_level */ '2;1');

FILE_NAME(
/* name */ 
'C:\\Users\\Kacper\\MATLAB\\Projects\\release-mechanism-simulation\\st
ep_files\\complete3\\\\middle_ipt_7181854c.STEP',
/* time_stamp */ '2021-01-02T23:39:42+01:00',
/* author */ ('Kacper'),
/* organization */ (''),
/* preprocessor_version */ 'ST-DEVELOPER v18.1',
/* originating_system */ 'Autodesk Inventor 2021',
/* authorisation */ '');

FILE_SCHEMA (('AUTOMOTIVE_DESIGN { 1 0 10303 214 3 1 1 }'));
ENDSEC;

DATA;
#10=MECHANICAL_DESIGN_GEOMETRIC_PRESENTATION_REPRESENTATION('',(#13),#524);
#11=SHAPE_REPRESENTATION_RELATIONSHIP('SRR','None',#531,#12);
#12=ADVANCED_BREP_SHAPE_REPRESENTATION('',(#14),#523);
#13=STYLED_ITEM('',(#540),#14);
#14=MANIFOLD_SOLID_BREP('Solid1',#298);
#15=FACE_BOUND('',#53,.T.);
#16=FACE_BOUND('',#54,.T.);
#17=FACE_BOUND('',#55,.T.);
#18=FACE_BOUND('',#56,.T.);
#19=FACE_BOUND('',#57,.T.);
#20=FACE_BOUND('',#66,.T.);
#21=FACE_BOUND('',#67,.T.);
#22=FACE_BOUND('',#68,.T.);
#23=FACE_BOUND('',#69,.T.);
#24=FACE_BOUND('',#70,.T.);
#25=PLANE('',#333);
#26=PLANE('',#334);
#27=PLANE('',#341);
#28=PLANE('',#344);
#29=PLANE('',#349);
#30=PLANE('',#350);
#31=FACE_OUTER_BOUND('',#46,.T.);
#32=FACE_OUTER_BOUND('',#47,.T.);
#33=FACE_OUTER_BOUND('',#48,.T.);
#34=FACE_OUTER_BOUND('',#49,.T.);
#35=FACE_OUTER_BOUND('',#50,.T.);
#36=FACE_OUTER_BOUND('',#51,.T.);
#37=FACE_OUTER_BOUND('',#52,.T.);
#38=FACE_OUTER_BOUND('',#58,.T.);
#39=FACE_OUTER_BOUND('',#59,.T.);
#40=FACE_OUTER_BOUND('',#60,.T.);
#41=FACE_OUTER_BOUND('',#61,.T.);
#42=FACE_OUTER_BOUND('',#62,.T.);
#43=FACE_OUTER_BOUND('',#63,.T.);
#44=FACE_OUTER_BOUND('',#64,.T.);
#45=FACE_OUTER_BOUND('',#65,.T.);
#46=EDGE_LOOP('',(#196,#197,#198,#199));
#47=EDGE_LOOP('',(#200,#201,#202,#203));
#48=EDGE_LOOP('',(#204,#205,#206,#207));
#49=EDGE_LOOP('',(#208,#209,#210,#211));
#50=EDGE_LOOP('',(#212,#213,#214,#215));
#51=EDGE_LOOP('',(#216,#217,#218,#219));
#52=EDGE_LOOP('',(#220,#221,#222,#223,#224,#225,#226,#227));
#53=EDGE_LOOP('',(#228));
#54=EDGE_LOOP('',(#229));
#55=EDGE_LOOP('',(#230));
#56=EDGE_LOOP('',(#231));
#57=EDGE_LOOP('',(#232));
#58=EDGE_LOOP('',(#233,#234,#235,#236));
#59=EDGE_LOOP('',(#237,#238,#239,#240));
#60=EDGE_LOOP('',(#241,#242,#243,#244));
#61=EDGE_LOOP('',(#245,#246,#247,#248));
#62=EDGE_LOOP('',(#249,#250,#251,#252));
#63=EDGE_LOOP('',(#253,#254,#255,#256));
#64=EDGE_LOOP('',(#257,#258,#259,#260));
#65=EDGE_LOOP('',(#261,#262,#263,#264,#265,#266,#267,#268));
#66=EDGE_LOOP('',(#269));
#67=EDGE_LOOP('',(#270));
#68=EDGE_LOOP('',(#271));
#69=EDGE_LOOP('',(#272));
#70=EDGE_LOOP('',(#273));
#71=LINE('',#445,#92);
#72=LINE('',#451,#93);
#73=LINE('',#457,#94);
#74=LINE('',#463,#95);
#75=LINE('',#470,#96);
#76=LINE('',#473,#97);
#77=LINE('',#476,#98);
#78=LINE('',#478,#99);
#79=LINE('',#479,#100);
#80=LINE('',#482,#101);
#81=LINE('',#486,#102);
#82=LINE('',#490,#103);
#83=LINE('',#497,#104);
#84=LINE('',#500,#105);
#85=LINE('',#501,#106);
#86=LINE('',#506,#107);
#87=LINE('',#507,#108);
#88=LINE('',#509,#109);
#89=LINE('',#513,#110);
#90=LINE('',#517,#111);
#91=LINE('',#519,#112);
#92=VECTOR('',#357,14.);
#93=VECTOR('',#364,2.25);
#94=VECTOR('',#371,2.25);
#95=VECTOR('',#378,2.25);
#96=VECTOR('',#385,10.);
#97=VECTOR('',#388,10.);
#98=VECTOR('',#391,10.);
#99=VECTOR('',#392,10.);
#100=VECTOR('',#393,10.);
#101=VECTOR('',#396,10.);
#102=VECTOR('',#399,10.);
#103=VECTOR('',#402,10.);
#104=VECTOR('',#411,10.);
#105=VECTOR('',#414,10.);
#106=VECTOR('',#415,10.);
#107=VECTOR('',#420,10.);
#108=VECTOR('',#421,10.);
#109=VECTOR('',#424,10.);
#110=VECTOR('',#429,10.);
#111=VECTOR('',#434,2.25);
#112=VECTOR('',#437,10.);
#113=CIRCLE('',#319,14.);
#114=CIRCLE('',#320,14.);
#115=CIRCLE('',#322,2.25);
#116=CIRCLE('',#323,2.25);
#117=CIRCLE('',#325,2.25);
#118=CIRCLE('',#326,2.25);
#119=CIRCLE('',#328,2.25);
#120=CIRCLE('',#329,2.25);
#121=CIRCLE('',#331,7.);
#122=CIRCLE('',#332,7.);
#123=CIRCLE('',#335,7.);
#124=CIRCLE('',#336,7.);
#125=CIRCLE('',#337,7.);
#126=CIRCLE('',#338,2.25);
#127=CIRCLE('',#340,7.);
#128=CIRCLE('',#343,7.);
#129=CIRCLE('',#346,7.);
#130=CIRCLE('',#348,2.25);
#131=VERTEX_POINT('',#442);
#132=VERTEX_POINT('',#444);
#133=VERTEX_POINT('',#448);
#134=VERTEX_POINT('',#450);
#135=VERTEX_POINT('',#454);
#136=VERTEX_POINT('',#456);
#137=VERTEX_POINT('',#460);
#138=VERTEX_POINT('',#462);
#139=VERTEX_POINT('',#466);
#140=VERTEX_POINT('',#467);
#141=VERTEX_POINT('',#469);
#142=VERTEX_POINT('',#471);
#143=VERTEX_POINT('',#475);
#144=VERTEX_POINT('',#477);
#145=VERTEX_POINT('',#481);
#146=VERTEX_POINT('',#483);
#147=VERTEX_POINT('',#485);
#148=VERTEX_POINT('',#487);
#149=VERTEX_POINT('',#489);
#150=VERTEX_POINT('',#492);
#151=VERTEX_POINT('',#495);
#152=VERTEX_POINT('',#499);
#153=VERTEX_POINT('',#503);
#154=VERTEX_POINT('',#504);
#155=VERTEX_POINT('',#511);
#156=VERTEX_POINT('',#515);
#157=EDGE_CURVE('',#131,#131,#113,.T.);
#158=EDGE_CURVE('',#131,#132,#71,.T.);
#159=EDGE_CURVE('',#132,#132,#114,.T.);
#160=EDGE_CURVE('',#133,#133,#115,.T.);
#161=EDGE_CURVE('',#133,#134,#72,.T.);
#162=EDGE_CURVE('',#134,#134,#116,.T.);
#163=EDGE_CURVE('',#135,#135,#117,.T.);
#164=EDGE_CURVE('',#135,#136,#73,.T.);
#165=EDGE_CURVE('',#136,#136,#118,.T.);
#166=EDGE_CURVE('',#137,#137,#119,.T.);
#167=EDGE_CURVE('',#137,#138,#74,.T.);
#168=EDGE_CURVE('',#138,#138,#120,.T.);
#169=EDGE_CURVE('',#139,#140,#121,.T.);
#170=EDGE_CURVE('',#140,#141,#75,.T.);
#171=EDGE_CURVE('',#141,#142,#122,.T.);
#172=EDGE_CURVE('',#142,#139,#76,.T.);
#173=EDGE_CURVE('',#142,#143,#77,.T.);
#174=EDGE_CURVE('',#144,#143,#78,.T.);
#175=EDGE_CURVE('',#139,#144,#79,.T.);
#176=EDGE_CURVE('',#145,#141,#80,.T.);
#177=EDGE_CURVE('',#146,#145,#123,.T.);
#178=EDGE_CURVE('',#147,#146,#81,.T.);
#179=EDGE_CURVE('',#148,#147,#124,.T.);
#180=EDGE_CURVE('',#149,#148,#82,.T.);
#181=EDGE_CURVE('',#143,#149,#125,.T.);
#182=EDGE_CURVE('',#150,#150,#126,.T.);
#183=EDGE_CURVE('',#151,#144,#127,.T.);
#184=EDGE_CURVE('',#149,#151,#83,.T.);
#185=EDGE_CURVE('',#152,#148,#84,.T.);
#186=EDGE_CURVE('',#151,#152,#85,.T.);
#187=EDGE_CURVE('',#153,#154,#128,.T.);
#188=EDGE_CURVE('',#154,#146,#86,.T.);
#189=EDGE_CURVE('',#145,#153,#87,.T.);
#190=EDGE_CURVE('',#153,#140,#88,.T.);
#191=EDGE_CURVE('',#155,#152,#129,.T.);
#192=EDGE_CURVE('',#147,#155,#89,.T.);
#193=EDGE_CURVE('',#156,#156,#130,.T.);
#194=EDGE_CURVE('',#156,#150,#90,.T.);
#195=EDGE_CURVE('',#155,#154,#91,.T.);
#196=ORIENTED_EDGE('',*,*,#157,.F.);
#197=ORIENTED_EDGE('',*,*,#158,.T.);
#198=ORIENTED_EDGE('',*,*,#159,.F.);
#199=ORIENTED_EDGE('',*,*,#158,.F.);
#200=ORIENTED_EDGE('',*,*,#160,.F.);
#201=ORIENTED_EDGE('',*,*,#161,.T.);
#202=ORIENTED_EDGE('',*,*,#162,.F.);
#203=ORIENTED_EDGE('',*,*,#161,.F.);
#204=ORIENTED_EDGE('',*,*,#163,.F.);
#205=ORIENTED_EDGE('',*,*,#164,.T.);
#206=ORIENTED_EDGE('',*,*,#165,.F.);
#207=ORIENTED_EDGE('',*,*,#164,.F.);
#208=ORIENTED_EDGE('',*,*,#166,.F.);
#209=ORIENTED_EDGE('',*,*,#167,.T.);
#210=ORIENTED_EDGE('',*,*,#168,.F.);
#211=ORIENTED_EDGE('',*,*,#167,.F.);
#212=ORIENTED_EDGE('',*,*,#169,.T.);
#213=ORIENTED_EDGE('',*,*,#170,.T.);
#214=ORIENTED_EDGE('',*,*,#171,.T.);
#215=ORIENTED_EDGE('',*,*,#172,.T.);
#216=ORIENTED_EDGE('',*,*,#172,.F.);
#217=ORIENTED_EDGE('',*,*,#173,.T.);
#218=ORIENTED_EDGE('',*,*,#174,.F.);
#219=ORIENTED_EDGE('',*,*,#175,.F.);
#220=ORIENTED_EDGE('',*,*,#171,.F.);
#221=ORIENTED_EDGE('',*,*,#176,.F.);
#222=ORIENTED_EDGE('',*,*,#177,.F.);
#223=ORIENTED_EDGE('',*,*,#178,.F.);
#224=ORIENTED_EDGE('',*,*,#179,.F.);
#225=ORIENTED_EDGE('',*,*,#180,.F.);
#226=ORIENTED_EDGE('',*,*,#181,.F.);
#227=ORIENTED_EDGE('',*,*,#173,.F.);
#228=ORIENTED_EDGE('',*,*,#159,.T.);
#229=ORIENTED_EDGE('',*,*,#160,.T.);
#230=ORIENTED_EDGE('',*,*,#163,.T.);
#231=ORIENTED_EDGE('',*,*,#166,.T.);
#232=ORIENTED_EDGE('',*,*,#182,.F.);
#233=ORIENTED_EDGE('',*,*,#183,.T.);
#234=ORIENTED_EDGE('',*,*,#174,.T.);
#235=ORIENTED_EDGE('',*,*,#181,.T.);
#236=ORIENTED_EDGE('',*,*,#184,.T.);
#237=ORIENTED_EDGE('',*,*,#184,.F.);
#238=ORIENTED_EDGE('',*,*,#180,.T.);
#239=ORIENTED_EDGE('',*,*,#185,.F.);
#240=ORIENTED_EDGE('',*,*,#186,.F.);
#241=ORIENTED_EDGE('',*,*,#187,.T.);
#242=ORIENTED_EDGE('',*,*,#188,.T.);
#243=ORIENTED_EDGE('',*,*,#177,.T.);
#244=ORIENTED_EDGE('',*,*,#189,.T.);
#245=ORIENTED_EDGE('',*,*,#170,.F.);
#246=ORIENTED_EDGE('',*,*,#190,.F.);
#247=ORIENTED_EDGE('',*,*,#189,.F.);
#248=ORIENTED_EDGE('',*,*,#176,.T.);
#249=ORIENTED_EDGE('',*,*,#191,.T.);
#250=ORIENTED_EDGE('',*,*,#185,.T.);
#251=ORIENTED_EDGE('',*,*,#179,.T.);
#252=ORIENTED_EDGE('',*,*,#192,.T.);
#253=ORIENTED_EDGE('',*,*,#193,.F.);
#254=ORIENTED_EDGE('',*,*,#194,.T.);
#255=ORIENTED_EDGE('',*,*,#182,.T.);
#256=ORIENTED_EDGE('',*,*,#194,.F.);
#257=ORIENTED_EDGE('',*,*,#188,.F.);
#258=ORIENTED_EDGE('',*,*,#195,.F.);
#259=ORIENTED_EDGE('',*,*,#192,.F.);
#260=ORIENTED_EDGE('',*,*,#178,.T.);
#261=ORIENTED_EDGE('',*,*,#169,.F.);
#262=ORIENTED_EDGE('',*,*,#175,.T.);
#263=ORIENTED_EDGE('',*,*,#183,.F.);
#264=ORIENTED_EDGE('',*,*,#186,.T.);
#265=ORIENTED_EDGE('',*,*,#191,.F.);
#266=ORIENTED_EDGE('',*,*,#195,.T.);
#267=ORIENTED_EDGE('',*,*,#187,.F.);
#268=ORIENTED_EDGE('',*,*,#190,.T.);
#269=ORIENTED_EDGE('',*,*,#157,.T.);
#270=ORIENTED_EDGE('',*,*,#162,.T.);
#271=ORIENTED_EDGE('',*,*,#165,.T.);
#272=ORIENTED_EDGE('',*,*,#168,.T.);
#273=ORIENTED_EDGE('',*,*,#193,.T.);
#274=CYLINDRICAL_SURFACE('',#318,14.);
#275=CYLINDRICAL_SURFACE('',#321,2.25);
#276=CYLINDRICAL_SURFACE('',#324,2.25);
#277=CYLINDRICAL_SURFACE('',#327,2.25);
#278=CYLINDRICAL_SURFACE('',#330,7.);
#279=CYLINDRICAL_SURFACE('',#339,7.);
#280=CYLINDRICAL_SURFACE('',#342,7.);
#281=CYLINDRICAL_SURFACE('',#345,7.);
#282=CYLINDRICAL_SURFACE('',#347,2.25);
#283=ADVANCED_FACE('',(#31),#274,.F.);
#284=ADVANCED_FACE('',(#32),#275,.F.);
#285=ADVANCED_FACE('',(#33),#276,.F.);
#286=ADVANCED_FACE('',(#34),#277,.F.);
#287=ADVANCED_FACE('',(#35),#278,.T.);
#288=ADVANCED_FACE('',(#36),#25,.T.);
#289=ADVANCED_FACE('',(#37,#15,#16,#17,#18,#19),#26,.F.);
#290=ADVANCED_FACE('',(#38),#279,.T.);
#291=ADVANCED_FACE('',(#39),#27,.T.);
#292=ADVANCED_FACE('',(#40),#280,.T.);
#293=ADVANCED_FACE('',(#41),#28,.T.);
#294=ADVANCED_FACE('',(#42),#281,.T.);
#295=ADVANCED_FACE('',(#43),#282,.F.);
#296=ADVANCED_FACE('',(#44),#29,.T.);
#297=ADVANCED_FACE('',(#45,#20,#21,#22,#23,#24),#30,.T.);
#298=CLOSED_SHELL('',(#283,#284,#285,#286,#287,#288,#289,#290,#291,#292,
#293,#294,#295,#296,#297));
#299=DERIVED_UNIT_ELEMENT(#301,1.);
#300=DERIVED_UNIT_ELEMENT(#526,3.);
#301=(
MASS_UNIT()
NAMED_UNIT(*)
SI_UNIT($,.GRAM.)
);
#302=DERIVED_UNIT((#299,#300));
#303=MEASURE_REPRESENTATION_ITEM('density measure',
POSITIVE_RATIO_MEASURE(2.81),#302);
#304=PROPERTY_DEFINITION_REPRESENTATION(#309,#306);
#305=PROPERTY_DEFINITION_REPRESENTATION(#310,#307);
#306=REPRESENTATION('material name',(#308),#523);
#307=REPRESENTATION('density',(#303),#523);
#308=DESCRIPTIVE_REPRESENTATION_ITEM('Aluminum 7075','Aluminum 7075');
#309=PROPERTY_DEFINITION('material property','material name',#533);
#310=PROPERTY_DEFINITION('material property','density of part',#533);
#311=DATE_TIME_ROLE('creation_date');
#312=APPLIED_DATE_AND_TIME_ASSIGNMENT(#313,#311,(#533));
#313=DATE_AND_TIME(#314,#315);
#314=CALENDAR_DATE(2020,6,10);
#315=LOCAL_TIME(0,0,0.,#316);
#316=COORDINATED_UNIVERSAL_TIME_OFFSET(0,0,.BEHIND.);
#317=AXIS2_PLACEMENT_3D('placement',#440,#351,#352);
#318=AXIS2_PLACEMENT_3D('',#441,#353,#354);
#319=AXIS2_PLACEMENT_3D('',#443,#355,#356);
#320=AXIS2_PLACEMENT_3D('',#446,#358,#359);
#321=AXIS2_PLACEMENT_3D('',#447,#360,#361);
#322=AXIS2_PLACEMENT_3D('',#449,#362,#363);
#323=AXIS2_PLACEMENT_3D('',#452,#365,#366);
#324=AXIS2_PLACEMENT_3D('',#453,#367,#368);
#325=AXIS2_PLACEMENT_3D('',#455,#369,#370);
#326=AXIS2_PLACEMENT_3D('',#458,#372,#373);
#327=AXIS2_PLACEMENT_3D('',#459,#374,#375);
#328=AXIS2_PLACEMENT_3D('',#461,#376,#377);
#329=AXIS2_PLACEMENT_3D('',#464,#379,#380);
#330=AXIS2_PLACEMENT_3D('',#465,#381,#382);
#331=AXIS2_PLACEMENT_3D('',#468,#383,#384);
#332=AXIS2_PLACEMENT_3D('',#472,#386,#387);
#333=AXIS2_PLACEMENT_3D('',#474,#389,#390);
#334=AXIS2_PLACEMENT_3D('',#480,#394,#395);
#335=AXIS2_PLACEMENT_3D('',#484,#397,#398);
#336=AXIS2_PLACEMENT_3D('',#488,#400,#401);
#337=AXIS2_PLACEMENT_3D('',#491,#403,#404);
#338=AXIS2_PLACEMENT_3D('',#493,#405,#406);
#339=AXIS2_PLACEMENT_3D('',#494,#407,#408);
#340=AXIS2_PLACEMENT_3D('',#496,#409,#410);
#341=AXIS2_PLACEMENT_3D('',#498,#412,#413);
#342=AXIS2_PLACEMENT_3D('',#502,#416,#417);
#343=AXIS2_PLACEMENT_3D('',#505,#418,#419);
#344=AXIS2_PLACEMENT_3D('',#508,#422,#423);
#345=AXIS2_PLACEMENT_3D('',#510,#425,#426);
#346=AXIS2_PLACEMENT_3D('',#512,#427,#428);
#347=AXIS2_PLACEMENT_3D('',#514,#430,#431);
#348=AXIS2_PLACEMENT_3D('',#516,#432,#433);
#349=AXIS2_PLACEMENT_3D('',#518,#435,#436);
#350=AXIS2_PLACEMENT_3D('',#520,#438,#439);
#351=DIRECTION('axis',(0.,0.,1.));
#352=DIRECTION('refdir',(1.,0.,0.));
#353=DIRECTION('center_axis',(0.,-1.,0.));
#354=DIRECTION('ref_axis',(1.,0.,0.));
#355=DIRECTION('center_axis',(0.,-1.,0.));
#356=DIRECTION('ref_axis',(1.,0.,0.));
#357=DIRECTION('',(0.,-1.,0.));
#358=DIRECTION('center_axis',(0.,1.,0.));
#359=DIRECTION('ref_axis',(1.,0.,0.));
#360=DIRECTION('center_axis',(0.,1.,0.));
#361=DIRECTION('ref_axis',(-1.,0.,0.));
#362=DIRECTION('center_axis',(0.,1.,0.));
#363=DIRECTION('ref_axis',(-1.,0.,0.));
#364=DIRECTION('',(0.,1.,0.));
#365=DIRECTION('center_axis',(0.,-1.,0.));
#366=DIRECTION('ref_axis',(-1.,0.,0.));
#367=DIRECTION('center_axis',(0.,1.,0.));
#368=DIRECTION('ref_axis',(-1.,0.,0.));
#369=DIRECTION('center_axis',(0.,1.,0.));
#370=DIRECTION('ref_axis',(-1.,0.,0.));
#371=DIRECTION('',(0.,1.,0.));
#372=DIRECTION('center_axis',(0.,-1.,0.));
#373=DIRECTION('ref_axis',(-1.,0.,0.));
#374=DIRECTION('center_axis',(0.,1.,0.));
#375=DIRECTION('ref_axis',(-1.,0.,0.));
#376=DIRECTION('center_axis',(0.,1.,0.));
#377=DIRECTION('ref_axis',(-1.,0.,0.));
#378=DIRECTION('',(0.,1.,0.));
#379=DIRECTION('center_axis',(0.,-1.,0.));
#380=DIRECTION('ref_axis',(-1.,0.,0.));
#381=DIRECTION('center_axis',(0.,1.,0.));
#382=DIRECTION('ref_axis',(-0.707106781186548,0.,-0.707106781186548));
#383=DIRECTION('center_axis',(0.,-1.,0.));
#384=DIRECTION('ref_axis',(-0.707106781186548,0.,-0.707106781186548));
#385=DIRECTION('',(0.,-1.,0.));
#386=DIRECTION('center_axis',(0.,1.,0.));
#387=DIRECTION('ref_axis',(-0.707106781186548,0.,-0.707106781186548));
#388=DIRECTION('',(0.,1.,0.));
#389=DIRECTION('center_axis',(-1.,0.,1.77635683940025E-16));
#390=DIRECTION('ref_axis',(1.77635683940025E-16,0.,1.));
#391=DIRECTION('',(1.77635683940025E-16,0.,1.));
#392=DIRECTION('',(0.,-1.,0.));
#393=DIRECTION('',(1.77635683940025E-16,0.,1.));
#394=DIRECTION('center_axis',(0.,1.,0.));
#395=DIRECTION('ref_axis',(0.,0.,1.));
#396=DIRECTION('',(-1.,0.,0.));
#397=DIRECTION('center_axis',(0.,1.,0.));
#398=DIRECTION('ref_axis',(0.707106781186547,0.,-0.707106781186548));
#399=DIRECTION('',(8.88178419700125E-17,0.,-1.));
#400=DIRECTION('center_axis',(0.,1.,0.));
#401=DIRECTION('ref_axis',(0.707106781186547,0.,0.707106781186548));
#402=DIRECTION('',(1.,0.,0.));
#403=DIRECTION('center_axis',(0.,1.,0.));
#404=DIRECTION('ref_axis',(-0.707106781186548,0.,0.707106781186548));
#405=DIRECTION('center_axis',(0.,-1.,0.));
#406=DIRECTION('ref_axis',(1.,0.,0.));
#407=DIRECTION('center_axis',(0.,1.,0.));
#408=DIRECTION('ref_axis',(-0.707106781186548,0.,0.707106781186548));
#409=DIRECTION('center_axis',(0.,-1.,0.));
#410=DIRECTION('ref_axis',(-0.707106781186548,0.,0.707106781186548));
#411=DIRECTION('',(0.,1.,0.));
#412=DIRECTION('center_axis',(0.,0.,1.));
#413=DIRECTION('ref_axis',(1.,0.,0.));
#414=DIRECTION('',(0.,-1.,0.));
#415=DIRECTION('',(1.,0.,0.));
#416=DIRECTION('center_axis',(0.,1.,0.));
#417=DIRECTION('ref_axis',(0.707106781186547,0.,-0.707106781186548));
#418=DIRECTION('center_axis',(0.,-1.,0.));
#419=DIRECTION('ref_axis',(0.707106781186547,0.,-0.707106781186548));
#420=DIRECTION('',(0.,-1.,0.));
#421=DIRECTION('',(0.,1.,0.));
#422=DIRECTION('center_axis',(0.,0.,-1.));
#423=DIRECTION('ref_axis',(-1.,0.,0.));
#424=DIRECTION('',(-1.,0.,0.));
#425=DIRECTION('center_axis',(0.,1.,0.));
#426=DIRECTION('ref_axis',(0.707106781186547,0.,0.707106781186548));
#427=DIRECTION('center_axis',(0.,-1.,0.));
#428=DIRECTION('ref_axis',(0.707106781186547,0.,0.707106781186548));
#429=DIRECTION('',(0.,1.,0.));
#430=DIRECTION('center_axis',(0.,1.,0.));
#431=DIRECTION('ref_axis',(1.,0.,0.));
#432=DIRECTION('center_axis',(0.,-1.,0.));
#433=DIRECTION('ref_axis',(1.,0.,0.));
#434=DIRECTION('',(0.,-1.,0.));
#435=DIRECTION('center_axis',(1.,0.,8.88178419700125E-17));
#436=DIRECTION('ref_axis',(8.88178419700125E-17,0.,-1.));
#437=DIRECTION('',(8.88178419700125E-17,0.,-1.));
#438=DIRECTION('center_axis',(0.,1.,0.));
#439=DIRECTION('ref_axis',(0.,0.,1.));
#440=CARTESIAN_POINT('',(0.,0.,0.));
#441=CARTESIAN_POINT('Origin',(0.,3.,0.));
#442=CARTESIAN_POINT('',(-14.,3.,-1.71450551880629E-15));
#443=CARTESIAN_POINT('Origin',(0.,3.,0.));
#444=CARTESIAN_POINT('',(-14.,0.,-1.71450551880629E-15));
#445=CARTESIAN_POINT('',(-14.,3.,-1.71450551880629E-15));
#446=CARTESIAN_POINT('Origin',(0.,0.,0.));
#447=CARTESIAN_POINT('Origin',(-17.6776695296637,0.,-17.6776695296637));
#448=CARTESIAN_POINT('',(-15.4276695296637,0.,-17.6776695296637));
#449=CARTESIAN_POINT('Origin',(-17.6776695296637,0.,-17.6776695296637));
#450=CARTESIAN_POINT('',(-15.4276695296637,3.,-17.6776695296637));
#451=CARTESIAN_POINT('',(-15.4276695296637,0.,-17.6776695296637));
#452=CARTESIAN_POINT('Origin',(-17.6776695296637,3.,-17.6776695296637));
#453=CARTESIAN_POINT('Origin',(17.6776695296637,0.,-17.6776695296637));
#454=CARTESIAN_POINT('',(19.9276695296637,0.,-17.6776695296637));
#455=CARTESIAN_POINT('Origin',(17.6776695296637,0.,-17.6776695296637));
#456=CARTESIAN_POINT('',(19.9276695296637,3.,-17.6776695296637));
#457=CARTESIAN_POINT('',(19.9276695296637,0.,-17.6776695296637));
#458=CARTESIAN_POINT('Origin',(17.6776695296637,3.,-17.6776695296637));
#459=CARTESIAN_POINT('Origin',(17.6776695296637,0.,17.6776695296637));
#460=CARTESIAN_POINT('',(19.9276695296637,0.,17.6776695296637));
#461=CARTESIAN_POINT('Origin',(17.6776695296637,0.,17.6776695296637));
#462=CARTESIAN_POINT('',(19.9276695296637,3.,17.6776695296637));
#463=CARTESIAN_POINT('',(19.9276695296637,0.,17.6776695296637));
#464=CARTESIAN_POINT('Origin',(17.6776695296637,3.,17.6776695296637));
#465=CARTESIAN_POINT('Origin',(-18.,0.,-18.));
#466=CARTESIAN_POINT('',(-25.,3.,-18.));
#467=CARTESIAN_POINT('',(-18.,3.,-25.));
#468=CARTESIAN_POINT('Origin',(-18.,3.,-18.));
#469=CARTESIAN_POINT('',(-18.,0.,-25.));
#470=CARTESIAN_POINT('',(-18.,0.,-25.));
#471=CARTESIAN_POINT('',(-25.,0.,-18.));
#472=CARTESIAN_POINT('Origin',(-18.,0.,-18.));
#473=CARTESIAN_POINT('',(-25.,0.,-18.));
#474=CARTESIAN_POINT('Origin',(-25.,0.,-25.));
#475=CARTESIAN_POINT('',(-25.,0.,18.));
#476=CARTESIAN_POINT('',(-25.,0.,-25.));
#477=CARTESIAN_POINT('',(-25.,3.,18.));
#478=CARTESIAN_POINT('',(-25.,0.,18.));
#479=CARTESIAN_POINT('',(-25.,3.,-25.));
#480=CARTESIAN_POINT('Origin',(-4.44089209850063E-15,0.,0.));
#481=CARTESIAN_POINT('',(18.,0.,-25.));
#482=CARTESIAN_POINT('',(25.,0.,-25.));
#483=CARTESIAN_POINT('',(25.,0.,-18.));
#484=CARTESIAN_POINT('Origin',(18.,0.,-18.));
#485=CARTESIAN_POINT('',(25.,0.,18.));
#486=CARTESIAN_POINT('',(25.,0.,25.));
#487=CARTESIAN_POINT('',(18.,0.,25.));
#488=CARTESIAN_POINT('Origin',(18.,0.,18.));
#489=CARTESIAN_POINT('',(-18.,0.,25.));
#490=CARTESIAN_POINT('',(-25.,0.,25.));
#491=CARTESIAN_POINT('Origin',(-18.,0.,18.));
#492=CARTESIAN_POINT('',(-19.9276695296637,0.,17.6776695296637));
#493=CARTESIAN_POINT('Origin',(-17.6776695296637,0.,17.6776695296637));
#494=CARTESIAN_POINT('Origin',(-18.,0.,18.));
#495=CARTESIAN_POINT('',(-18.,3.,25.));
#496=CARTESIAN_POINT('Origin',(-18.,3.,18.));
#497=CARTESIAN_POINT('',(-18.,0.,25.));
#498=CARTESIAN_POINT('Origin',(-25.,0.,25.));
#499=CARTESIAN_POINT('',(18.,3.,25.));
#500=CARTESIAN_POINT('',(18.,0.,25.));
#501=CARTESIAN_POINT('',(-25.,3.,25.));
#502=CARTESIAN_POINT('Origin',(18.,0.,-18.));
#503=CARTESIAN_POINT('',(18.,3.,-25.));
#504=CARTESIAN_POINT('',(25.,3.,-18.));
#505=CARTESIAN_POINT('Origin',(18.,3.,-18.));
#506=CARTESIAN_POINT('',(25.,0.,-18.));
#507=CARTESIAN_POINT('',(18.,0.,-25.));
#508=CARTESIAN_POINT('Origin',(25.,0.,-25.));
#509=CARTESIAN_POINT('',(25.,3.,-25.));
#510=CARTESIAN_POINT('Origin',(18.,0.,18.));
#511=CARTESIAN_POINT('',(25.,3.,18.));
#512=CARTESIAN_POINT('Origin',(18.,3.,18.));
#513=CARTESIAN_POINT('',(25.,0.,18.));
#514=CARTESIAN_POINT('Origin',(-17.6776695296637,0.,17.6776695296637));
#515=CARTESIAN_POINT('',(-19.9276695296637,3.,17.6776695296637));
#516=CARTESIAN_POINT('Origin',(-17.6776695296637,3.,17.6776695296637));
#517=CARTESIAN_POINT('',(-19.9276695296637,0.,17.6776695296637));
#518=CARTESIAN_POINT('Origin',(25.,0.,25.));
#519=CARTESIAN_POINT('',(25.,3.,25.));
#520=CARTESIAN_POINT('Origin',(-4.44089209850063E-15,3.,0.));
#521=UNCERTAINTY_MEASURE_WITH_UNIT(LENGTH_MEASURE(0.01),#525,
'DISTANCE_ACCURACY_VALUE',
'Maximum model space distance between geometric entities at asserted c
onnectivities');
#522=UNCERTAINTY_MEASURE_WITH_UNIT(LENGTH_MEASURE(0.01),#525,
'DISTANCE_ACCURACY_VALUE',
'Maximum model space distance between geometric entities at asserted c
onnectivities');
#523=(
GEOMETRIC_REPRESENTATION_CONTEXT(3)
GLOBAL_UNCERTAINTY_ASSIGNED_CONTEXT((#521))
GLOBAL_UNIT_ASSIGNED_CONTEXT((#525,#527,#528))
REPRESENTATION_CONTEXT('','3D')
);
#524=(
GEOMETRIC_REPRESENTATION_CONTEXT(3)
GLOBAL_UNCERTAINTY_ASSIGNED_CONTEXT((#522))
GLOBAL_UNIT_ASSIGNED_CONTEXT((#525,#527,#528))
REPRESENTATION_CONTEXT('','3D')
);
#525=(
LENGTH_UNIT()
NAMED_UNIT(*)
SI_UNIT(.MILLI.,.METRE.)
);
#526=(
LENGTH_UNIT()
NAMED_UNIT(*)
SI_UNIT(.CENTI.,.METRE.)
);
#527=(
NAMED_UNIT(*)
PLANE_ANGLE_UNIT()
SI_UNIT($,.RADIAN.)
);
#528=(
NAMED_UNIT(*)
SI_UNIT($,.STERADIAN.)
SOLID_ANGLE_UNIT()
);
#529=SHAPE_DEFINITION_REPRESENTATION(#530,#531);
#530=PRODUCT_DEFINITION_SHAPE('',$,#533);
#531=SHAPE_REPRESENTATION('',(#317),#523);
#532=PRODUCT_DEFINITION_CONTEXT('part definition',#537,'design');
#533=PRODUCT_DEFINITION('middle','middle',#534,#532);
#534=PRODUCT_DEFINITION_FORMATION('',$,#539);
#535=PRODUCT_RELATED_PRODUCT_CATEGORY('middle','middle',(#539));
#536=APPLICATION_PROTOCOL_DEFINITION('international standard',
'automotive_design',2009,#537);
#537=APPLICATION_CONTEXT(
'Core Data for Automotive Mechanical Design Process');
#538=PRODUCT_CONTEXT('part definition',#537,'mechanical');
#539=PRODUCT('middle','middle',$,(#538));
#540=PRESENTATION_STYLE_ASSIGNMENT((#541));
#541=SURFACE_STYLE_USAGE(.BOTH.,#544);
#542=SURFACE_STYLE_RENDERING_WITH_PROPERTIES($,#548,(#543));
#543=SURFACE_STYLE_TRANSPARENT(0.);
#544=SURFACE_SIDE_STYLE('',(#545,#542));
#545=SURFACE_STYLE_FILL_AREA(#546);
#546=FILL_AREA_STYLE('',(#547));
#547=FILL_AREA_STYLE_COLOUR('',#548);
#548=COLOUR_RGB('',0.956862745098039,0.956862745098039,0.956862745098039);
ENDSEC;
END-ISO-10303-21;
