ISO-10303-21;
HEADER;
/* Generated by software containing ST-Developer
 * from STEP Tools, Inc. (www.steptools.com) 
 */
/* OPTION: using custom schema-name function */

FILE_DESCRIPTION(
/* description */ (''),
/* implementation_level */ '2;1');

FILE_NAME(
/* name */ 'F0013963500-A-P2016.038.026.stp',
/* time_stamp */ '2020-02-10T09:46:35+01:00',
/* author */ ('DR. FRITZ FAULHABER GmbH & Co. KG'),
/* organization */ ('DR. FRITZ FAULHABER GmbH & Co. KG'),
/* preprocessor_version */ 'ST-DEVELOPER v16.7',
/* originating_system */ 'SIEMENS PLM Software NX 12.0',
/* authorisation */ '');

FILE_SCHEMA (('AUTOMOTIVE_DESIGN { 1 0 10303 214 3 1 1 1 }'));
ENDSEC;

DATA;
#10=SHAPE_REPRESENTATION_RELATIONSHIP('None',
'relationship between F0013963500-A-P2016.038.026-None and F0013963500
-A-P2016.038.026-None',#22,#11);
#11=ADVANCED_BREP_SHAPE_REPRESENTATION(
'F0013963500-A-P2016.038.026-None',(#69,#70),#868);
#12=SHAPE_DEFINITION_REPRESENTATION(#13,#22);
#13=PRODUCT_DEFINITION_SHAPE('','',#14);
#14=PRODUCT_DEFINITION(' ','',#16,#15);
#15=PRODUCT_DEFINITION_CONTEXT('part definition',#21,'design');
#16=PRODUCT_DEFINITION_FORMATION_WITH_SPECIFIED_SOURCE(' ',' ',#18,
 .NOT_KNOWN.);
#17=PRODUCT_RELATED_PRODUCT_CATEGORY('part','',(#18));
#18=PRODUCT('F0013963500-A-P2016.038.026','F0013963500-A-P2016.038.026',
' ',(#19));
#19=PRODUCT_CONTEXT(' ',#21,'mechanical');
#20=APPLICATION_PROTOCOL_DEFINITION('international standard',
'automotive_design',2010,#21);
#21=APPLICATION_CONTEXT(
'core data for automotive mechanical design processes');
#22=SHAPE_REPRESENTATION('F0013963500-A-P2016.038.026-None',(#507),#868);
#23=OVER_RIDING_STYLED_ITEM('',(#33),#112,#30);
#24=OVER_RIDING_STYLED_ITEM('',(#35),#125,#31);
#25=OVER_RIDING_STYLED_ITEM('',(#36),#128,#31);
#26=OVER_RIDING_STYLED_ITEM('',(#37),#133,#31);
#27=DRAUGHTING_PRE_DEFINED_COLOUR('red');
#28=DRAUGHTING_PRE_DEFINED_COLOUR('blue');
#29=PRESENTATION_LAYER_ASSIGNMENT('1','Layer 1',(#69,#70));
#30=STYLED_ITEM('',(#32),#69);
#31=STYLED_ITEM('',(#34),#70);
#32=PRESENTATION_STYLE_ASSIGNMENT((#38));
#33=PRESENTATION_STYLE_ASSIGNMENT((#39));
#34=PRESENTATION_STYLE_ASSIGNMENT((#40));
#35=PRESENTATION_STYLE_ASSIGNMENT((#41));
#36=PRESENTATION_STYLE_ASSIGNMENT((#42));
#37=PRESENTATION_STYLE_ASSIGNMENT((#43));
#38=SURFACE_STYLE_USAGE(.BOTH.,#44);
#39=SURFACE_STYLE_USAGE(.BOTH.,#45);
#40=SURFACE_STYLE_USAGE(.BOTH.,#46);
#41=SURFACE_STYLE_USAGE(.BOTH.,#47);
#42=SURFACE_STYLE_USAGE(.BOTH.,#48);
#43=SURFACE_STYLE_USAGE(.BOTH.,#49);
#44=SURFACE_SIDE_STYLE('',(#50));
#45=SURFACE_SIDE_STYLE('',(#51));
#46=SURFACE_SIDE_STYLE('',(#52));
#47=SURFACE_SIDE_STYLE('',(#53));
#48=SURFACE_SIDE_STYLE('',(#54));
#49=SURFACE_SIDE_STYLE('',(#55));
#50=SURFACE_STYLE_FILL_AREA(#56);
#51=SURFACE_STYLE_FILL_AREA(#57);
#52=SURFACE_STYLE_FILL_AREA(#58);
#53=SURFACE_STYLE_FILL_AREA(#59);
#54=SURFACE_STYLE_FILL_AREA(#60);
#55=SURFACE_STYLE_FILL_AREA(#61);
#56=FILL_AREA_STYLE('',(#62));
#57=FILL_AREA_STYLE('',(#63));
#58=FILL_AREA_STYLE('',(#64));
#59=FILL_AREA_STYLE('',(#65));
#60=FILL_AREA_STYLE('',(#66));
#61=FILL_AREA_STYLE('',(#67));
#62=FILL_AREA_STYLE_COLOUR('',#68);
#63=FILL_AREA_STYLE_COLOUR('',#27);
#64=FILL_AREA_STYLE_COLOUR('',#68);
#65=FILL_AREA_STYLE_COLOUR('',#27);
#66=FILL_AREA_STYLE_COLOUR('',#27);
#67=FILL_AREA_STYLE_COLOUR('',#28);
#68=COLOUR_RGB('Light Gray',0.6,0.6,0.6);
#69=MANIFOLD_SOLID_BREP('',#71);
#70=MANIFOLD_SOLID_BREP('',#72);
#71=CLOSED_SHELL('',(#110,#111,#112,#113,#114,#115,#116,#117));
#72=CLOSED_SHELL('',(#118,#119,#120,#121,#122,#123,#124,#125,#126,#127,
#128,#129,#130,#131,#132,#133,#134,#135,#136,#137,#138,#139,#140,#141,#142,
#143,#144,#145,#146,#147,#148));
#73=VERTEX_LOOP('',#399);
#74=PLANE('',#515);
#75=PLANE('',#516);
#76=PLANE('',#517);
#77=PLANE('',#518);
#78=PLANE('',#528);
#79=PLANE('',#530);
#80=PLANE('',#533);
#81=PLANE('',#544);
#82=PLANE('',#547);
#83=PLANE('',#550);
#84=PLANE('',#555);
#85=PLANE('',#557);
#86=PLANE('',#560);
#87=PLANE('',#563);
#88=PLANE('',#566);
#89=PLANE('',#569);
#90=PLANE('',#572);
#91=PLANE('',#575);
#92=PLANE('',#578);
#93=PLANE('',#581);
#94=CONICAL_SURFACE('',#513,3.,45.0000000000002);
#95=CONICAL_SURFACE('',#520,1.025,59.);
#96=FACE_OUTER_BOUND('',#237,.T.);
#97=FACE_OUTER_BOUND('',#240,.T.);
#98=FACE_OUTER_BOUND('',#241,.T.);
#99=FACE_OUTER_BOUND('',#242,.T.);
#100=FACE_OUTER_BOUND('',#252,.T.);
#101=FACE_OUTER_BOUND('',#271,.T.);
#102=FACE_OUTER_BOUND('',#284,.T.);
#103=FACE_OUTER_BOUND('',#287,.T.);
#104=FACE_OUTER_BOUND('',#290,.T.);
#105=FACE_OUTER_BOUND('',#293,.T.);
#106=FACE_OUTER_BOUND('',#296,.T.);
#107=FACE_OUTER_BOUND('',#299,.T.);
#108=B_SPLINE_CURVE_WITH_KNOTS('',3,(#751,#752,#753,#754),.UNSPECIFIED.,
 .F.,.F.,(4,4),(0.,1.),.UNSPECIFIED.);
#109=B_SPLINE_CURVE_WITH_KNOTS('',3,(#758,#759,#760,#761),.UNSPECIFIED.,
 .F.,.F.,(4,4),(0.,1.),.UNSPECIFIED.);
#110=ADVANCED_FACE('',(#175,#176),#149,.T.);
#111=ADVANCED_FACE('',(#96),#94,.T.);
#112=ADVANCED_FACE('',(#177,#178),#74,.T.);
#113=ADVANCED_FACE('',(#97),#75,.T.);
#114=ADVANCED_FACE('',(#98),#76,.T.);
#115=ADVANCED_FACE('',(#99),#77,.T.);
#116=ADVANCED_FACE('',(#179,#180),#95,.F.);
#117=ADVANCED_FACE('',(#181,#182),#150,.F.);
#118=ADVANCED_FACE('',(#183,#184),#151,.T.);
#119=ADVANCED_FACE('',(#185,#186),#152,.F.);
#120=ADVANCED_FACE('',(#187,#188),#78,.T.);
#121=ADVANCED_FACE('',(#100),#79,.F.);
#122=ADVANCED_FACE('',(#189,#190),#153,.F.);
#123=ADVANCED_FACE('',(#191,#192),#80,.F.);
#124=ADVANCED_FACE('',(#193,#194),#154,.T.);
#125=ADVANCED_FACE('AS_FLANSCH',(#195,#196,#197,#198,#199,#200,#201,#202),
#81,.T.);
#126=ADVANCED_FACE('',(#203,#204),#82,.T.);
#127=ADVANCED_FACE('',(#205,#206),#155,.T.);
#128=ADVANCED_FACE('AS_ROTIEREND',(#101),#83,.T.);
#129=ADVANCED_FACE('',(#207,#208),#156,.T.);
#130=ADVANCED_FACE('',(#209,#210),#157,.T.);
#131=ADVANCED_FACE('',(#211,#212),#84,.T.);
#132=ADVANCED_FACE('',(#213,#214),#85,.F.);
#133=ADVANCED_FACE('BS_FLANSCH',(#215,#216),#86,.T.);
#134=ADVANCED_FACE('',(#217,#218),#158,.T.);
#135=ADVANCED_FACE('',(#102),#87,.F.);
#136=ADVANCED_FACE('',(#219,#220),#159,.F.);
#137=ADVANCED_FACE('',(#103),#88,.F.);
#138=ADVANCED_FACE('',(#221,#222),#160,.F.);
#139=ADVANCED_FACE('',(#104),#89,.F.);
#140=ADVANCED_FACE('',(#223,#224),#161,.F.);
#141=ADVANCED_FACE('',(#105),#90,.F.);
#142=ADVANCED_FACE('',(#225,#226),#162,.F.);
#143=ADVANCED_FACE('',(#106),#91,.F.);
#144=ADVANCED_FACE('',(#227,#228),#163,.F.);
#145=ADVANCED_FACE('',(#107),#92,.F.);
#146=ADVANCED_FACE('',(#229,#230),#164,.F.);
#147=ADVANCED_FACE('',(#231,#232),#93,.F.);
#148=ADVANCED_FACE('',(#233,#234),#165,.F.);
#149=CYLINDRICAL_SURFACE('',#511,3.);
#150=CYLINDRICAL_SURFACE('',#521,1.025);
#151=CYLINDRICAL_SURFACE('',#524,10.3999999999995);
#152=CYLINDRICAL_SURFACE('',#527,6.);
#153=CYLINDRICAL_SURFACE('',#532,5.034);
#154=CYLINDRICAL_SURFACE('',#536,11.);
#155=CYLINDRICAL_SURFACE('',#548,7.5);
#156=CYLINDRICAL_SURFACE('',#551,4.);
#157=CYLINDRICAL_SURFACE('',#554,10.9995);
#158=CYLINDRICAL_SURFACE('',#561,11.);
#159=CYLINDRICAL_SURFACE('',#564,0.8);
#160=CYLINDRICAL_SURFACE('',#567,0.8);
#161=CYLINDRICAL_SURFACE('',#570,0.8);
#162=CYLINDRICAL_SURFACE('',#573,0.8);
#163=CYLINDRICAL_SURFACE('',#576,0.8);
#164=CYLINDRICAL_SURFACE('',#579,0.8);
#165=CYLINDRICAL_SURFACE('',#582,10.5);
#166=ELLIPSE('',#510,4.24264068711929,3.);
#167=LINE('',#745,#171);
#168=LINE('',#749,#172);
#169=LINE('',#765,#173);
#170=LINE('',#768,#174);
#171=VECTOR('',#589,1.);
#172=VECTOR('',#592,1.);
#173=VECTOR('',#601,1.);
#174=VECTOR('',#606,1.);
#175=FACE_BOUND('',#235,.T.);
#176=FACE_BOUND('',#236,.T.);
#177=FACE_BOUND('',#238,.T.);
#178=FACE_BOUND('',#239,.T.);
#179=FACE_BOUND('',#243,.T.);
#180=FACE_BOUND('',#73,.T.);
#181=FACE_BOUND('',#244,.T.);
#182=FACE_BOUND('',#245,.T.);
#183=FACE_BOUND('',#246,.T.);
#184=FACE_BOUND('',#247,.T.);
#185=FACE_BOUND('',#248,.T.);
#186=FACE_BOUND('',#249,.T.);
#187=FACE_BOUND('',#250,.T.);
#188=FACE_BOUND('',#251,.T.);
#189=FACE_BOUND('',#253,.T.);
#190=FACE_BOUND('',#254,.T.);
#191=FACE_BOUND('',#255,.T.);
#192=FACE_BOUND('',#256,.T.);
#193=FACE_BOUND('',#257,.T.);
#194=FACE_BOUND('',#258,.T.);
#195=FACE_BOUND('',#259,.T.);
#196=FACE_BOUND('',#260,.T.);
#197=FACE_BOUND('',#261,.T.);
#198=FACE_BOUND('',#262,.T.);
#199=FACE_BOUND('',#263,.T.);
#200=FACE_BOUND('',#264,.T.);
#201=FACE_BOUND('',#265,.T.);
#202=FACE_BOUND('',#266,.T.);
#203=FACE_BOUND('',#267,.T.);
#204=FACE_BOUND('',#268,.T.);
#205=FACE_BOUND('',#269,.T.);
#206=FACE_BOUND('',#270,.T.);
#207=FACE_BOUND('',#272,.T.);
#208=FACE_BOUND('',#273,.T.);
#209=FACE_BOUND('',#274,.T.);
#210=FACE_BOUND('',#275,.T.);
#211=FACE_BOUND('',#276,.T.);
#212=FACE_BOUND('',#277,.T.);
#213=FACE_BOUND('',#278,.T.);
#214=FACE_BOUND('',#279,.T.);
#215=FACE_BOUND('',#280,.T.);
#216=FACE_BOUND('',#281,.T.);
#217=FACE_BOUND('',#282,.T.);
#218=FACE_BOUND('',#283,.T.);
#219=FACE_BOUND('',#285,.T.);
#220=FACE_BOUND('',#286,.T.);
#221=FACE_BOUND('',#288,.T.);
#222=FACE_BOUND('',#289,.T.);
#223=FACE_BOUND('',#291,.T.);
#224=FACE_BOUND('',#292,.T.);
#225=FACE_BOUND('',#294,.T.);
#226=FACE_BOUND('',#295,.T.);
#227=FACE_BOUND('',#297,.T.);
#228=FACE_BOUND('',#298,.T.);
#229=FACE_BOUND('',#300,.T.);
#230=FACE_BOUND('',#301,.T.);
#231=FACE_BOUND('',#302,.T.);
#232=FACE_BOUND('',#303,.T.);
#233=FACE_BOUND('',#304,.T.);
#234=FACE_BOUND('',#305,.T.);
#235=EDGE_LOOP('',(#306));
#236=EDGE_LOOP('',(#307,#308,#309,#310));
#237=EDGE_LOOP('',(#311,#312,#313,#314));
#238=EDGE_LOOP('',(#315));
#239=EDGE_LOOP('',(#316,#317));
#240=EDGE_LOOP('',(#318));
#241=EDGE_LOOP('',(#319,#320));
#242=EDGE_LOOP('',(#321,#322,#323,#324,#325,#326));
#243=EDGE_LOOP('',(#327));
#244=EDGE_LOOP('',(#328));
#245=EDGE_LOOP('',(#329));
#246=EDGE_LOOP('',(#330));
#247=EDGE_LOOP('',(#331));
#248=EDGE_LOOP('',(#332));
#249=EDGE_LOOP('',(#333));
#250=EDGE_LOOP('',(#334));
#251=EDGE_LOOP('',(#335));
#252=EDGE_LOOP('',(#336));
#253=EDGE_LOOP('',(#337));
#254=EDGE_LOOP('',(#338));
#255=EDGE_LOOP('',(#339));
#256=EDGE_LOOP('',(#340));
#257=EDGE_LOOP('',(#341));
#258=EDGE_LOOP('',(#342));
#259=EDGE_LOOP('',(#343));
#260=EDGE_LOOP('',(#344));
#261=EDGE_LOOP('',(#345));
#262=EDGE_LOOP('',(#346));
#263=EDGE_LOOP('',(#347));
#264=EDGE_LOOP('',(#348));
#265=EDGE_LOOP('',(#349));
#266=EDGE_LOOP('',(#350));
#267=EDGE_LOOP('',(#351));
#268=EDGE_LOOP('',(#352));
#269=EDGE_LOOP('',(#353));
#270=EDGE_LOOP('',(#354));
#271=EDGE_LOOP('',(#355));
#272=EDGE_LOOP('',(#356));
#273=EDGE_LOOP('',(#357));
#274=EDGE_LOOP('',(#358));
#275=EDGE_LOOP('',(#359));
#276=EDGE_LOOP('',(#360));
#277=EDGE_LOOP('',(#361));
#278=EDGE_LOOP('',(#362));
#279=EDGE_LOOP('',(#363));
#280=EDGE_LOOP('',(#364));
#281=EDGE_LOOP('',(#365));
#282=EDGE_LOOP('',(#366));
#283=EDGE_LOOP('',(#367));
#284=EDGE_LOOP('',(#368));
#285=EDGE_LOOP('',(#369));
#286=EDGE_LOOP('',(#370));
#287=EDGE_LOOP('',(#371));
#288=EDGE_LOOP('',(#372));
#289=EDGE_LOOP('',(#373));
#290=EDGE_LOOP('',(#374));
#291=EDGE_LOOP('',(#375));
#292=EDGE_LOOP('',(#376));
#293=EDGE_LOOP('',(#377));
#294=EDGE_LOOP('',(#378));
#295=EDGE_LOOP('',(#379));
#296=EDGE_LOOP('',(#380));
#297=EDGE_LOOP('',(#381));
#298=EDGE_LOOP('',(#382));
#299=EDGE_LOOP('',(#383));
#300=EDGE_LOOP('',(#384));
#301=EDGE_LOOP('',(#385));
#302=EDGE_LOOP('',(#386));
#303=EDGE_LOOP('',(#387));
#304=EDGE_LOOP('',(#388));
#305=EDGE_LOOP('',(#389));
#306=ORIENTED_EDGE('',*,*,#430,.T.);
#307=ORIENTED_EDGE('',*,*,#431,.T.);
#308=ORIENTED_EDGE('',*,*,#432,.T.);
#309=ORIENTED_EDGE('',*,*,#433,.T.);
#310=ORIENTED_EDGE('',*,*,#434,.T.);
#311=ORIENTED_EDGE('',*,*,#431,.F.);
#312=ORIENTED_EDGE('',*,*,#435,.T.);
#313=ORIENTED_EDGE('',*,*,#436,.F.);
#314=ORIENTED_EDGE('',*,*,#437,.T.);
#315=ORIENTED_EDGE('',*,*,#438,.T.);
#316=ORIENTED_EDGE('',*,*,#439,.F.);
#317=ORIENTED_EDGE('',*,*,#436,.T.);
#318=ORIENTED_EDGE('',*,*,#430,.F.);
#319=ORIENTED_EDGE('',*,*,#440,.F.);
#320=ORIENTED_EDGE('',*,*,#433,.F.);
#321=ORIENTED_EDGE('',*,*,#440,.T.);
#322=ORIENTED_EDGE('',*,*,#432,.F.);
#323=ORIENTED_EDGE('',*,*,#437,.F.);
#324=ORIENTED_EDGE('',*,*,#439,.T.);
#325=ORIENTED_EDGE('',*,*,#435,.F.);
#326=ORIENTED_EDGE('',*,*,#434,.F.);
#327=ORIENTED_EDGE('',*,*,#441,.T.);
#328=ORIENTED_EDGE('',*,*,#441,.F.);
#329=ORIENTED_EDGE('',*,*,#438,.F.);
#330=ORIENTED_EDGE('',*,*,#442,.F.);
#331=ORIENTED_EDGE('',*,*,#443,.F.);
#332=ORIENTED_EDGE('',*,*,#444,.T.);
#333=ORIENTED_EDGE('',*,*,#445,.F.);
#334=ORIENTED_EDGE('',*,*,#442,.T.);
#335=ORIENTED_EDGE('',*,*,#444,.F.);
#336=ORIENTED_EDGE('',*,*,#446,.T.);
#337=ORIENTED_EDGE('',*,*,#447,.T.);
#338=ORIENTED_EDGE('',*,*,#446,.F.);
#339=ORIENTED_EDGE('',*,*,#447,.F.);
#340=ORIENTED_EDGE('',*,*,#445,.T.);
#341=ORIENTED_EDGE('',*,*,#448,.T.);
#342=ORIENTED_EDGE('',*,*,#449,.T.);
#343=ORIENTED_EDGE('',*,*,#450,.T.);
#344=ORIENTED_EDGE('',*,*,#451,.T.);
#345=ORIENTED_EDGE('',*,*,#452,.T.);
#346=ORIENTED_EDGE('',*,*,#453,.T.);
#347=ORIENTED_EDGE('',*,*,#454,.T.);
#348=ORIENTED_EDGE('',*,*,#455,.T.);
#349=ORIENTED_EDGE('',*,*,#456,.F.);
#350=ORIENTED_EDGE('',*,*,#448,.F.);
#351=ORIENTED_EDGE('',*,*,#457,.F.);
#352=ORIENTED_EDGE('',*,*,#458,.T.);
#353=ORIENTED_EDGE('',*,*,#458,.F.);
#354=ORIENTED_EDGE('',*,*,#456,.T.);
#355=ORIENTED_EDGE('',*,*,#459,.T.);
#356=ORIENTED_EDGE('',*,*,#459,.F.);
#357=ORIENTED_EDGE('',*,*,#457,.T.);
#358=ORIENTED_EDGE('',*,*,#460,.T.);
#359=ORIENTED_EDGE('',*,*,#461,.F.);
#360=ORIENTED_EDGE('',*,*,#449,.F.);
#361=ORIENTED_EDGE('',*,*,#461,.T.);
#362=ORIENTED_EDGE('',*,*,#462,.T.);
#363=ORIENTED_EDGE('',*,*,#460,.F.);
#364=ORIENTED_EDGE('',*,*,#463,.T.);
#365=ORIENTED_EDGE('',*,*,#464,.T.);
#366=ORIENTED_EDGE('',*,*,#462,.F.);
#367=ORIENTED_EDGE('',*,*,#464,.F.);
#368=ORIENTED_EDGE('',*,*,#465,.T.);
#369=ORIENTED_EDGE('',*,*,#465,.F.);
#370=ORIENTED_EDGE('',*,*,#455,.F.);
#371=ORIENTED_EDGE('',*,*,#466,.F.);
#372=ORIENTED_EDGE('',*,*,#466,.T.);
#373=ORIENTED_EDGE('',*,*,#454,.F.);
#374=ORIENTED_EDGE('',*,*,#467,.F.);
#375=ORIENTED_EDGE('',*,*,#467,.T.);
#376=ORIENTED_EDGE('',*,*,#453,.F.);
#377=ORIENTED_EDGE('',*,*,#468,.F.);
#378=ORIENTED_EDGE('',*,*,#468,.T.);
#379=ORIENTED_EDGE('',*,*,#452,.F.);
#380=ORIENTED_EDGE('',*,*,#469,.F.);
#381=ORIENTED_EDGE('',*,*,#469,.T.);
#382=ORIENTED_EDGE('',*,*,#451,.F.);
#383=ORIENTED_EDGE('',*,*,#470,.F.);
#384=ORIENTED_EDGE('',*,*,#470,.T.);
#385=ORIENTED_EDGE('',*,*,#450,.F.);
#386=ORIENTED_EDGE('',*,*,#443,.T.);
#387=ORIENTED_EDGE('',*,*,#471,.T.);
#388=ORIENTED_EDGE('',*,*,#471,.F.);
#389=ORIENTED_EDGE('',*,*,#463,.F.);
#390=VERTEX_POINT('',#741);
#391=VERTEX_POINT('',#743);
#392=VERTEX_POINT('',#744);
#393=VERTEX_POINT('',#746);
#394=VERTEX_POINT('',#748);
#395=VERTEX_POINT('',#755);
#396=VERTEX_POINT('',#757);
#397=VERTEX_POINT('',#764);
#398=VERTEX_POINT('',#772);
#399=VERTEX_POINT('',#773);
#400=VERTEX_POINT('',#777);
#401=VERTEX_POINT('',#779);
#402=VERTEX_POINT('',#782);
#403=VERTEX_POINT('',#784);
#404=VERTEX_POINT('',#788);
#405=VERTEX_POINT('',#791);
#406=VERTEX_POINT('',#795);
#407=VERTEX_POINT('',#797);
#408=VERTEX_POINT('',#800);
#409=VERTEX_POINT('',#802);
#410=VERTEX_POINT('',#804);
#411=VERTEX_POINT('',#806);
#412=VERTEX_POINT('',#808);
#413=VERTEX_POINT('',#810);
#414=VERTEX_POINT('',#812);
#415=VERTEX_POINT('',#815);
#416=VERTEX_POINT('',#817);
#417=VERTEX_POINT('',#821);
#418=VERTEX_POINT('',#825);
#419=VERTEX_POINT('',#827);
#420=VERTEX_POINT('',#831);
#421=VERTEX_POINT('',#834);
#422=VERTEX_POINT('',#836);
#423=VERTEX_POINT('',#840);
#424=VERTEX_POINT('',#844);
#425=VERTEX_POINT('',#848);
#426=VERTEX_POINT('',#852);
#427=VERTEX_POINT('',#856);
#428=VERTEX_POINT('',#860);
#429=VERTEX_POINT('',#864);
#430=EDGE_CURVE('',#390,#390,#472,.T.);
#431=EDGE_CURVE('',#391,#392,#473,.T.);
#432=EDGE_CURVE('',#392,#393,#167,.T.);
#433=EDGE_CURVE('',#393,#394,#166,.T.);
#434=EDGE_CURVE('',#394,#391,#168,.T.);
#435=EDGE_CURVE('',#391,#395,#108,.T.);
#436=EDGE_CURVE('',#396,#395,#474,.T.);
#437=EDGE_CURVE('',#396,#392,#109,.T.);
#438=EDGE_CURVE('',#397,#397,#475,.T.);
#439=EDGE_CURVE('',#396,#395,#169,.T.);
#440=EDGE_CURVE('',#394,#393,#170,.T.);
#441=EDGE_CURVE('',#398,#398,#476,.T.);
#442=EDGE_CURVE('',#400,#400,#477,.T.);
#443=EDGE_CURVE('',#401,#401,#478,.T.);
#444=EDGE_CURVE('',#402,#402,#479,.T.);
#445=EDGE_CURVE('',#403,#403,#480,.T.);
#446=EDGE_CURVE('',#404,#404,#481,.T.);
#447=EDGE_CURVE('',#405,#405,#482,.T.);
#448=EDGE_CURVE('',#406,#406,#483,.T.);
#449=EDGE_CURVE('',#407,#407,#484,.T.);
#450=EDGE_CURVE('',#408,#408,#485,.T.);
#451=EDGE_CURVE('',#409,#409,#486,.T.);
#452=EDGE_CURVE('',#410,#410,#487,.T.);
#453=EDGE_CURVE('',#411,#411,#488,.T.);
#454=EDGE_CURVE('',#412,#412,#489,.T.);
#455=EDGE_CURVE('',#413,#413,#490,.T.);
#456=EDGE_CURVE('',#414,#414,#491,.T.);
#457=EDGE_CURVE('',#415,#415,#492,.T.);
#458=EDGE_CURVE('',#416,#416,#493,.T.);
#459=EDGE_CURVE('',#417,#417,#494,.T.);
#460=EDGE_CURVE('',#418,#418,#495,.T.);
#461=EDGE_CURVE('',#419,#419,#496,.T.);
#462=EDGE_CURVE('',#420,#420,#497,.T.);
#463=EDGE_CURVE('',#421,#421,#498,.T.);
#464=EDGE_CURVE('',#422,#422,#499,.T.);
#465=EDGE_CURVE('',#423,#423,#500,.T.);
#466=EDGE_CURVE('',#424,#424,#501,.T.);
#467=EDGE_CURVE('',#425,#425,#502,.T.);
#468=EDGE_CURVE('',#426,#426,#503,.T.);
#469=EDGE_CURVE('',#427,#427,#504,.T.);
#470=EDGE_CURVE('',#428,#428,#505,.T.);
#471=EDGE_CURVE('',#429,#429,#506,.T.);
#472=CIRCLE('',#508,3.);
#473=CIRCLE('',#509,3.);
#474=CIRCLE('',#512,2.8);
#475=CIRCLE('',#514,1.025);
#476=CIRCLE('',#519,1.025);
#477=CIRCLE('',#522,10.3999999999995);
#478=CIRCLE('',#523,10.3999999999995);
#479=CIRCLE('',#525,6.);
#480=CIRCLE('',#526,6.);
#481=CIRCLE('',#529,5.034);
#482=CIRCLE('',#531,5.034);
#483=CIRCLE('',#534,11.);
#484=CIRCLE('',#535,11.);
#485=CIRCLE('',#537,0.8);
#486=CIRCLE('',#538,0.8);
#487=CIRCLE('',#539,0.8);
#488=CIRCLE('',#540,0.8);
#489=CIRCLE('',#541,0.8);
#490=CIRCLE('',#542,0.8);
#491=CIRCLE('',#543,7.5);
#492=CIRCLE('',#545,4.);
#493=CIRCLE('',#546,7.5);
#494=CIRCLE('',#549,4.);
#495=CIRCLE('',#552,10.9995);
#496=CIRCLE('',#553,10.9995);
#497=CIRCLE('',#556,11.);
#498=CIRCLE('',#558,10.5);
#499=CIRCLE('',#559,11.);
#500=CIRCLE('',#562,0.8);
#501=CIRCLE('',#565,0.8);
#502=CIRCLE('',#568,0.8);
#503=CIRCLE('',#571,0.8);
#504=CIRCLE('',#574,0.8);
#505=CIRCLE('',#577,0.8);
#506=CIRCLE('',#580,10.5);
#507=AXIS2_PLACEMENT_3D('',#739,#583,#584);
#508=AXIS2_PLACEMENT_3D('',#740,#585,#586);
#509=AXIS2_PLACEMENT_3D('',#742,#587,#588);
#510=AXIS2_PLACEMENT_3D('',#747,#590,#591);
#511=AXIS2_PLACEMENT_3D('',#750,#593,#594);
#512=AXIS2_PLACEMENT_3D('',#756,#595,#596);
#513=AXIS2_PLACEMENT_3D('',#762,#597,#598);
#514=AXIS2_PLACEMENT_3D('',#763,#599,#600);
#515=AXIS2_PLACEMENT_3D('',#766,#602,#603);
#516=AXIS2_PLACEMENT_3D('',#767,#604,#605);
#517=AXIS2_PLACEMENT_3D('',#769,#607,#608);
#518=AXIS2_PLACEMENT_3D('',#770,#609,#610);
#519=AXIS2_PLACEMENT_3D('',#771,#611,#612);
#520=AXIS2_PLACEMENT_3D('',#774,#613,#614);
#521=AXIS2_PLACEMENT_3D('',#775,#615,#616);
#522=AXIS2_PLACEMENT_3D('',#776,#617,#618);
#523=AXIS2_PLACEMENT_3D('',#778,#619,#620);
#524=AXIS2_PLACEMENT_3D('',#780,#621,#622);
#525=AXIS2_PLACEMENT_3D('',#781,#623,#624);
#526=AXIS2_PLACEMENT_3D('',#783,#625,#626);
#527=AXIS2_PLACEMENT_3D('',#785,#627,#628);
#528=AXIS2_PLACEMENT_3D('',#786,#629,#630);
#529=AXIS2_PLACEMENT_3D('',#787,#631,#632);
#530=AXIS2_PLACEMENT_3D('',#789,#633,#634);
#531=AXIS2_PLACEMENT_3D('',#790,#635,#636);
#532=AXIS2_PLACEMENT_3D('',#792,#637,#638);
#533=AXIS2_PLACEMENT_3D('',#793,#639,#640);
#534=AXIS2_PLACEMENT_3D('',#794,#641,#642);
#535=AXIS2_PLACEMENT_3D('',#796,#643,#644);
#536=AXIS2_PLACEMENT_3D('',#798,#645,#646);
#537=AXIS2_PLACEMENT_3D('',#799,#647,#648);
#538=AXIS2_PLACEMENT_3D('',#801,#649,#650);
#539=AXIS2_PLACEMENT_3D('',#803,#651,#652);
#540=AXIS2_PLACEMENT_3D('',#805,#653,#654);
#541=AXIS2_PLACEMENT_3D('',#807,#655,#656);
#542=AXIS2_PLACEMENT_3D('',#809,#657,#658);
#543=AXIS2_PLACEMENT_3D('',#811,#659,#660);
#544=AXIS2_PLACEMENT_3D('',#813,#661,#662);
#545=AXIS2_PLACEMENT_3D('',#814,#663,#664);
#546=AXIS2_PLACEMENT_3D('',#816,#665,#666);
#547=AXIS2_PLACEMENT_3D('',#818,#667,#668);
#548=AXIS2_PLACEMENT_3D('',#819,#669,#670);
#549=AXIS2_PLACEMENT_3D('',#820,#671,#672);
#550=AXIS2_PLACEMENT_3D('',#822,#673,#674);
#551=AXIS2_PLACEMENT_3D('',#823,#675,#676);
#552=AXIS2_PLACEMENT_3D('',#824,#677,#678);
#553=AXIS2_PLACEMENT_3D('',#826,#679,#680);
#554=AXIS2_PLACEMENT_3D('',#828,#681,#682);
#555=AXIS2_PLACEMENT_3D('',#829,#683,#684);
#556=AXIS2_PLACEMENT_3D('',#830,#685,#686);
#557=AXIS2_PLACEMENT_3D('',#832,#687,#688);
#558=AXIS2_PLACEMENT_3D('',#833,#689,#690);
#559=AXIS2_PLACEMENT_3D('',#835,#691,#692);
#560=AXIS2_PLACEMENT_3D('',#837,#693,#694);
#561=AXIS2_PLACEMENT_3D('',#838,#695,#696);
#562=AXIS2_PLACEMENT_3D('',#839,#697,#698);
#563=AXIS2_PLACEMENT_3D('',#841,#699,#700);
#564=AXIS2_PLACEMENT_3D('',#842,#701,#702);
#565=AXIS2_PLACEMENT_3D('',#843,#703,#704);
#566=AXIS2_PLACEMENT_3D('',#845,#705,#706);
#567=AXIS2_PLACEMENT_3D('',#846,#707,#708);
#568=AXIS2_PLACEMENT_3D('',#847,#709,#710);
#569=AXIS2_PLACEMENT_3D('',#849,#711,#712);
#570=AXIS2_PLACEMENT_3D('',#850,#713,#714);
#571=AXIS2_PLACEMENT_3D('',#851,#715,#716);
#572=AXIS2_PLACEMENT_3D('',#853,#717,#718);
#573=AXIS2_PLACEMENT_3D('',#854,#719,#720);
#574=AXIS2_PLACEMENT_3D('',#855,#721,#722);
#575=AXIS2_PLACEMENT_3D('',#857,#723,#724);
#576=AXIS2_PLACEMENT_3D('',#858,#725,#726);
#577=AXIS2_PLACEMENT_3D('',#859,#727,#728);
#578=AXIS2_PLACEMENT_3D('',#861,#729,#730);
#579=AXIS2_PLACEMENT_3D('',#862,#731,#732);
#580=AXIS2_PLACEMENT_3D('',#863,#733,#734);
#581=AXIS2_PLACEMENT_3D('',#865,#735,#736);
#582=AXIS2_PLACEMENT_3D('',#866,#737,#738);
#583=DIRECTION('',(0.,0.,1.));
#584=DIRECTION('',(1.,0.,0.));
#585=DIRECTION('',(0.,0.,1.));
#586=DIRECTION('',(1.,0.,0.));
#587=DIRECTION('',(0.,0.,-1.));
#588=DIRECTION('',(1.,0.,0.));
#589=DIRECTION('',(0.,0.,-1.));
#590=DIRECTION('',(0.,0.707106781186548,-0.707106781186547));
#591=DIRECTION('',(0.,0.707106781186547,0.707106781186548));
#592=DIRECTION('',(0.,0.,1.));
#593=DIRECTION('',(0.,0.,1.));
#594=DIRECTION('',(1.,0.,0.));
#595=DIRECTION('',(0.,0.,1.));
#596=DIRECTION('',(1.,0.,0.));
#597=DIRECTION('',(0.,0.,-1.));
#598=DIRECTION('',(-1.,0.,0.));
#599=DIRECTION('',(0.,0.,-1.));
#600=DIRECTION('',(-1.,0.,0.));
#601=DIRECTION('',(-1.,0.,0.));
#602=DIRECTION('',(0.,0.,1.));
#603=DIRECTION('',(1.,0.,0.));
#604=DIRECTION('',(0.,0.,-1.));
#605=DIRECTION('',(-1.,0.,0.));
#606=DIRECTION('',(1.,0.,0.));
#607=DIRECTION('',(0.,-0.707106781186548,0.707106781186547));
#608=DIRECTION('',(0.,-0.707106781186547,-0.707106781186548));
#609=DIRECTION('',(0.,-1.,-2.60208521396521E-16));
#610=DIRECTION('',(0.,2.60208521396521E-16,-1.));
#611=DIRECTION('',(0.,0.,1.));
#612=DIRECTION('',(-1.,0.,0.));
#613=DIRECTION('',(0.,0.,1.));
#614=DIRECTION('',(1.,0.,5.20842733074346E-17));
#615=DIRECTION('',(0.,0.,-1.));
#616=DIRECTION('',(-1.,0.,0.));
#617=DIRECTION('',(0.,0.,-1.));
#618=DIRECTION('',(-1.,0.,0.));
#619=DIRECTION('',(0.,0.,1.));
#620=DIRECTION('',(1.,0.,0.));
#621=DIRECTION('',(0.,0.,1.));
#622=DIRECTION('',(1.,0.,0.));
#623=DIRECTION('',(0.,0.,-1.));
#624=DIRECTION('',(-1.,0.,0.));
#625=DIRECTION('',(0.,0.,-1.));
#626=DIRECTION('',(-1.,0.,0.));
#627=DIRECTION('',(0.,0.,1.));
#628=DIRECTION('',(1.,0.,0.));
#629=DIRECTION('',(0.,0.,-1.));
#630=DIRECTION('',(-1.,0.,0.));
#631=DIRECTION('',(0.,0.,-1.));
#632=DIRECTION('',(1.,0.,0.));
#633=DIRECTION('',(0.,0.,1.));
#634=DIRECTION('',(1.,0.,0.));
#635=DIRECTION('',(0.,0.,-1.));
#636=DIRECTION('',(1.,0.,0.));
#637=DIRECTION('',(0.,0.,1.));
#638=DIRECTION('',(1.,0.,0.));
#639=DIRECTION('',(0.,0.,1.));
#640=DIRECTION('',(1.,0.,0.));
#641=DIRECTION('',(0.,0.,-1.));
#642=DIRECTION('',(1.,0.,0.));
#643=DIRECTION('',(0.,0.,1.));
#644=DIRECTION('',(-1.,0.,0.));
#645=DIRECTION('',(0.,0.,-1.));
#646=DIRECTION('',(1.,0.,0.));
#647=DIRECTION('',(0.,0.,-1.));
#648=DIRECTION('',(-0.499999999999997,0.866025403784441,0.));
#649=DIRECTION('',(0.,0.,-1.));
#650=DIRECTION('',(0.500000000000003,0.866025403784437,0.));
#651=DIRECTION('',(0.,0.,-1.));
#652=DIRECTION('',(1.,-2.16840434497101E-15,0.));
#653=DIRECTION('',(0.,0.,-1.));
#654=DIRECTION('',(0.499999999999999,-0.866025403784439,0.));
#655=DIRECTION('',(0.,0.,-1.));
#656=DIRECTION('',(-0.500000000000001,-0.866025403784439,0.));
#657=DIRECTION('',(0.,0.,-1.));
#658=DIRECTION('',(-1.,0.,0.));
#659=DIRECTION('',(0.,0.,1.));
#660=DIRECTION('',(1.,0.,0.));
#661=DIRECTION('',(0.,0.,1.));
#662=DIRECTION('',(1.,0.,0.));
#663=DIRECTION('',(0.,0.,1.));
#664=DIRECTION('',(1.,0.,0.));
#665=DIRECTION('',(0.,0.,1.));
#666=DIRECTION('',(1.,0.,0.));
#667=DIRECTION('',(0.,0.,1.));
#668=DIRECTION('',(1.,0.,0.));
#669=DIRECTION('',(0.,0.,1.));
#670=DIRECTION('',(1.,0.,0.));
#671=DIRECTION('',(0.,0.,1.));
#672=DIRECTION('',(1.,0.,0.));
#673=DIRECTION('',(0.,0.,1.));
#674=DIRECTION('',(1.,0.,0.));
#675=DIRECTION('',(0.,0.,1.));
#676=DIRECTION('',(1.,0.,0.));
#677=DIRECTION('',(0.,0.,1.));
#678=DIRECTION('',(-1.,0.,0.));
#679=DIRECTION('',(0.,0.,1.));
#680=DIRECTION('',(-1.,0.,0.));
#681=DIRECTION('',(0.,0.,-1.));
#682=DIRECTION('',(-1.,0.,0.));
#683=DIRECTION('',(0.,0.,-1.));
#684=DIRECTION('',(-1.,0.,0.));
#685=DIRECTION('',(0.,0.,1.));
#686=DIRECTION('',(-1.,0.,0.));
#687=DIRECTION('',(0.,0.,-1.));
#688=DIRECTION('',(-1.,0.,0.));
#689=DIRECTION('',(0.,0.,1.));
#690=DIRECTION('',(1.,0.,0.));
#691=DIRECTION('',(0.,0.,-1.));
#692=DIRECTION('',(-1.,0.,0.));
#693=DIRECTION('',(0.,0.,-1.));
#694=DIRECTION('',(-1.,0.,0.));
#695=DIRECTION('',(0.,0.,-1.));
#696=DIRECTION('',(1.,0.,0.));
#697=DIRECTION('',(0.,0.,1.));
#698=DIRECTION('',(-1.,0.,0.));
#699=DIRECTION('',(0.,0.,-1.));
#700=DIRECTION('',(-1.,0.,0.));
#701=DIRECTION('',(0.,0.,-1.));
#702=DIRECTION('',(-1.,0.,0.));
#703=DIRECTION('',(0.,0.,-1.));
#704=DIRECTION('',(-0.500000000000001,-0.866025403784439,0.));
#705=DIRECTION('',(0.,0.,-1.));
#706=DIRECTION('',(-0.500000000000001,-0.866025403784438,0.));
#707=DIRECTION('',(0.,0.,-1.));
#708=DIRECTION('',(-0.500000000000001,-0.866025403784439,0.));
#709=DIRECTION('',(0.,0.,-1.));
#710=DIRECTION('',(0.499999999999999,-0.866025403784439,0.));
#711=DIRECTION('',(0.,0.,-1.));
#712=DIRECTION('',(0.499999999999999,-0.866025403784439,0.));
#713=DIRECTION('',(0.,0.,-1.));
#714=DIRECTION('',(0.499999999999999,-0.866025403784439,0.));
#715=DIRECTION('',(0.,0.,-1.));
#716=DIRECTION('',(1.,-2.16840434497101E-15,0.));
#717=DIRECTION('',(0.,0.,-1.));
#718=DIRECTION('',(1.,-2.34361141604467E-15,0.));
#719=DIRECTION('',(0.,0.,-1.));
#720=DIRECTION('',(1.,-2.16840434497101E-15,0.));
#721=DIRECTION('',(0.,0.,-1.));
#722=DIRECTION('',(0.500000000000003,0.866025403784437,0.));
#723=DIRECTION('',(0.,0.,-1.));
#724=DIRECTION('',(0.500000000000003,0.866025403784437,0.));
#725=DIRECTION('',(0.,0.,-1.));
#726=DIRECTION('',(0.500000000000003,0.866025403784437,0.));
#727=DIRECTION('',(0.,0.,-1.));
#728=DIRECTION('',(-0.499999999999997,0.866025403784441,0.));
#729=DIRECTION('',(0.,0.,-1.));
#730=DIRECTION('',(-0.499999999999996,0.866025403784441,0.));
#731=DIRECTION('',(0.,0.,-1.));
#732=DIRECTION('',(-0.499999999999997,0.866025403784441,0.));
#733=DIRECTION('',(0.,0.,-1.));
#734=DIRECTION('',(1.,0.,0.));
#735=DIRECTION('',(0.,0.,1.));
#736=DIRECTION('',(1.,0.,0.));
#737=DIRECTION('',(0.,0.,1.));
#738=DIRECTION('',(1.,0.,0.));
#739=CARTESIAN_POINT('',(0.,0.,0.));
#740=CARTESIAN_POINT('',(0.,0.,0.));
#741=CARTESIAN_POINT('',(3.,0.,0.));
#742=CARTESIAN_POINT('',(0.,0.,16.1));
#743=CARTESIAN_POINT('',(-1.79999999999999,-2.40000000000001,16.1));
#744=CARTESIAN_POINT('',(1.79999999999999,-2.40000000000001,16.1));
#745=CARTESIAN_POINT('',(1.8,-2.4,-6.24500451351651E-16));
#746=CARTESIAN_POINT('',(1.8,-2.4,6.30000000000001));
#747=CARTESIAN_POINT('',(0.,0.,8.70000000000001));
#748=CARTESIAN_POINT('',(-1.8,-2.4,6.30000000000001));
#749=CARTESIAN_POINT('',(-1.8,-2.4,-6.24500451351651E-16));
#750=CARTESIAN_POINT('',(0.,0.,0.));
#751=CARTESIAN_POINT('',(-1.79999999999999,-2.40000000000001,16.1));
#752=CARTESIAN_POINT('',(-1.68259020094673,-2.40000000000001,16.170445879432));
#753=CARTESIAN_POINT('',(-1.56352832448062,-2.40000000000001,16.2375169222064));
#754=CARTESIAN_POINT('',(-1.4422205101855,-2.40000000000001,16.3));
#755=CARTESIAN_POINT('',(-1.44222051018548,-2.40000000000001,16.3));
#756=CARTESIAN_POINT('',(0.,0.,16.3));
#757=CARTESIAN_POINT('',(1.44222051018548,-2.40000000000001,16.3));
#758=CARTESIAN_POINT('',(1.44222051018555,-2.40000000000001,16.3000000000001));
#759=CARTESIAN_POINT('',(1.56378338582416,-2.40000000000001,16.2373855455276));
#760=CARTESIAN_POINT('',(1.68281231600008,-2.40000000000001,16.1703126104));
#761=CARTESIAN_POINT('',(1.79999999999999,-2.40000000000001,16.1));
#762=CARTESIAN_POINT('',(0.,0.,16.1));
#763=CARTESIAN_POINT('',(0.,0.,16.3));
#764=CARTESIAN_POINT('',(-1.025,0.,16.3));
#765=CARTESIAN_POINT('',(3.,-2.40000000000001,16.3));
#766=CARTESIAN_POINT('',(0.,0.,16.3));
#767=CARTESIAN_POINT('',(0.,0.,0.));
#768=CARTESIAN_POINT('',(0.,-2.4,6.30000000000001));
#769=CARTESIAN_POINT('',(0.,-2.4,6.30000000000001));
#770=CARTESIAN_POINT('',(3.,-2.4,6.3));
#771=CARTESIAN_POINT('',(0.,0.,11.3));
#772=CARTESIAN_POINT('',(-1.025,0.,11.3));
#773=CARTESIAN_POINT('',(0.,0.,10.6841178654968));
#774=CARTESIAN_POINT('',(0.,0.,11.3));
#775=CARTESIAN_POINT('',(0.,0.,16.3));
#776=CARTESIAN_POINT('',(0.,0.,-23.25));
#777=CARTESIAN_POINT('',(-10.3999999999995,0.,-23.25));
#778=CARTESIAN_POINT('',(0.,0.,-23.2));
#779=CARTESIAN_POINT('',(10.3999999999995,0.,-23.2));
#780=CARTESIAN_POINT('',(0.,0.,-23.25));
#781=CARTESIAN_POINT('',(0.,0.,-23.25));
#782=CARTESIAN_POINT('',(-6.,0.,-23.25));
#783=CARTESIAN_POINT('',(0.,0.,-22.05));
#784=CARTESIAN_POINT('',(-6.,0.,-22.05));
#785=CARTESIAN_POINT('',(0.,0.,-23.25));
#786=CARTESIAN_POINT('',(0.,0.,-23.25));
#787=CARTESIAN_POINT('',(0.,-3.3881317890172E-18,-17.3));
#788=CARTESIAN_POINT('',(5.034,-3.3881317890172E-18,-17.3));
#789=CARTESIAN_POINT('',(0.,-3.3881317890172E-18,-17.3));
#790=CARTESIAN_POINT('',(0.,-3.3881317890172E-18,-22.05));
#791=CARTESIAN_POINT('',(5.034,-3.3881317890172E-18,-22.05));
#792=CARTESIAN_POINT('',(0.,-3.3881317890172E-18,-24.5));
#793=CARTESIAN_POINT('',(0.,-3.3881317890172E-18,-22.05));
#794=CARTESIAN_POINT('',(0.,0.,0.));
#795=CARTESIAN_POINT('',(11.,0.,0.));
#796=CARTESIAN_POINT('',(0.,0.,-4.7999));
#797=CARTESIAN_POINT('',(-11.,0.,-4.7999));
#798=CARTESIAN_POINT('',(0.,0.,0.));
#799=CARTESIAN_POINT('',(8.22724133595219,4.74999999999996,0.));
#800=CARTESIAN_POINT('',(7.82724133595219,5.44282032302752,0.));
#801=CARTESIAN_POINT('',(8.22724133595215,-4.75000000000002,0.));
#802=CARTESIAN_POINT('',(8.62724133595215,-4.05717967697248,0.));
#803=CARTESIAN_POINT('',(-2.2257651927068E-14,-9.5,0.));
#804=CARTESIAN_POINT('',(0.799999999999978,-9.5,0.));
#805=CARTESIAN_POINT('',(-8.22724133595217,-4.74999999999999,0.));
#806=CARTESIAN_POINT('',(-7.82724133595217,-5.44282032302754,0.));
#807=CARTESIAN_POINT('',(-8.22724133595216,4.75000000000001,0.));
#808=CARTESIAN_POINT('',(-8.62724133595216,4.05717967697245,0.));
#809=CARTESIAN_POINT('',(0.,9.5,0.));
#810=CARTESIAN_POINT('',(-0.8,9.5,0.));
#811=CARTESIAN_POINT('',(0.,-8.67361737988404E-16,0.));
#812=CARTESIAN_POINT('',(7.5,-8.67361737988404E-16,0.));
#813=CARTESIAN_POINT('',(0.,0.,0.));
#814=CARTESIAN_POINT('',(4.33680868994202E-16,-1.30104260698261E-15,1.5));
#815=CARTESIAN_POINT('',(4.,-1.30104260698261E-15,1.5));
#816=CARTESIAN_POINT('',(0.,-8.67361737988404E-16,1.5));
#817=CARTESIAN_POINT('',(7.5,-8.67361737988404E-16,1.5));
#818=CARTESIAN_POINT('',(0.,-8.67361737988404E-16,1.5));
#819=CARTESIAN_POINT('',(0.,-8.67361737988404E-16,0.));
#820=CARTESIAN_POINT('',(4.33680868994202E-16,-1.30104260698261E-15,3.1));
#821=CARTESIAN_POINT('',(4.,-1.30104260698261E-15,3.1));
#822=CARTESIAN_POINT('',(4.33680868994202E-16,-1.30104260698261E-15,3.1));
#823=CARTESIAN_POINT('',(4.33680868994202E-16,-1.30104260698261E-15,1.5));
#824=CARTESIAN_POINT('',(0.,0.,-4.8));
#825=CARTESIAN_POINT('',(-10.9995,0.,-4.8));
#826=CARTESIAN_POINT('',(0.,0.,-4.7999));
#827=CARTESIAN_POINT('',(-10.9995,0.,-4.7999));
#828=CARTESIAN_POINT('',(0.,0.,-4.79995));
#829=CARTESIAN_POINT('',(0.,0.,-4.7999));
#830=CARTESIAN_POINT('',(0.,0.,-4.8));
#831=CARTESIAN_POINT('',(-11.,0.,-4.8));
#832=CARTESIAN_POINT('',(0.,0.,-4.8));
#833=CARTESIAN_POINT('',(0.,-3.3881317890172E-18,-24.5));
#834=CARTESIAN_POINT('',(10.5,-3.3881317890172E-18,-24.5));
#835=CARTESIAN_POINT('',(0.,-3.3881317890172E-18,-24.5));
#836=CARTESIAN_POINT('',(-11.,-3.3881317890172E-18,-24.5));
#837=CARTESIAN_POINT('',(0.,-3.3881317890172E-18,-24.5));
#838=CARTESIAN_POINT('',(0.,0.,0.));
#839=CARTESIAN_POINT('',(0.,9.5,-3.));
#840=CARTESIAN_POINT('',(-0.8,9.5,-3.));
#841=CARTESIAN_POINT('',(0.,9.5,-3.));
#842=CARTESIAN_POINT('',(0.,9.5,0.));
#843=CARTESIAN_POINT('',(-8.22724133595216,4.75000000000001,-3.));
#844=CARTESIAN_POINT('',(-8.62724133595216,4.05717967697245,-3.));
#845=CARTESIAN_POINT('',(-8.22724133595216,4.75000000000001,-3.));
#846=CARTESIAN_POINT('',(-8.22724133595216,4.75000000000001,0.));
#847=CARTESIAN_POINT('',(-8.22724133595217,-4.74999999999999,-3.));
#848=CARTESIAN_POINT('',(-7.82724133595217,-5.44282032302754,-3.));
#849=CARTESIAN_POINT('',(-8.22724133595217,-4.74999999999999,-3.));
#850=CARTESIAN_POINT('',(-8.22724133595217,-4.74999999999999,0.));
#851=CARTESIAN_POINT('',(-2.2257651927068E-14,-9.5,-3.));
#852=CARTESIAN_POINT('',(0.799999999999978,-9.5,-3.));
#853=CARTESIAN_POINT('',(-2.2257651927068E-14,-9.5,-3.));
#854=CARTESIAN_POINT('',(-2.2257651927068E-14,-9.5,0.));
#855=CARTESIAN_POINT('',(8.22724133595215,-4.75000000000002,-3.));
#856=CARTESIAN_POINT('',(8.62724133595215,-4.05717967697248,-3.));
#857=CARTESIAN_POINT('',(8.22724133595215,-4.75000000000002,-3.));
#858=CARTESIAN_POINT('',(8.22724133595215,-4.75000000000002,0.));
#859=CARTESIAN_POINT('',(8.22724133595219,4.74999999999996,-3.));
#860=CARTESIAN_POINT('',(7.82724133595219,5.44282032302752,-3.));
#861=CARTESIAN_POINT('',(8.22724133595219,4.74999999999996,-3.));
#862=CARTESIAN_POINT('',(8.22724133595219,4.74999999999996,0.));
#863=CARTESIAN_POINT('',(0.,-3.3881317890172E-18,-23.2));
#864=CARTESIAN_POINT('',(10.5,-3.3881317890172E-18,-23.2));
#865=CARTESIAN_POINT('',(0.,-3.3881317890172E-18,-23.2));
#866=CARTESIAN_POINT('',(0.,-3.3881317890172E-18,-24.5));
#867=MECHANICAL_DESIGN_GEOMETRIC_PRESENTATION_REPRESENTATION('',(#30,#23,
#31,#24,#25,#26),#868);
#868=(
GEOMETRIC_REPRESENTATION_CONTEXT(3)
GLOBAL_UNCERTAINTY_ASSIGNED_CONTEXT((#869))
GLOBAL_UNIT_ASSIGNED_CONTEXT((#875,#871,#870))
REPRESENTATION_CONTEXT('F0013963500-A-P2016.038',
'TOP_LEVEL_ASSEMBLY_PART')
);
#869=UNCERTAINTY_MEASURE_WITH_UNIT(LENGTH_MEASURE(0.0508),#875,
'DISTANCE_ACCURACY_VALUE','Maximum Tolerance applied to model');
#870=(
NAMED_UNIT(*)
SI_UNIT($,.STERADIAN.)
SOLID_ANGLE_UNIT()
);
#871=(
CONVERSION_BASED_UNIT('DEGREE',#873)
NAMED_UNIT(#872)
PLANE_ANGLE_UNIT()
);
#872=DIMENSIONAL_EXPONENTS(0.,0.,0.,0.,0.,0.,0.);
#873=PLANE_ANGLE_MEASURE_WITH_UNIT(PLANE_ANGLE_MEASURE(0.0174532925),#874);
#874=(
NAMED_UNIT(*)
PLANE_ANGLE_UNIT()
SI_UNIT($,.RADIAN.)
);
#875=(
LENGTH_UNIT()
NAMED_UNIT(*)
SI_UNIT(.MILLI.,.METRE.)
);
ENDSEC;
END-ISO-10303-21;
