ISO-10303-21;
HEADER;
/* Generated by software containing ST-Developer
 * from STEP Tools, Inc. (www.steptools.com) 
 */

FILE_DESCRIPTION(
/* description */ (''),
/* implementation_level */ '2;1');

FILE_NAME(
/* name */ 
'C:\\Users\\Kacper\\MATLAB\\Projects\\release-mechanism-simulation\\st
ep_files\\complete3\\\\HALTER_LINKS_ipt_c68a0a34.STEP',
/* time_stamp */ '2021-01-02T23:39:41+01:00',
/* author */ ('Kacper'),
/* organization */ (''),
/* preprocessor_version */ 'ST-DEVELOPER v18.1',
/* originating_system */ 'Autodesk Inventor 2021',
/* authorisation */ '');

FILE_SCHEMA (('AUTOMOTIVE_DESIGN { 1 0 10303 214 3 1 1 }'));
ENDSEC;

DATA;
#10=MECHANICAL_DESIGN_GEOMETRIC_PRESENTATION_REPRESENTATION('',(#13),#798);
#11=SHAPE_REPRESENTATION_RELATIONSHIP('SRR','None',#805,#12);
#12=ADVANCED_BREP_SHAPE_REPRESENTATION('',(#14),#797);
#13=STYLED_ITEM('',(#814),#14);
#14=MANIFOLD_SOLID_BREP('Solid1',#473);
#15=FACE_BOUND('',#80,.T.);
#16=FACE_BOUND('',#81,.T.);
#17=FACE_BOUND('',#82,.T.);
#18=FACE_BOUND('',#83,.T.);
#19=FACE_BOUND('',#85,.T.);
#20=FACE_BOUND('',#87,.T.);
#21=FACE_BOUND('',#94,.T.);
#22=FACE_BOUND('',#95,.T.);
#23=FACE_BOUND('',#96,.T.);
#24=FACE_BOUND('',#97,.T.);
#25=FACE_BOUND('',#100,.T.);
#26=FACE_BOUND('',#101,.T.);
#27=PLANE('',#511);
#28=PLANE('',#515);
#29=PLANE('',#516);
#30=PLANE('',#517);
#31=PLANE('',#521);
#32=PLANE('',#522);
#33=PLANE('',#523);
#34=PLANE('',#524);
#35=PLANE('',#526);
#36=PLANE('',#527);
#37=PLANE('',#528);
#38=PLANE('',#529);
#39=PLANE('',#532);
#40=PLANE('',#533);
#41=PLANE('',#534);
#42=FACE_OUTER_BOUND('',#66,.T.);
#43=FACE_OUTER_BOUND('',#67,.T.);
#44=FACE_OUTER_BOUND('',#68,.T.);
#45=FACE_OUTER_BOUND('',#69,.T.);
#46=FACE_OUTER_BOUND('',#70,.T.);
#47=FACE_OUTER_BOUND('',#71,.T.);
#48=FACE_OUTER_BOUND('',#72,.T.);
#49=FACE_OUTER_BOUND('',#73,.T.);
#50=FACE_OUTER_BOUND('',#74,.T.);
#51=FACE_OUTER_BOUND('',#75,.T.);
#52=FACE_OUTER_BOUND('',#76,.T.);
#53=FACE_OUTER_BOUND('',#77,.T.);
#54=FACE_OUTER_BOUND('',#78,.T.);
#55=FACE_OUTER_BOUND('',#79,.T.);
#56=FACE_OUTER_BOUND('',#84,.T.);
#57=FACE_OUTER_BOUND('',#86,.T.);
#58=FACE_OUTER_BOUND('',#88,.T.);
#59=FACE_OUTER_BOUND('',#89,.T.);
#60=FACE_OUTER_BOUND('',#90,.T.);
#61=FACE_OUTER_BOUND('',#91,.T.);
#62=FACE_OUTER_BOUND('',#92,.T.);
#63=FACE_OUTER_BOUND('',#93,.T.);
#64=FACE_OUTER_BOUND('',#98,.T.);
#65=FACE_OUTER_BOUND('',#99,.T.);
#66=EDGE_LOOP('',(#314,#315,#316,#317));
#67=EDGE_LOOP('',(#318,#319,#320,#321));
#68=EDGE_LOOP('',(#322,#323,#324,#325));
#69=EDGE_LOOP('',(#326,#327,#328,#329));
#70=EDGE_LOOP('',(#330,#331,#332,#333));
#71=EDGE_LOOP('',(#334,#335,#336,#337));
#72=EDGE_LOOP('',(#338,#339,#340,#341));
#73=EDGE_LOOP('',(#342,#343,#344,#345));
#74=EDGE_LOOP('',(#346,#347,#348,#349));
#75=EDGE_LOOP('',(#350,#351,#352,#353));
#76=EDGE_LOOP('',(#354,#355,#356,#357));
#77=EDGE_LOOP('',(#358,#359,#360,#361));
#78=EDGE_LOOP('',(#362,#363,#364,#365));
#79=EDGE_LOOP('',(#366,#367,#368,#369,#370,#371,#372,#373));
#80=EDGE_LOOP('',(#374));
#81=EDGE_LOOP('',(#375));
#82=EDGE_LOOP('',(#376));
#83=EDGE_LOOP('',(#377));
#84=EDGE_LOOP('',(#378,#379,#380,#381));
#85=EDGE_LOOP('',(#382));
#86=EDGE_LOOP('',(#383,#384,#385,#386,#387));
#87=EDGE_LOOP('',(#388));
#88=EDGE_LOOP('',(#389,#390,#391,#392));
#89=EDGE_LOOP('',(#393,#394,#395,#396,#397,#398));
#90=EDGE_LOOP('',(#399,#400,#401,#402));
#91=EDGE_LOOP('',(#403,#404,#405,#406));
#92=EDGE_LOOP('',(#407,#408,#409,#410));
#93=EDGE_LOOP('',(#411,#412,#413,#414,#415,#416,#417,#418,#419,#420,#421));
#94=EDGE_LOOP('',(#422));
#95=EDGE_LOOP('',(#423));
#96=EDGE_LOOP('',(#424));
#97=EDGE_LOOP('',(#425));
#98=EDGE_LOOP('',(#426,#427,#428,#429,#430));
#99=EDGE_LOOP('',(#431,#432,#433,#434,#435,#436,#437));
#100=EDGE_LOOP('',(#438));
#101=EDGE_LOOP('',(#439));
#102=LINE('',#671,#147);
#103=LINE('',#677,#148);
#104=LINE('',#683,#149);
#105=LINE('',#689,#150);
#106=LINE('',#695,#151);
#107=LINE('',#701,#152);
#108=LINE('',#706,#153);
#109=LINE('',#708,#154);
#110=LINE('',#710,#155);
#111=LINE('',#711,#156);
#112=LINE('',#716,#157);
#113=LINE('',#720,#158);
#114=LINE('',#722,#159);
#115=LINE('',#723,#160);
#116=LINE('',#726,#161);
#117=LINE('',#728,#162);
#118=LINE('',#729,#163);
#119=LINE('',#732,#164);
#120=LINE('',#734,#165);
#121=LINE('',#735,#166);
#122=LINE('',#740,#167);
#123=LINE('',#744,#168);
#124=LINE('',#746,#169);
#125=LINE('',#747,#170);
#126=LINE('',#749,#171);
#127=LINE('',#752,#172);
#128=LINE('',#754,#173);
#129=LINE('',#755,#174);
#130=LINE('',#758,#175);
#131=LINE('',#762,#176);
#132=LINE('',#764,#177);
#133=LINE('',#765,#178);
#134=LINE('',#768,#179);
#135=LINE('',#770,#180);
#136=LINE('',#771,#181);
#137=LINE('',#774,#182);
#138=LINE('',#775,#183);
#139=LINE('',#778,#184);
#140=LINE('',#779,#185);
#141=LINE('',#782,#186);
#142=LINE('',#783,#187);
#143=LINE('',#786,#188);
#144=LINE('',#790,#189);
#145=LINE('',#791,#190);
#146=LINE('',#793,#191);
#147=VECTOR('',#541,3.25);
#148=VECTOR('',#548,3.25);
#149=VECTOR('',#555,4.5);
#150=VECTOR('',#562,4.5);
#151=VECTOR('',#569,4.5);
#152=VECTOR('',#576,4.5);
#153=VECTOR('',#581,32.2842712474619);
#154=VECTOR('',#582,6.);
#155=VECTOR('',#583,32.2842712474619);
#156=VECTOR('',#584,6.);
#157=VECTOR('',#589,6.);
#158=VECTOR('',#594,38.3431457505076);
#159=VECTOR('',#595,6.);
#160=VECTOR('',#596,38.3431457505076);
#161=VECTOR('',#599,90.);
#162=VECTOR('',#600,6.);
#163=VECTOR('',#601,90.);
#164=VECTOR('',#604,38.3431457505076);
#165=VECTOR('',#605,6.);
#166=VECTOR('',#606,38.3431457505076);
#167=VECTOR('',#611,6.);
#168=VECTOR('',#616,32.2842712474619);
#169=VECTOR('',#617,6.);
#170=VECTOR('',#618,32.2842712474619);
#171=VECTOR('',#621,138.);
#172=VECTOR('',#624,27.);
#173=VECTOR('',#625,138.);
#174=VECTOR('',#626,27.0000000000001);
#175=VECTOR('',#629,28.3);
#176=VECTOR('',#632,23.);
#177=VECTOR('',#633,24.3);
#178=VECTOR('',#634,27.);
#179=VECTOR('',#637,6.);
#180=VECTOR('',#638,138.);
#181=VECTOR('',#639,6.);
#182=VECTOR('',#642,6.);
#183=VECTOR('',#643,60.);
#184=VECTOR('',#646,6.);
#185=VECTOR('',#647,24.3);
#186=VECTOR('',#650,6.);
#187=VECTOR('',#651,23.);
#188=VECTOR('',#654,6.);
#189=VECTOR('',#659,6.);
#190=VECTOR('',#660,109.7);
#191=VECTOR('',#663,33.0000000000001);
#192=CIRCLE('',#494,3.25);
#193=CIRCLE('',#495,3.25);
#194=CIRCLE('',#497,3.25);
#195=CIRCLE('',#498,3.25);
#196=CIRCLE('',#500,4.5);
#197=CIRCLE('',#501,4.5);
#198=CIRCLE('',#503,4.5);
#199=CIRCLE('',#504,4.5);
#200=CIRCLE('',#506,4.5);
#201=CIRCLE('',#507,4.5);
#202=CIRCLE('',#509,4.5);
#203=CIRCLE('',#510,4.5);
#204=CIRCLE('',#513,4.);
#205=CIRCLE('',#514,4.);
#206=CIRCLE('',#519,4.);
#207=CIRCLE('',#520,4.);
#208=CIRCLE('',#525,4.);
#209=CIRCLE('',#531,4.);
#210=VERTEX_POINT('',#668);
#211=VERTEX_POINT('',#670);
#212=VERTEX_POINT('',#674);
#213=VERTEX_POINT('',#676);
#214=VERTEX_POINT('',#680);
#215=VERTEX_POINT('',#682);
#216=VERTEX_POINT('',#686);
#217=VERTEX_POINT('',#688);
#218=VERTEX_POINT('',#692);
#219=VERTEX_POINT('',#694);
#220=VERTEX_POINT('',#698);
#221=VERTEX_POINT('',#700);
#222=VERTEX_POINT('',#704);
#223=VERTEX_POINT('',#705);
#224=VERTEX_POINT('',#707);
#225=VERTEX_POINT('',#709);
#226=VERTEX_POINT('',#713);
#227=VERTEX_POINT('',#715);
#228=VERTEX_POINT('',#719);
#229=VERTEX_POINT('',#721);
#230=VERTEX_POINT('',#725);
#231=VERTEX_POINT('',#727);
#232=VERTEX_POINT('',#731);
#233=VERTEX_POINT('',#733);
#234=VERTEX_POINT('',#737);
#235=VERTEX_POINT('',#739);
#236=VERTEX_POINT('',#743);
#237=VERTEX_POINT('',#745);
#238=VERTEX_POINT('',#751);
#239=VERTEX_POINT('',#753);
#240=VERTEX_POINT('',#757);
#241=VERTEX_POINT('',#759);
#242=VERTEX_POINT('',#761);
#243=VERTEX_POINT('',#763);
#244=VERTEX_POINT('',#767);
#245=VERTEX_POINT('',#769);
#246=VERTEX_POINT('',#773);
#247=VERTEX_POINT('',#777);
#248=VERTEX_POINT('',#781);
#249=VERTEX_POINT('',#785);
#250=VERTEX_POINT('',#789);
#251=EDGE_CURVE('',#210,#210,#192,.T.);
#252=EDGE_CURVE('',#210,#211,#102,.T.);
#253=EDGE_CURVE('',#211,#211,#193,.T.);
#254=EDGE_CURVE('',#212,#212,#194,.T.);
#255=EDGE_CURVE('',#212,#213,#103,.T.);
#256=EDGE_CURVE('',#213,#213,#195,.T.);
#257=EDGE_CURVE('',#214,#214,#196,.T.);
#258=EDGE_CURVE('',#214,#215,#104,.T.);
#259=EDGE_CURVE('',#215,#215,#197,.T.);
#260=EDGE_CURVE('',#216,#216,#198,.T.);
#261=EDGE_CURVE('',#216,#217,#105,.T.);
#262=EDGE_CURVE('',#217,#217,#199,.T.);
#263=EDGE_CURVE('',#218,#218,#200,.T.);
#264=EDGE_CURVE('',#218,#219,#106,.T.);
#265=EDGE_CURVE('',#219,#219,#201,.T.);
#266=EDGE_CURVE('',#220,#220,#202,.T.);
#267=EDGE_CURVE('',#220,#221,#107,.T.);
#268=EDGE_CURVE('',#221,#221,#203,.T.);
#269=EDGE_CURVE('',#222,#223,#108,.T.);
#270=EDGE_CURVE('',#224,#223,#109,.T.);
#271=EDGE_CURVE('',#225,#224,#110,.T.);
#272=EDGE_CURVE('',#222,#225,#111,.T.);
#273=EDGE_CURVE('',#223,#226,#204,.T.);
#274=EDGE_CURVE('',#227,#226,#112,.T.);
#275=EDGE_CURVE('',#224,#227,#205,.T.);
#276=EDGE_CURVE('',#226,#228,#113,.T.);
#277=EDGE_CURVE('',#229,#228,#114,.T.);
#278=EDGE_CURVE('',#227,#229,#115,.T.);
#279=EDGE_CURVE('',#228,#230,#116,.T.);
#280=EDGE_CURVE('',#231,#230,#117,.T.);
#281=EDGE_CURVE('',#229,#231,#118,.T.);
#282=EDGE_CURVE('',#230,#232,#119,.T.);
#283=EDGE_CURVE('',#233,#232,#120,.T.);
#284=EDGE_CURVE('',#231,#233,#121,.T.);
#285=EDGE_CURVE('',#232,#234,#206,.T.);
#286=EDGE_CURVE('',#235,#234,#122,.T.);
#287=EDGE_CURVE('',#233,#235,#207,.T.);
#288=EDGE_CURVE('',#234,#236,#123,.T.);
#289=EDGE_CURVE('',#237,#236,#124,.T.);
#290=EDGE_CURVE('',#235,#237,#125,.T.);
#291=EDGE_CURVE('',#236,#222,#126,.T.);
#292=EDGE_CURVE('',#238,#222,#127,.T.);
#293=EDGE_CURVE('',#239,#238,#128,.T.);
#294=EDGE_CURVE('',#236,#239,#129,.T.);
#295=EDGE_CURVE('',#225,#240,#130,.T.);
#296=EDGE_CURVE('',#241,#240,#208,.T.);
#297=EDGE_CURVE('',#242,#241,#131,.T.);
#298=EDGE_CURVE('',#243,#242,#132,.T.);
#299=EDGE_CURVE('',#225,#243,#133,.T.);
#300=EDGE_CURVE('',#244,#238,#134,.T.);
#301=EDGE_CURVE('',#245,#244,#135,.T.);
#302=EDGE_CURVE('',#245,#239,#136,.T.);
#303=EDGE_CURVE('',#246,#243,#137,.T.);
#304=EDGE_CURVE('',#244,#246,#138,.T.);
#305=EDGE_CURVE('',#247,#242,#139,.T.);
#306=EDGE_CURVE('',#246,#247,#140,.T.);
#307=EDGE_CURVE('',#248,#241,#141,.T.);
#308=EDGE_CURVE('',#247,#248,#142,.T.);
#309=EDGE_CURVE('',#249,#240,#143,.T.);
#310=EDGE_CURVE('',#248,#249,#209,.T.);
#311=EDGE_CURVE('',#250,#237,#144,.T.);
#312=EDGE_CURVE('',#249,#250,#145,.T.);
#313=EDGE_CURVE('',#250,#245,#146,.T.);
#314=ORIENTED_EDGE('',*,*,#251,.T.);
#315=ORIENTED_EDGE('',*,*,#252,.T.);
#316=ORIENTED_EDGE('',*,*,#253,.T.);
#317=ORIENTED_EDGE('',*,*,#252,.F.);
#318=ORIENTED_EDGE('',*,*,#254,.T.);
#319=ORIENTED_EDGE('',*,*,#255,.T.);
#320=ORIENTED_EDGE('',*,*,#256,.T.);
#321=ORIENTED_EDGE('',*,*,#255,.F.);
#322=ORIENTED_EDGE('',*,*,#257,.F.);
#323=ORIENTED_EDGE('',*,*,#258,.T.);
#324=ORIENTED_EDGE('',*,*,#259,.T.);
#325=ORIENTED_EDGE('',*,*,#258,.F.);
#326=ORIENTED_EDGE('',*,*,#260,.F.);
#327=ORIENTED_EDGE('',*,*,#261,.T.);
#328=ORIENTED_EDGE('',*,*,#262,.T.);
#329=ORIENTED_EDGE('',*,*,#261,.F.);
#330=ORIENTED_EDGE('',*,*,#263,.F.);
#331=ORIENTED_EDGE('',*,*,#264,.T.);
#332=ORIENTED_EDGE('',*,*,#265,.T.);
#333=ORIENTED_EDGE('',*,*,#264,.F.);
#334=ORIENTED_EDGE('',*,*,#266,.F.);
#335=ORIENTED_EDGE('',*,*,#267,.T.);
#336=ORIENTED_EDGE('',*,*,#268,.T.);
#337=ORIENTED_EDGE('',*,*,#267,.F.);
#338=ORIENTED_EDGE('',*,*,#269,.T.);
#339=ORIENTED_EDGE('',*,*,#270,.F.);
#340=ORIENTED_EDGE('',*,*,#271,.F.);
#341=ORIENTED_EDGE('',*,*,#272,.F.);
#342=ORIENTED_EDGE('',*,*,#273,.T.);
#343=ORIENTED_EDGE('',*,*,#274,.F.);
#344=ORIENTED_EDGE('',*,*,#275,.F.);
#345=ORIENTED_EDGE('',*,*,#270,.T.);
#346=ORIENTED_EDGE('',*,*,#276,.T.);
#347=ORIENTED_EDGE('',*,*,#277,.F.);
#348=ORIENTED_EDGE('',*,*,#278,.F.);
#349=ORIENTED_EDGE('',*,*,#274,.T.);
#350=ORIENTED_EDGE('',*,*,#279,.T.);
#351=ORIENTED_EDGE('',*,*,#280,.F.);
#352=ORIENTED_EDGE('',*,*,#281,.F.);
#353=ORIENTED_EDGE('',*,*,#277,.T.);
#354=ORIENTED_EDGE('',*,*,#282,.T.);
#355=ORIENTED_EDGE('',*,*,#283,.F.);
#356=ORIENTED_EDGE('',*,*,#284,.F.);
#357=ORIENTED_EDGE('',*,*,#280,.T.);
#358=ORIENTED_EDGE('',*,*,#285,.T.);
#359=ORIENTED_EDGE('',*,*,#286,.F.);
#360=ORIENTED_EDGE('',*,*,#287,.F.);
#361=ORIENTED_EDGE('',*,*,#283,.T.);
#362=ORIENTED_EDGE('',*,*,#288,.T.);
#363=ORIENTED_EDGE('',*,*,#289,.F.);
#364=ORIENTED_EDGE('',*,*,#290,.F.);
#365=ORIENTED_EDGE('',*,*,#286,.T.);
#366=ORIENTED_EDGE('',*,*,#269,.F.);
#367=ORIENTED_EDGE('',*,*,#291,.F.);
#368=ORIENTED_EDGE('',*,*,#288,.F.);
#369=ORIENTED_EDGE('',*,*,#285,.F.);
#370=ORIENTED_EDGE('',*,*,#282,.F.);
#371=ORIENTED_EDGE('',*,*,#279,.F.);
#372=ORIENTED_EDGE('',*,*,#276,.F.);
#373=ORIENTED_EDGE('',*,*,#273,.F.);
#374=ORIENTED_EDGE('',*,*,#259,.F.);
#375=ORIENTED_EDGE('',*,*,#262,.F.);
#376=ORIENTED_EDGE('',*,*,#265,.F.);
#377=ORIENTED_EDGE('',*,*,#268,.F.);
#378=ORIENTED_EDGE('',*,*,#291,.T.);
#379=ORIENTED_EDGE('',*,*,#292,.F.);
#380=ORIENTED_EDGE('',*,*,#293,.F.);
#381=ORIENTED_EDGE('',*,*,#294,.F.);
#382=ORIENTED_EDGE('',*,*,#253,.F.);
#383=ORIENTED_EDGE('',*,*,#295,.T.);
#384=ORIENTED_EDGE('',*,*,#296,.F.);
#385=ORIENTED_EDGE('',*,*,#297,.F.);
#386=ORIENTED_EDGE('',*,*,#298,.F.);
#387=ORIENTED_EDGE('',*,*,#299,.F.);
#388=ORIENTED_EDGE('',*,*,#256,.F.);
#389=ORIENTED_EDGE('',*,*,#293,.T.);
#390=ORIENTED_EDGE('',*,*,#300,.F.);
#391=ORIENTED_EDGE('',*,*,#301,.F.);
#392=ORIENTED_EDGE('',*,*,#302,.T.);
#393=ORIENTED_EDGE('',*,*,#292,.T.);
#394=ORIENTED_EDGE('',*,*,#272,.T.);
#395=ORIENTED_EDGE('',*,*,#299,.T.);
#396=ORIENTED_EDGE('',*,*,#303,.F.);
#397=ORIENTED_EDGE('',*,*,#304,.F.);
#398=ORIENTED_EDGE('',*,*,#300,.T.);
#399=ORIENTED_EDGE('',*,*,#298,.T.);
#400=ORIENTED_EDGE('',*,*,#305,.F.);
#401=ORIENTED_EDGE('',*,*,#306,.F.);
#402=ORIENTED_EDGE('',*,*,#303,.T.);
#403=ORIENTED_EDGE('',*,*,#297,.T.);
#404=ORIENTED_EDGE('',*,*,#307,.F.);
#405=ORIENTED_EDGE('',*,*,#308,.F.);
#406=ORIENTED_EDGE('',*,*,#305,.T.);
#407=ORIENTED_EDGE('',*,*,#296,.T.);
#408=ORIENTED_EDGE('',*,*,#309,.F.);
#409=ORIENTED_EDGE('',*,*,#310,.F.);
#410=ORIENTED_EDGE('',*,*,#307,.T.);
#411=ORIENTED_EDGE('',*,*,#311,.F.);
#412=ORIENTED_EDGE('',*,*,#312,.F.);
#413=ORIENTED_EDGE('',*,*,#309,.T.);
#414=ORIENTED_EDGE('',*,*,#295,.F.);
#415=ORIENTED_EDGE('',*,*,#271,.T.);
#416=ORIENTED_EDGE('',*,*,#275,.T.);
#417=ORIENTED_EDGE('',*,*,#278,.T.);
#418=ORIENTED_EDGE('',*,*,#281,.T.);
#419=ORIENTED_EDGE('',*,*,#284,.T.);
#420=ORIENTED_EDGE('',*,*,#287,.T.);
#421=ORIENTED_EDGE('',*,*,#290,.T.);
#422=ORIENTED_EDGE('',*,*,#266,.T.);
#423=ORIENTED_EDGE('',*,*,#263,.T.);
#424=ORIENTED_EDGE('',*,*,#260,.T.);
#425=ORIENTED_EDGE('',*,*,#257,.T.);
#426=ORIENTED_EDGE('',*,*,#289,.T.);
#427=ORIENTED_EDGE('',*,*,#294,.T.);
#428=ORIENTED_EDGE('',*,*,#302,.F.);
#429=ORIENTED_EDGE('',*,*,#313,.F.);
#430=ORIENTED_EDGE('',*,*,#311,.T.);
#431=ORIENTED_EDGE('',*,*,#313,.T.);
#432=ORIENTED_EDGE('',*,*,#301,.T.);
#433=ORIENTED_EDGE('',*,*,#304,.T.);
#434=ORIENTED_EDGE('',*,*,#306,.T.);
#435=ORIENTED_EDGE('',*,*,#308,.T.);
#436=ORIENTED_EDGE('',*,*,#310,.T.);
#437=ORIENTED_EDGE('',*,*,#312,.T.);
#438=ORIENTED_EDGE('',*,*,#251,.F.);
#439=ORIENTED_EDGE('',*,*,#254,.F.);
#440=CYLINDRICAL_SURFACE('',#493,3.25);
#441=CYLINDRICAL_SURFACE('',#496,3.25);
#442=CYLINDRICAL_SURFACE('',#499,4.5);
#443=CYLINDRICAL_SURFACE('',#502,4.5);
#444=CYLINDRICAL_SURFACE('',#505,4.5);
#445=CYLINDRICAL_SURFACE('',#508,4.5);
#446=CYLINDRICAL_SURFACE('',#512,4.);
#447=CYLINDRICAL_SURFACE('',#518,4.);
#448=CYLINDRICAL_SURFACE('',#530,4.);
#449=ADVANCED_FACE('',(#42),#440,.F.);
#450=ADVANCED_FACE('',(#43),#441,.F.);
#451=ADVANCED_FACE('',(#44),#442,.F.);
#452=ADVANCED_FACE('',(#45),#443,.F.);
#453=ADVANCED_FACE('',(#46),#444,.F.);
#454=ADVANCED_FACE('',(#47),#445,.F.);
#455=ADVANCED_FACE('',(#48),#27,.T.);
#456=ADVANCED_FACE('',(#49),#446,.F.);
#457=ADVANCED_FACE('',(#50),#28,.T.);
#458=ADVANCED_FACE('',(#51),#29,.T.);
#459=ADVANCED_FACE('',(#52),#30,.T.);
#460=ADVANCED_FACE('',(#53),#447,.F.);
#461=ADVANCED_FACE('',(#54),#31,.T.);
#462=ADVANCED_FACE('',(#55,#15,#16,#17,#18),#32,.T.);
#463=ADVANCED_FACE('',(#56,#19),#33,.T.);
#464=ADVANCED_FACE('',(#57,#20),#34,.T.);
#465=ADVANCED_FACE('',(#58),#35,.T.);
#466=ADVANCED_FACE('',(#59),#36,.T.);
#467=ADVANCED_FACE('',(#60),#37,.T.);
#468=ADVANCED_FACE('',(#61),#38,.T.);
#469=ADVANCED_FACE('',(#62),#448,.F.);
#470=ADVANCED_FACE('',(#63,#21,#22,#23,#24),#39,.T.);
#471=ADVANCED_FACE('',(#64),#40,.T.);
#472=ADVANCED_FACE('',(#65,#25,#26),#41,.F.);
#473=CLOSED_SHELL('',(#449,#450,#451,#452,#453,#454,#455,#456,#457,#458,
#459,#460,#461,#462,#463,#464,#465,#466,#467,#468,#469,#470,#471,#472));
#474=DERIVED_UNIT_ELEMENT(#476,1.);
#475=DERIVED_UNIT_ELEMENT(#800,3.);
#476=(
MASS_UNIT()
NAMED_UNIT(*)
SI_UNIT($,.GRAM.)
);
#477=DERIVED_UNIT((#474,#475));
#478=MEASURE_REPRESENTATION_ITEM('density measure',
POSITIVE_RATIO_MEASURE(1.),#477);
#479=PROPERTY_DEFINITION_REPRESENTATION(#484,#481);
#480=PROPERTY_DEFINITION_REPRESENTATION(#485,#482);
#481=REPRESENTATION('material name',(#483),#797);
#482=REPRESENTATION('density',(#478),#797);
#483=DESCRIPTIVE_REPRESENTATION_ITEM('Generic','Generic');
#484=PROPERTY_DEFINITION('material property','material name',#807);
#485=PROPERTY_DEFINITION('material property','density of part',#807);
#486=DATE_TIME_ROLE('creation_date');
#487=APPLIED_DATE_AND_TIME_ASSIGNMENT(#488,#486,(#807));
#488=DATE_AND_TIME(#489,#490);
#489=CALENDAR_DATE(1996,29,5);
#490=LOCAL_TIME(12,0,0.,#491);
#491=COORDINATED_UNIVERSAL_TIME_OFFSET(0,0,.BEHIND.);
#492=AXIS2_PLACEMENT_3D('placement',#666,#535,#536);
#493=AXIS2_PLACEMENT_3D('',#667,#537,#538);
#494=AXIS2_PLACEMENT_3D('',#669,#539,#540);
#495=AXIS2_PLACEMENT_3D('',#672,#542,#543);
#496=AXIS2_PLACEMENT_3D('',#673,#544,#545);
#497=AXIS2_PLACEMENT_3D('',#675,#546,#547);
#498=AXIS2_PLACEMENT_3D('',#678,#549,#550);
#499=AXIS2_PLACEMENT_3D('',#679,#551,#552);
#500=AXIS2_PLACEMENT_3D('',#681,#553,#554);
#501=AXIS2_PLACEMENT_3D('',#684,#556,#557);
#502=AXIS2_PLACEMENT_3D('',#685,#558,#559);
#503=AXIS2_PLACEMENT_3D('',#687,#560,#561);
#504=AXIS2_PLACEMENT_3D('',#690,#563,#564);
#505=AXIS2_PLACEMENT_3D('',#691,#565,#566);
#506=AXIS2_PLACEMENT_3D('',#693,#567,#568);
#507=AXIS2_PLACEMENT_3D('',#696,#570,#571);
#508=AXIS2_PLACEMENT_3D('',#697,#572,#573);
#509=AXIS2_PLACEMENT_3D('',#699,#574,#575);
#510=AXIS2_PLACEMENT_3D('',#702,#577,#578);
#511=AXIS2_PLACEMENT_3D('',#703,#579,#580);
#512=AXIS2_PLACEMENT_3D('',#712,#585,#586);
#513=AXIS2_PLACEMENT_3D('',#714,#587,#588);
#514=AXIS2_PLACEMENT_3D('',#717,#590,#591);
#515=AXIS2_PLACEMENT_3D('',#718,#592,#593);
#516=AXIS2_PLACEMENT_3D('',#724,#597,#598);
#517=AXIS2_PLACEMENT_3D('',#730,#602,#603);
#518=AXIS2_PLACEMENT_3D('',#736,#607,#608);
#519=AXIS2_PLACEMENT_3D('',#738,#609,#610);
#520=AXIS2_PLACEMENT_3D('',#741,#612,#613);
#521=AXIS2_PLACEMENT_3D('',#742,#614,#615);
#522=AXIS2_PLACEMENT_3D('',#748,#619,#620);
#523=AXIS2_PLACEMENT_3D('',#750,#622,#623);
#524=AXIS2_PLACEMENT_3D('',#756,#627,#628);
#525=AXIS2_PLACEMENT_3D('',#760,#630,#631);
#526=AXIS2_PLACEMENT_3D('',#766,#635,#636);
#527=AXIS2_PLACEMENT_3D('',#772,#640,#641);
#528=AXIS2_PLACEMENT_3D('',#776,#644,#645);
#529=AXIS2_PLACEMENT_3D('',#780,#648,#649);
#530=AXIS2_PLACEMENT_3D('',#784,#652,#653);
#531=AXIS2_PLACEMENT_3D('',#787,#655,#656);
#532=AXIS2_PLACEMENT_3D('',#788,#657,#658);
#533=AXIS2_PLACEMENT_3D('',#792,#661,#662);
#534=AXIS2_PLACEMENT_3D('',#794,#664,#665);
#535=DIRECTION('axis',(0.,0.,1.));
#536=DIRECTION('refdir',(1.,0.,0.));
#537=DIRECTION('center_axis',(0.,0.,1.));
#538=DIRECTION('ref_axis',(1.,0.,0.));
#539=DIRECTION('center_axis',(0.,0.,-1.));
#540=DIRECTION('ref_axis',(1.,0.,0.));
#541=DIRECTION('',(0.,0.,1.));
#542=DIRECTION('center_axis',(0.,0.,1.));
#543=DIRECTION('ref_axis',(1.,0.,0.));
#544=DIRECTION('center_axis',(0.,0.,1.));
#545=DIRECTION('ref_axis',(1.,0.,0.));
#546=DIRECTION('center_axis',(0.,0.,-1.));
#547=DIRECTION('ref_axis',(1.,0.,0.));
#548=DIRECTION('',(0.,0.,1.));
#549=DIRECTION('center_axis',(0.,0.,1.));
#550=DIRECTION('ref_axis',(1.,0.,0.));
#551=DIRECTION('center_axis',(0.,1.,0.));
#552=DIRECTION('ref_axis',(1.,0.,0.));
#553=DIRECTION('center_axis',(0.,1.,0.));
#554=DIRECTION('ref_axis',(1.,0.,0.));
#555=DIRECTION('',(0.,1.,0.));
#556=DIRECTION('center_axis',(0.,1.,0.));
#557=DIRECTION('ref_axis',(1.,0.,0.));
#558=DIRECTION('center_axis',(0.,1.,0.));
#559=DIRECTION('ref_axis',(1.,0.,0.));
#560=DIRECTION('center_axis',(0.,1.,0.));
#561=DIRECTION('ref_axis',(1.,0.,0.));
#562=DIRECTION('',(0.,1.,0.));
#563=DIRECTION('center_axis',(0.,1.,0.));
#564=DIRECTION('ref_axis',(1.,0.,0.));
#565=DIRECTION('center_axis',(0.,1.,0.));
#566=DIRECTION('ref_axis',(1.,0.,0.));
#567=DIRECTION('center_axis',(0.,1.,0.));
#568=DIRECTION('ref_axis',(1.,0.,0.));
#569=DIRECTION('',(0.,1.,0.));
#570=DIRECTION('center_axis',(0.,1.,0.));
#571=DIRECTION('ref_axis',(1.,0.,0.));
#572=DIRECTION('center_axis',(0.,1.,0.));
#573=DIRECTION('ref_axis',(1.,0.,0.));
#574=DIRECTION('center_axis',(0.,1.,0.));
#575=DIRECTION('ref_axis',(1.,0.,0.));
#576=DIRECTION('',(0.,1.,0.));
#577=DIRECTION('center_axis',(0.,1.,0.));
#578=DIRECTION('ref_axis',(1.,0.,0.));
#579=DIRECTION('center_axis',(0.707106781186547,0.,0.707106781186548));
#580=DIRECTION('ref_axis',(0.707106781186548,0.,-0.707106781186547));
#581=DIRECTION('',(-0.707106781186548,-1.925783E-16,0.707106781186547));
#582=DIRECTION('',(0.,1.,0.));
#583=DIRECTION('',(-0.707106781186548,-1.832013E-16,0.707106781186547));
#584=DIRECTION('',(0.,-1.,0.));
#585=DIRECTION('center_axis',(0.,1.,0.));
#586=DIRECTION('ref_axis',(1.,0.,0.));
#587=DIRECTION('center_axis',(0.,1.,0.));
#588=DIRECTION('ref_axis',(1.,0.,0.));
#589=DIRECTION('',(0.,1.,0.));
#590=DIRECTION('center_axis',(0.,1.,0.));
#591=DIRECTION('ref_axis',(1.,0.,0.));
#592=DIRECTION('center_axis',(1.,0.,0.));
#593=DIRECTION('ref_axis',(0.,0.,-1.));
#594=DIRECTION('',(0.,0.,1.));
#595=DIRECTION('',(0.,1.,0.));
#596=DIRECTION('',(0.,0.,1.));
#597=DIRECTION('center_axis',(0.,0.,1.));
#598=DIRECTION('ref_axis',(1.,0.,0.));
#599=DIRECTION('',(-1.,0.,0.));
#600=DIRECTION('',(0.,1.,0.));
#601=DIRECTION('',(-1.,0.,0.));
#602=DIRECTION('center_axis',(-1.,0.,0.));
#603=DIRECTION('ref_axis',(0.,0.,1.));
#604=DIRECTION('',(0.,0.,-1.));
#605=DIRECTION('',(0.,1.,0.));
#606=DIRECTION('',(0.,0.,-1.));
#607=DIRECTION('center_axis',(0.,1.,0.));
#608=DIRECTION('ref_axis',(1.,0.,0.));
#609=DIRECTION('center_axis',(0.,1.,0.));
#610=DIRECTION('ref_axis',(1.,0.,0.));
#611=DIRECTION('',(0.,1.,0.));
#612=DIRECTION('center_axis',(0.,1.,0.));
#613=DIRECTION('ref_axis',(1.,0.,0.));
#614=DIRECTION('center_axis',(-0.707106781186547,0.,0.707106781186548));
#615=DIRECTION('ref_axis',(0.707106781186548,0.,0.707106781186547));
#616=DIRECTION('',(-0.707106781186548,-1.925783E-16,-0.707106781186547));
#617=DIRECTION('',(0.,1.,0.));
#618=DIRECTION('',(-0.707106781186548,-1.832013E-16,-0.707106781186547));
#619=DIRECTION('center_axis',(0.,1.,0.));
#620=DIRECTION('ref_axis',(0.,0.,1.));
#621=DIRECTION('',(1.,0.,0.));
#622=DIRECTION('center_axis',(0.,0.,1.));
#623=DIRECTION('ref_axis',(1.,0.,0.));
#624=DIRECTION('',(0.,-1.,0.));
#625=DIRECTION('',(1.,0.,0.));
#626=DIRECTION('',(0.,1.,0.));
#627=DIRECTION('center_axis',(0.,0.,1.));
#628=DIRECTION('ref_axis',(1.,0.,0.));
#629=DIRECTION('',(-1.,0.,0.));
#630=DIRECTION('center_axis',(0.,0.,1.));
#631=DIRECTION('ref_axis',(1.,0.,0.));
#632=DIRECTION('',(0.,1.,0.));
#633=DIRECTION('',(-1.,0.,0.));
#634=DIRECTION('',(0.,-1.,0.));
#635=DIRECTION('center_axis',(0.,1.,0.));
#636=DIRECTION('ref_axis',(0.,0.,1.));
#637=DIRECTION('',(0.,0.,1.));
#638=DIRECTION('',(1.,0.,0.));
#639=DIRECTION('',(0.,0.,1.));
#640=DIRECTION('center_axis',(1.,0.,0.));
#641=DIRECTION('ref_axis',(0.,0.,-1.));
#642=DIRECTION('',(0.,0.,1.));
#643=DIRECTION('',(0.,-1.,0.));
#644=DIRECTION('center_axis',(0.,-1.,0.));
#645=DIRECTION('ref_axis',(0.,0.,-1.));
#646=DIRECTION('',(0.,0.,1.));
#647=DIRECTION('',(-1.,0.,0.));
#648=DIRECTION('center_axis',(-1.,0.,0.));
#649=DIRECTION('ref_axis',(0.,0.,1.));
#650=DIRECTION('',(0.,0.,1.));
#651=DIRECTION('',(0.,1.,0.));
#652=DIRECTION('center_axis',(0.,0.,1.));
#653=DIRECTION('ref_axis',(1.,0.,0.));
#654=DIRECTION('',(0.,0.,1.));
#655=DIRECTION('center_axis',(0.,0.,1.));
#656=DIRECTION('ref_axis',(1.,0.,0.));
#657=DIRECTION('center_axis',(0.,-1.,0.));
#658=DIRECTION('ref_axis',(0.,0.,-1.));
#659=DIRECTION('',(0.,0.,1.));
#660=DIRECTION('',(-1.,0.,0.));
#661=DIRECTION('center_axis',(-1.,0.,0.));
#662=DIRECTION('ref_axis',(0.,0.,1.));
#663=DIRECTION('',(0.,1.,0.));
#664=DIRECTION('center_axis',(0.,0.,1.));
#665=DIRECTION('ref_axis',(1.,0.,0.));
#666=CARTESIAN_POINT('',(0.,0.,0.));
#667=CARTESIAN_POINT('Origin',(-57.,21.,-3.));
#668=CARTESIAN_POINT('',(-60.25,21.,-3.));
#669=CARTESIAN_POINT('Origin',(-57.,21.,-3.));
#670=CARTESIAN_POINT('',(-60.25,21.,3.));
#671=CARTESIAN_POINT('',(-60.25,21.,-3.));
#672=CARTESIAN_POINT('Origin',(-57.,21.,3.));
#673=CARTESIAN_POINT('Origin',(57.,-15.,-3.));
#674=CARTESIAN_POINT('',(53.75,-15.,-3.));
#675=CARTESIAN_POINT('Origin',(57.,-15.,-3.));
#676=CARTESIAN_POINT('',(53.75,-15.,3.));
#677=CARTESIAN_POINT('',(53.75,-15.,-3.));
#678=CARTESIAN_POINT('Origin',(57.,-15.,3.));
#679=CARTESIAN_POINT('Origin',(22.5,-3.313707E-14,27.));
#680=CARTESIAN_POINT('',(18.,-3.197118E-14,27.));
#681=CARTESIAN_POINT('Origin',(22.5,-3.313707E-14,27.));
#682=CARTESIAN_POINT('',(18.,5.99999999999997,27.));
#683=CARTESIAN_POINT('',(18.,-3.313707E-14,27.));
#684=CARTESIAN_POINT('Origin',(22.5,5.99999999999997,27.));
#685=CARTESIAN_POINT('Origin',(-22.5,-4.479593E-14,27.));
#686=CARTESIAN_POINT('',(-27.,-4.363004E-14,27.));
#687=CARTESIAN_POINT('Origin',(-22.5,-4.479593E-14,27.));
#688=CARTESIAN_POINT('',(-27.,5.99999999999996,27.));
#689=CARTESIAN_POINT('',(-27.,-4.479593E-14,27.));
#690=CARTESIAN_POINT('Origin',(-22.5,5.99999999999996,27.));
#691=CARTESIAN_POINT('Origin',(-22.5,-4.479593E-14,57.));
#692=CARTESIAN_POINT('',(-27.,-4.363004E-14,57.));
#693=CARTESIAN_POINT('Origin',(-22.5,-4.479593E-14,57.));
#694=CARTESIAN_POINT('',(-27.,5.99999999999996,57.));
#695=CARTESIAN_POINT('',(-27.,-4.479593E-14,57.));
#696=CARTESIAN_POINT('Origin',(-22.5,5.99999999999996,57.));
#697=CARTESIAN_POINT('Origin',(22.5,-3.313707E-14,57.));
#698=CARTESIAN_POINT('',(18.,-3.197118E-14,57.));
#699=CARTESIAN_POINT('Origin',(22.5,-3.313707E-14,57.));
#700=CARTESIAN_POINT('',(18.,5.99999999999997,57.));
#701=CARTESIAN_POINT('',(18.,-3.313707E-14,57.));
#702=CARTESIAN_POINT('Origin',(22.5,5.99999999999997,57.));
#703=CARTESIAN_POINT('Origin',(69.,-2.108958E-14,3.00000000000001));
#704=CARTESIAN_POINT('',(69.,5.99999999999998,3.00000000000001));
#705=CARTESIAN_POINT('',(46.1715728752538,5.99999999999997,25.8284271247462));
#706=CARTESIAN_POINT('',(69.,5.99999999999998,3.00000000000001));
#707=CARTESIAN_POINT('',(46.1715728752538,-2.70041E-14,25.8284271247462));
#708=CARTESIAN_POINT('',(46.1715728752538,-2.70041E-14,25.8284271247462));
#709=CARTESIAN_POINT('',(69.,-2.108958E-14,3.00000000000001));
#710=CARTESIAN_POINT('',(69.,-2.108958E-14,3.00000000000001));
#711=CARTESIAN_POINT('',(69.,5.99999999999998,3.00000000000001));
#712=CARTESIAN_POINT('Origin',(49.,-2.62713E-14,28.6568542494924));
#713=CARTESIAN_POINT('',(45.,5.99999999999997,28.6568542494924));
#714=CARTESIAN_POINT('Origin',(49.,5.99999999999997,28.6568542494924));
#715=CARTESIAN_POINT('',(45.,-2.730764E-14,28.6568542494924));
#716=CARTESIAN_POINT('',(45.,-2.730764E-14,28.6568542494924));
#717=CARTESIAN_POINT('Origin',(49.,-2.62713E-14,28.6568542494924));
#718=CARTESIAN_POINT('Origin',(45.,-2.730764E-14,28.6568542494924));
#719=CARTESIAN_POINT('',(45.,5.99999999999997,67.));
#720=CARTESIAN_POINT('',(45.,5.99999999999997,28.6568542494924));
#721=CARTESIAN_POINT('',(45.,-2.730764E-14,67.));
#722=CARTESIAN_POINT('',(45.,-2.730764E-14,67.));
#723=CARTESIAN_POINT('',(45.,-2.730764E-14,28.6568542494924));
#724=CARTESIAN_POINT('Origin',(45.,-2.730764E-14,67.));
#725=CARTESIAN_POINT('',(-45.,5.99999999999995,67.));
#726=CARTESIAN_POINT('',(45.,5.99999999999997,67.));
#727=CARTESIAN_POINT('',(-45.,-5.062536E-14,67.));
#728=CARTESIAN_POINT('',(-45.,-5.062536E-14,67.));
#729=CARTESIAN_POINT('',(45.,-2.730764E-14,67.));
#730=CARTESIAN_POINT('Origin',(-45.,-5.062536E-14,67.));
#731=CARTESIAN_POINT('',(-45.,5.99999999999995,28.6568542494924));
#732=CARTESIAN_POINT('',(-45.,5.99999999999995,67.));
#733=CARTESIAN_POINT('',(-45.,-5.062536E-14,28.6568542494924));
#734=CARTESIAN_POINT('',(-45.,-5.062536E-14,28.6568542494924));
#735=CARTESIAN_POINT('',(-45.,-5.062536E-14,67.));
#736=CARTESIAN_POINT('Origin',(-49.,-5.16617E-14,28.6568542494924));
#737=CARTESIAN_POINT('',(-46.1715728752538,5.99999999999995,25.8284271247462));
#738=CARTESIAN_POINT('Origin',(-49.,5.99999999999995,28.6568542494924));
#739=CARTESIAN_POINT('',(-46.1715728752538,-5.09289E-14,25.8284271247462));
#740=CARTESIAN_POINT('',(-46.1715728752538,-5.09289E-14,25.8284271247462));
#741=CARTESIAN_POINT('Origin',(-49.,-5.16617E-14,28.6568542494924));
#742=CARTESIAN_POINT('Origin',(-46.1715728752538,-5.09289E-14,25.8284271247462));
#743=CARTESIAN_POINT('',(-69.,5.99999999999994,2.99999999999999));
#744=CARTESIAN_POINT('',(-46.1715728752538,5.99999999999995,25.8284271247462));
#745=CARTESIAN_POINT('',(-69.,-5.684342E-14,3.));
#746=CARTESIAN_POINT('',(-69.,-5.684342E-14,3.));
#747=CARTESIAN_POINT('',(-46.1715728752538,-5.09289E-14,25.8284271247462));
#748=CARTESIAN_POINT('Origin',(0.094686336856016,5.99999999999996,32.6691668518164));
#749=CARTESIAN_POINT('',(-69.,5.99999999999994,2.99999999999999));
#750=CARTESIAN_POINT('Origin',(60.25,-15.,3.));
#751=CARTESIAN_POINT('',(69.,33.,3.));
#752=CARTESIAN_POINT('',(69.,33.,3.));
#753=CARTESIAN_POINT('',(-69.,33.,3.));
#754=CARTESIAN_POINT('',(-69.,33.,3.));
#755=CARTESIAN_POINT('',(-69.,5.99999999999994,2.99999999999999));
#756=CARTESIAN_POINT('Origin',(60.25,-15.,3.));
#757=CARTESIAN_POINT('',(40.7,-2.842171E-14,3.));
#758=CARTESIAN_POINT('',(69.,-2.108958E-14,3.00000000000001));
#759=CARTESIAN_POINT('',(44.7,-4.00000000000003,3.));
#760=CARTESIAN_POINT('Origin',(40.7,-4.00000000000003,3.));
#761=CARTESIAN_POINT('',(44.7,-27.,3.));
#762=CARTESIAN_POINT('',(44.7,-27.,3.));
#763=CARTESIAN_POINT('',(69.,-27.,3.));
#764=CARTESIAN_POINT('',(69.,-27.,3.));
#765=CARTESIAN_POINT('',(69.,-2.108958E-14,3.00000000000001));
#766=CARTESIAN_POINT('Origin',(-69.,33.,-3.));
#767=CARTESIAN_POINT('',(69.,33.,-3.));
#768=CARTESIAN_POINT('',(69.,33.,-3.));
#769=CARTESIAN_POINT('',(-69.,33.,-3.));
#770=CARTESIAN_POINT('',(-69.,33.,-3.));
#771=CARTESIAN_POINT('',(-69.,33.,-3.));
#772=CARTESIAN_POINT('Origin',(69.,33.,-3.));
#773=CARTESIAN_POINT('',(69.,-27.,-3.));
#774=CARTESIAN_POINT('',(69.,-27.,-3.));
#775=CARTESIAN_POINT('',(69.,33.,-3.));
#776=CARTESIAN_POINT('Origin',(69.,-27.,-3.));
#777=CARTESIAN_POINT('',(44.7,-27.,-3.));
#778=CARTESIAN_POINT('',(44.7,-27.,-3.));
#779=CARTESIAN_POINT('',(69.,-27.,-3.));
#780=CARTESIAN_POINT('Origin',(44.7,-27.,-3.));
#781=CARTESIAN_POINT('',(44.7,-4.00000000000003,-3.));
#782=CARTESIAN_POINT('',(44.7,-4.00000000000003,-3.));
#783=CARTESIAN_POINT('',(44.7,-27.,-3.));
#784=CARTESIAN_POINT('Origin',(40.7,-4.00000000000003,-3.));
#785=CARTESIAN_POINT('',(40.7,-2.842171E-14,-3.));
#786=CARTESIAN_POINT('',(40.7,-2.842171E-14,-3.));
#787=CARTESIAN_POINT('Origin',(40.7,-4.00000000000003,-3.));
#788=CARTESIAN_POINT('Origin',(44.7,-2.738537E-14,-3.));
#789=CARTESIAN_POINT('',(-69.,-5.684342E-14,-3.));
#790=CARTESIAN_POINT('',(-69.,-5.684342E-14,-3.));
#791=CARTESIAN_POINT('',(40.7,-2.842171E-14,-3.));
#792=CARTESIAN_POINT('Origin',(-69.,-5.684342E-14,-3.));
#793=CARTESIAN_POINT('',(-69.,-5.684342E-14,-3.));
#794=CARTESIAN_POINT('Origin',(7.58765193435016,10.7953505223174,-3.));
#795=UNCERTAINTY_MEASURE_WITH_UNIT(LENGTH_MEASURE(0.01),#799,
'DISTANCE_ACCURACY_VALUE',
'Maximum model space distance between geometric entities at asserted c
onnectivities');
#796=UNCERTAINTY_MEASURE_WITH_UNIT(LENGTH_MEASURE(0.01),#799,
'DISTANCE_ACCURACY_VALUE',
'Maximum model space distance between geometric entities at asserted c
onnectivities');
#797=(
GEOMETRIC_REPRESENTATION_CONTEXT(3)
GLOBAL_UNCERTAINTY_ASSIGNED_CONTEXT((#795))
GLOBAL_UNIT_ASSIGNED_CONTEXT((#799,#801,#802))
REPRESENTATION_CONTEXT('','3D')
);
#798=(
GEOMETRIC_REPRESENTATION_CONTEXT(3)
GLOBAL_UNCERTAINTY_ASSIGNED_CONTEXT((#796))
GLOBAL_UNIT_ASSIGNED_CONTEXT((#799,#801,#802))
REPRESENTATION_CONTEXT('','3D')
);
#799=(
LENGTH_UNIT()
NAMED_UNIT(*)
SI_UNIT(.MILLI.,.METRE.)
);
#800=(
LENGTH_UNIT()
NAMED_UNIT(*)
SI_UNIT(.CENTI.,.METRE.)
);
#801=(
NAMED_UNIT(*)
PLANE_ANGLE_UNIT()
SI_UNIT($,.RADIAN.)
);
#802=(
NAMED_UNIT(*)
SI_UNIT($,.STERADIAN.)
SOLID_ANGLE_UNIT()
);
#803=SHAPE_DEFINITION_REPRESENTATION(#804,#805);
#804=PRODUCT_DEFINITION_SHAPE('',$,#807);
#805=SHAPE_REPRESENTATION('',(#492),#797);
#806=PRODUCT_DEFINITION_CONTEXT('part definition',#811,'design');
#807=PRODUCT_DEFINITION('HALTER_LINKS','HALTER_LINKS',#808,#806);
#808=PRODUCT_DEFINITION_FORMATION('None',$,#813);
#809=PRODUCT_RELATED_PRODUCT_CATEGORY('HALTER_LINKS','HALTER_LINKS',(#813));
#810=APPLICATION_PROTOCOL_DEFINITION('international standard',
'automotive_design',2009,#811);
#811=APPLICATION_CONTEXT(
'Core Data for Automotive Mechanical Design Process');
#812=PRODUCT_CONTEXT('part definition',#811,'mechanical');
#813=PRODUCT('HALTER_LINKS','HALTER_LINKS',$,(#812));
#814=PRESENTATION_STYLE_ASSIGNMENT((#815));
#815=SURFACE_STYLE_USAGE(.BOTH.,#818);
#816=SURFACE_STYLE_RENDERING_WITH_PROPERTIES($,#822,(#817));
#817=SURFACE_STYLE_TRANSPARENT(0.);
#818=SURFACE_SIDE_STYLE('',(#819,#816));
#819=SURFACE_STYLE_FILL_AREA(#820);
#820=FILL_AREA_STYLE('',(#821));
#821=FILL_AREA_STYLE_COLOUR('',#822);
#822=COLOUR_RGB('',0.749019607843137,0.749019607843137,0.749019607843137);
ENDSEC;
END-ISO-10303-21;
