ISO-10303-21;
HEADER;
/* Generated by software containing ST-Developer
 * from STEP Tools, Inc. (www.steptools.com) 
 */

FILE_DESCRIPTION(
/* description */ (''),
/* implementation_level */ '2;1');

FILE_NAME(
/* name */ 
'C:\\Users\\Kacper\\MATLAB\\Projects\\release-mechanism-simulation\\st
ep_files\\new_sphere\\obudowa_20mm_dol.stp',
/* time_stamp */ '2021-01-19T23:18:57+01:00',
/* author */ ('Kacper'),
/* organization */ (''),
/* preprocessor_version */ 'ST-DEVELOPER v18.1',
/* originating_system */ 'Autodesk Inventor 2021',
/* authorisation */ '');

FILE_SCHEMA (('AUTOMOTIVE_DESIGN { 1 0 10303 214 3 1 1 }'));
ENDSEC;

DATA;
#10=MECHANICAL_DESIGN_GEOMETRIC_PRESENTATION_REPRESENTATION('',(#13),#2007);
#11=SHAPE_REPRESENTATION_RELATIONSHIP('SRR','None',#2014,#12);
#12=ADVANCED_BREP_SHAPE_REPRESENTATION('',(#14),#2006);
#13=STYLED_ITEM('',(#2023),#14);
#14=MANIFOLD_SOLID_BREP('Bry\X2\0142\X0\a2',#1117);
#15=ELLIPSE('',#1174,1.16619037896906,1.);
#16=ELLIPSE('',#1175,1.16619037896906,0.999999999999992);
#17=ELLIPSE('',#1177,1.16619037896906,1.);
#18=ELLIPSE('',#1178,1.16619037896906,1.);
#19=ELLIPSE('',#1196,1.16619037896906,1.);
#20=ELLIPSE('',#1197,1.16619037896906,1.);
#21=ELLIPSE('',#1199,1.16619037896906,1.);
#22=ELLIPSE('',#1200,1.16619037896906,1.);
#23=B_SPLINE_SURFACE_WITH_KNOTS('',3,3,((#1707,#1708,#1709,#1710,#1711),
(#1712,#1713,#1714,#1715,#1716),(#1717,#1718,#1719,#1720,#1721),(#1722,
#1723,#1724,#1725,#1726),(#1727,#1728,#1729,#1730,#1731)),.UNSPECIFIED.,
 .F.,.F.,.F.,(4,1,4),(4,1,4),(0.,0.5,1.),(-1.5707963267949,-0.897597901025655,
0.),.UNSPECIFIED.);
#24=B_SPLINE_SURFACE_WITH_KNOTS('',3,3,((#1738,#1739,#1740,#1741,#1742),
(#1743,#1744,#1745,#1746,#1747),(#1748,#1749,#1750,#1751,#1752),(#1753,
#1754,#1755,#1756,#1757),(#1758,#1759,#1760,#1761,#1762)),.UNSPECIFIED.,
 .F.,.F.,.F.,(4,1,4),(4,1,4),(0.,0.5,1.),(-1.5707963267949,-0.897597901025655,
0.),.UNSPECIFIED.);
#25=B_SPLINE_SURFACE_WITH_KNOTS('',3,3,((#1821,#1822,#1823,#1824,#1825),
(#1826,#1827,#1828,#1829,#1830),(#1831,#1832,#1833,#1834,#1835),(#1836,
#1837,#1838,#1839,#1840),(#1841,#1842,#1843,#1844,#1845)),.UNSPECIFIED.,
 .F.,.F.,.F.,(4,1,4),(4,1,4),(0.,0.5,1.),(-1.5707963267949,-0.897597901025655,
-5.55111512312578E-16),.UNSPECIFIED.);
#26=B_SPLINE_SURFACE_WITH_KNOTS('',3,3,((#1852,#1853,#1854,#1855,#1856),
(#1857,#1858,#1859,#1860,#1861),(#1862,#1863,#1864,#1865,#1866),(#1867,
#1868,#1869,#1870,#1871),(#1872,#1873,#1874,#1875,#1876)),.UNSPECIFIED.,
 .F.,.F.,.F.,(4,1,4),(4,1,4),(0.,0.5,1.),(-1.5707963267949,-0.897597901025655,
4.27898457407612E-17),.UNSPECIFIED.);
#27=CYLINDRICAL_SURFACE('',#1145,3.2);
#28=CYLINDRICAL_SURFACE('',#1156,3.2);
#29=CYLINDRICAL_SURFACE('',#1158,4.1);
#30=CYLINDRICAL_SURFACE('',#1167,1.2);
#31=CYLINDRICAL_SURFACE('',#1168,1.2);
#32=CYLINDRICAL_SURFACE('',#1171,1.2);
#33=CYLINDRICAL_SURFACE('',#1179,1.);
#34=CYLINDRICAL_SURFACE('',#1181,1.);
#35=CYLINDRICAL_SURFACE('',#1182,1.);
#36=CYLINDRICAL_SURFACE('',#1201,1.);
#37=CYLINDRICAL_SURFACE('',#1202,1.);
#38=CYLINDRICAL_SURFACE('',#1203,1.);
#39=CYLINDRICAL_SURFACE('',#1204,0.4);
#40=CYLINDRICAL_SURFACE('',#1210,0.4);
#41=CYLINDRICAL_SURFACE('',#1214,0.4);
#42=CYLINDRICAL_SURFACE('',#1220,0.4);
#43=CYLINDRICAL_SURFACE('',#1223,1.35);
#44=CYLINDRICAL_SURFACE('',#1225,1.35);
#45=CYLINDRICAL_SURFACE('',#1227,1.35);
#46=CYLINDRICAL_SURFACE('',#1229,1.35);
#47=CYLINDRICAL_SURFACE('',#1231,2.5);
#48=CYLINDRICAL_SURFACE('',#1235,2.5);
#49=CYLINDRICAL_SURFACE('',#1239,2.5);
#50=CYLINDRICAL_SURFACE('',#1243,2.5);
#51=CYLINDRICAL_SURFACE('',#1247,1.35);
#52=CYLINDRICAL_SURFACE('',#1248,1.35);
#53=CYLINDRICAL_SURFACE('',#1249,1.35);
#54=CYLINDRICAL_SURFACE('',#1250,1.35);
#55=CYLINDRICAL_SURFACE('',#1251,1.35);
#56=CYLINDRICAL_SURFACE('',#1252,1.35);
#57=FACE_BOUND('',#153,.T.);
#58=FACE_BOUND('',#156,.T.);
#59=FACE_BOUND('',#157,.T.);
#60=FACE_BOUND('',#158,.T.);
#61=FACE_BOUND('',#159,.T.);
#62=FACE_BOUND('',#166,.T.);
#63=FACE_BOUND('',#171,.T.);
#64=FACE_BOUND('',#181,.T.);
#65=FACE_BOUND('',#182,.T.);
#66=FACE_BOUND('',#183,.T.);
#67=FACE_BOUND('',#184,.T.);
#68=FACE_BOUND('',#185,.T.);
#69=FACE_BOUND('',#186,.T.);
#70=FACE_BOUND('',#187,.T.);
#71=FACE_BOUND('',#195,.T.);
#72=FACE_BOUND('',#196,.T.);
#73=FACE_BOUND('',#197,.T.);
#74=FACE_BOUND('',#203,.T.);
#75=FACE_BOUND('',#204,.T.);
#76=FACE_BOUND('',#205,.T.);
#77=FACE_BOUND('',#214,.T.);
#78=FACE_BOUND('',#217,.T.);
#79=FACE_BOUND('',#220,.T.);
#80=FACE_BOUND('',#223,.T.);
#81=FACE_BOUND('',#234,.T.);
#82=FACE_BOUND('',#235,.T.);
#83=FACE_BOUND('',#236,.T.);
#84=FACE_BOUND('',#237,.T.);
#85=FACE_BOUND('',#240,.T.);
#86=TOROIDAL_SURFACE('',#1139,8.,3.2);
#87=FACE_OUTER_BOUND('',#150,.T.);
#88=FACE_OUTER_BOUND('',#151,.T.);
#89=FACE_OUTER_BOUND('',#152,.T.);
#90=FACE_OUTER_BOUND('',#154,.T.);
#91=FACE_OUTER_BOUND('',#155,.T.);
#92=FACE_OUTER_BOUND('',#160,.T.);
#93=FACE_OUTER_BOUND('',#161,.T.);
#94=FACE_OUTER_BOUND('',#162,.T.);
#95=FACE_OUTER_BOUND('',#163,.T.);
#96=FACE_OUTER_BOUND('',#164,.T.);
#97=FACE_OUTER_BOUND('',#165,.T.);
#98=FACE_OUTER_BOUND('',#167,.T.);
#99=FACE_OUTER_BOUND('',#168,.T.);
#100=FACE_OUTER_BOUND('',#169,.T.);
#101=FACE_OUTER_BOUND('',#170,.T.);
#102=FACE_OUTER_BOUND('',#172,.T.);
#103=FACE_OUTER_BOUND('',#173,.T.);
#104=FACE_OUTER_BOUND('',#174,.T.);
#105=FACE_OUTER_BOUND('',#175,.T.);
#106=FACE_OUTER_BOUND('',#176,.T.);
#107=FACE_OUTER_BOUND('',#177,.T.);
#108=FACE_OUTER_BOUND('',#178,.T.);
#109=FACE_OUTER_BOUND('',#179,.T.);
#110=FACE_OUTER_BOUND('',#180,.T.);
#111=FACE_OUTER_BOUND('',#188,.T.);
#112=FACE_OUTER_BOUND('',#189,.T.);
#113=FACE_OUTER_BOUND('',#190,.T.);
#114=FACE_OUTER_BOUND('',#191,.T.);
#115=FACE_OUTER_BOUND('',#192,.T.);
#116=FACE_OUTER_BOUND('',#193,.T.);
#117=FACE_OUTER_BOUND('',#194,.T.);
#118=FACE_OUTER_BOUND('',#198,.T.);
#119=FACE_OUTER_BOUND('',#199,.T.);
#120=FACE_OUTER_BOUND('',#200,.T.);
#121=FACE_OUTER_BOUND('',#201,.T.);
#122=FACE_OUTER_BOUND('',#202,.T.);
#123=FACE_OUTER_BOUND('',#206,.T.);
#124=FACE_OUTER_BOUND('',#207,.T.);
#125=FACE_OUTER_BOUND('',#208,.T.);
#126=FACE_OUTER_BOUND('',#209,.T.);
#127=FACE_OUTER_BOUND('',#210,.T.);
#128=FACE_OUTER_BOUND('',#211,.T.);
#129=FACE_OUTER_BOUND('',#212,.T.);
#130=FACE_OUTER_BOUND('',#213,.T.);
#131=FACE_OUTER_BOUND('',#215,.T.);
#132=FACE_OUTER_BOUND('',#216,.T.);
#133=FACE_OUTER_BOUND('',#218,.T.);
#134=FACE_OUTER_BOUND('',#219,.T.);
#135=FACE_OUTER_BOUND('',#221,.T.);
#136=FACE_OUTER_BOUND('',#222,.T.);
#137=FACE_OUTER_BOUND('',#224,.T.);
#138=FACE_OUTER_BOUND('',#225,.T.);
#139=FACE_OUTER_BOUND('',#226,.T.);
#140=FACE_OUTER_BOUND('',#227,.T.);
#141=FACE_OUTER_BOUND('',#228,.T.);
#142=FACE_OUTER_BOUND('',#229,.T.);
#143=FACE_OUTER_BOUND('',#230,.T.);
#144=FACE_OUTER_BOUND('',#231,.T.);
#145=FACE_OUTER_BOUND('',#232,.T.);
#146=FACE_OUTER_BOUND('',#233,.T.);
#147=FACE_OUTER_BOUND('',#238,.T.);
#148=FACE_OUTER_BOUND('',#239,.T.);
#149=FACE_OUTER_BOUND('',#241,.T.);
#150=EDGE_LOOP('',(#722,#723));
#151=EDGE_LOOP('',(#724,#725,#726,#727));
#152=EDGE_LOOP('',(#728,#729,#730,#731));
#153=EDGE_LOOP('',(#732));
#154=EDGE_LOOP('',(#733,#734,#735,#736,#737));
#155=EDGE_LOOP('',(#738,#739,#740,#741,#742,#743,#744,#745));
#156=EDGE_LOOP('',(#746));
#157=EDGE_LOOP('',(#747));
#158=EDGE_LOOP('',(#748));
#159=EDGE_LOOP('',(#749));
#160=EDGE_LOOP('',(#750,#751,#752,#753,#754));
#161=EDGE_LOOP('',(#755,#756,#757,#758));
#162=EDGE_LOOP('',(#759,#760,#761,#762));
#163=EDGE_LOOP('',(#763,#764,#765,#766));
#164=EDGE_LOOP('',(#767,#768,#769,#770));
#165=EDGE_LOOP('',(#771,#772,#773,#774));
#166=EDGE_LOOP('',(#775));
#167=EDGE_LOOP('',(#776,#777,#778,#779,#780,#781,#782,#783));
#168=EDGE_LOOP('',(#784,#785,#786,#787));
#169=EDGE_LOOP('',(#788,#789,#790,#791,#792));
#170=EDGE_LOOP('',(#793,#794,#795,#796));
#171=EDGE_LOOP('',(#797));
#172=EDGE_LOOP('',(#798,#799,#800,#801,#802));
#173=EDGE_LOOP('',(#803,#804,#805));
#174=EDGE_LOOP('',(#806,#807,#808));
#175=EDGE_LOOP('',(#809,#810,#811,#812));
#176=EDGE_LOOP('',(#813,#814,#815,#816));
#177=EDGE_LOOP('',(#817,#818,#819,#820));
#178=EDGE_LOOP('',(#821,#822,#823,#824));
#179=EDGE_LOOP('',(#825,#826,#827,#828));
#180=EDGE_LOOP('',(#829,#830,#831,#832,#833,#834,#835,#836,#837,#838,#839,
#840,#841,#842,#843,#844,#845,#846));
#181=EDGE_LOOP('',(#847,#848,#849,#850));
#182=EDGE_LOOP('',(#851));
#183=EDGE_LOOP('',(#852));
#184=EDGE_LOOP('',(#853));
#185=EDGE_LOOP('',(#854));
#186=EDGE_LOOP('',(#855));
#187=EDGE_LOOP('',(#856));
#188=EDGE_LOOP('',(#857,#858,#859));
#189=EDGE_LOOP('',(#860,#861,#862));
#190=EDGE_LOOP('',(#863,#864,#865,#866));
#191=EDGE_LOOP('',(#867,#868,#869,#870));
#192=EDGE_LOOP('',(#871,#872,#873,#874));
#193=EDGE_LOOP('',(#875,#876,#877,#878));
#194=EDGE_LOOP('',(#879,#880,#881,#882));
#195=EDGE_LOOP('',(#883));
#196=EDGE_LOOP('',(#884));
#197=EDGE_LOOP('',(#885));
#198=EDGE_LOOP('',(#886,#887,#888,#889));
#199=EDGE_LOOP('',(#890,#891,#892,#893));
#200=EDGE_LOOP('',(#894,#895,#896,#897));
#201=EDGE_LOOP('',(#898,#899,#900,#901));
#202=EDGE_LOOP('',(#902,#903,#904,#905));
#203=EDGE_LOOP('',(#906));
#204=EDGE_LOOP('',(#907));
#205=EDGE_LOOP('',(#908));
#206=EDGE_LOOP('',(#909,#910,#911,#912));
#207=EDGE_LOOP('',(#913,#914,#915,#916,#917,#918,#919,#920));
#208=EDGE_LOOP('',(#921,#922,#923,#924));
#209=EDGE_LOOP('',(#925,#926,#927,#928));
#210=EDGE_LOOP('',(#929,#930,#931,#932));
#211=EDGE_LOOP('',(#933,#934,#935,#936));
#212=EDGE_LOOP('',(#937,#938,#939,#940));
#213=EDGE_LOOP('',(#941));
#214=EDGE_LOOP('',(#942));
#215=EDGE_LOOP('',(#943,#944,#945,#946));
#216=EDGE_LOOP('',(#947));
#217=EDGE_LOOP('',(#948));
#218=EDGE_LOOP('',(#949,#950,#951,#952));
#219=EDGE_LOOP('',(#953));
#220=EDGE_LOOP('',(#954));
#221=EDGE_LOOP('',(#955,#956,#957,#958));
#222=EDGE_LOOP('',(#959));
#223=EDGE_LOOP('',(#960));
#224=EDGE_LOOP('',(#961,#962,#963,#964));
#225=EDGE_LOOP('',(#965,#966,#967,#968));
#226=EDGE_LOOP('',(#969,#970,#971,#972));
#227=EDGE_LOOP('',(#973,#974,#975,#976));
#228=EDGE_LOOP('',(#977,#978,#979,#980));
#229=EDGE_LOOP('',(#981,#982,#983,#984));
#230=EDGE_LOOP('',(#985,#986,#987,#988));
#231=EDGE_LOOP('',(#989,#990,#991,#992));
#232=EDGE_LOOP('',(#993,#994,#995,#996,#997,#998,#999,#1000));
#233=EDGE_LOOP('',(#1001,#1002,#1003,#1004,#1005,#1006,#1007,#1008));
#234=EDGE_LOOP('',(#1009));
#235=EDGE_LOOP('',(#1010));
#236=EDGE_LOOP('',(#1011));
#237=EDGE_LOOP('',(#1012));
#238=EDGE_LOOP('',(#1013,#1014,#1015,#1016));
#239=EDGE_LOOP('',(#1017,#1018,#1019,#1020));
#240=EDGE_LOOP('',(#1021));
#241=EDGE_LOOP('',(#1022,#1023,#1024,#1025));
#242=LINE('',#1601,#330);
#243=LINE('',#1610,#331);
#244=LINE('',#1612,#332);
#245=LINE('',#1613,#333);
#246=LINE('',#1621,#334);
#247=LINE('',#1624,#335);
#248=LINE('',#1628,#336);
#249=LINE('',#1632,#337);
#250=LINE('',#1645,#338);
#251=LINE('',#1650,#339);
#252=LINE('',#1655,#340);
#253=LINE('',#1657,#341);
#254=LINE('',#1659,#342);
#255=LINE('',#1660,#343);
#256=LINE('',#1663,#344);
#257=LINE('',#1665,#345);
#258=LINE('',#1666,#346);
#259=LINE('',#1669,#347);
#260=LINE('',#1671,#348);
#261=LINE('',#1672,#349);
#262=LINE('',#1674,#350);
#263=LINE('',#1680,#351);
#264=LINE('',#1682,#352);
#265=LINE('',#1683,#353);
#266=LINE('',#1685,#354);
#267=LINE('',#1686,#355);
#268=LINE('',#1688,#356);
#269=LINE('',#1691,#357);
#270=LINE('',#1695,#358);
#271=LINE('',#1696,#359);
#272=LINE('',#1699,#360);
#273=LINE('',#1700,#361);
#274=LINE('',#1703,#362);
#275=LINE('',#1705,#363);
#276=LINE('',#1771,#364);
#277=LINE('',#1774,#365);
#278=LINE('',#1776,#366);
#279=LINE('',#1777,#367);
#280=LINE('',#1780,#368);
#281=LINE('',#1783,#369);
#282=LINE('',#1785,#370);
#283=LINE('',#1786,#371);
#284=LINE('',#1788,#372);
#285=LINE('',#1791,#373);
#286=LINE('',#1793,#374);
#287=LINE('',#1795,#375);
#288=LINE('',#1799,#376);
#289=LINE('',#1802,#377);
#290=LINE('',#1803,#378);
#291=LINE('',#1805,#379);
#292=LINE('',#1807,#380);
#293=LINE('',#1808,#381);
#294=LINE('',#1884,#382);
#295=LINE('',#1885,#383);
#296=LINE('',#1887,#384);
#297=LINE('',#1888,#385);
#298=LINE('',#1890,#386);
#299=LINE('',#1891,#387);
#300=LINE('',#1894,#388);
#301=LINE('',#1896,#389);
#302=LINE('',#1899,#390);
#303=LINE('',#1900,#391);
#304=LINE('',#1909,#392);
#305=LINE('',#1912,#393);
#306=LINE('',#1917,#394);
#307=LINE('',#1920,#395);
#308=LINE('',#1921,#396);
#309=LINE('',#1931,#397);
#310=LINE('',#1936,#398);
#311=LINE('',#1940,#399);
#312=LINE('',#1944,#400);
#313=LINE('',#1948,#401);
#314=LINE('',#1953,#402);
#315=LINE('',#1960,#403);
#316=LINE('',#1967,#404);
#317=LINE('',#1974,#405);
#318=LINE('',#1978,#406);
#319=LINE('',#1980,#407);
#320=LINE('',#1982,#408);
#321=LINE('',#1984,#409);
#322=LINE('',#1986,#410);
#323=LINE('',#1988,#411);
#324=LINE('',#1990,#412);
#325=LINE('',#1995,#413);
#326=LINE('',#1997,#414);
#327=LINE('',#1998,#415);
#328=LINE('',#2000,#416);
#329=LINE('',#2002,#417);
#330=VECTOR('',#1266,10.);
#331=VECTOR('',#1277,10.);
#332=VECTOR('',#1278,10.);
#333=VECTOR('',#1279,10.);
#334=VECTOR('',#1288,10.);
#335=VECTOR('',#1291,10.);
#336=VECTOR('',#1294,10.);
#337=VECTOR('',#1297,10.);
#338=VECTOR('',#1312,10.);
#339=VECTOR('',#1317,4.1);
#340=VECTOR('',#1322,10.);
#341=VECTOR('',#1323,10.);
#342=VECTOR('',#1324,10.);
#343=VECTOR('',#1325,10.);
#344=VECTOR('',#1328,10.);
#345=VECTOR('',#1329,10.);
#346=VECTOR('',#1330,10.);
#347=VECTOR('',#1333,10.);
#348=VECTOR('',#1334,10.);
#349=VECTOR('',#1335,10.);
#350=VECTOR('',#1338,10.);
#351=VECTOR('',#1343,10.);
#352=VECTOR('',#1344,10.);
#353=VECTOR('',#1345,10.);
#354=VECTOR('',#1346,10.);
#355=VECTOR('',#1347,10.);
#356=VECTOR('',#1350,1.2);
#357=VECTOR('',#1353,10.);
#358=VECTOR('',#1356,10.);
#359=VECTOR('',#1357,10.);
#360=VECTOR('',#1360,10.);
#361=VECTOR('',#1361,10.);
#362=VECTOR('',#1364,10.);
#363=VECTOR('',#1365,10.);
#364=VECTOR('',#1382,10.);
#365=VECTOR('',#1385,10.);
#366=VECTOR('',#1388,10.);
#367=VECTOR('',#1389,10.);
#368=VECTOR('',#1392,10.);
#369=VECTOR('',#1395,10.);
#370=VECTOR('',#1398,10.);
#371=VECTOR('',#1399,10.);
#372=VECTOR('',#1402,10.);
#373=VECTOR('',#1405,10.);
#374=VECTOR('',#1406,10.);
#375=VECTOR('',#1407,10.);
#376=VECTOR('',#1410,10.);
#377=VECTOR('',#1413,10.);
#378=VECTOR('',#1414,10.);
#379=VECTOR('',#1415,10.);
#380=VECTOR('',#1416,10.);
#381=VECTOR('',#1417,10.);
#382=VECTOR('',#1444,10.);
#383=VECTOR('',#1445,10.);
#384=VECTOR('',#1448,10.);
#385=VECTOR('',#1449,10.);
#386=VECTOR('',#1452,10.);
#387=VECTOR('',#1453,10.);
#388=VECTOR('',#1456,10.);
#389=VECTOR('',#1459,10.);
#390=VECTOR('',#1462,10.);
#391=VECTOR('',#1463,10.);
#392=VECTOR('',#1472,10.);
#393=VECTOR('',#1477,10.);
#394=VECTOR('',#1484,10.);
#395=VECTOR('',#1487,10.);
#396=VECTOR('',#1488,10.);
#397=VECTOR('',#1499,10.);
#398=VECTOR('',#1506,1.35);
#399=VECTOR('',#1511,1.35);
#400=VECTOR('',#1516,1.35);
#401=VECTOR('',#1521,1.35);
#402=VECTOR('',#1526,2.5);
#403=VECTOR('',#1535,2.5);
#404=VECTOR('',#1544,2.5);
#405=VECTOR('',#1553,2.5);
#406=VECTOR('',#1560,1.35);
#407=VECTOR('',#1563,1.35);
#408=VECTOR('',#1566,1.35);
#409=VECTOR('',#1569,1.35);
#410=VECTOR('',#1572,1.35);
#411=VECTOR('',#1575,1.35);
#412=VECTOR('',#1578,10.);
#413=VECTOR('',#1585,10.);
#414=VECTOR('',#1586,10.);
#415=VECTOR('',#1587,10.);
#416=VECTOR('',#1590,10.);
#417=VECTOR('',#1593,10.);
#418=CIRCLE('',#1138,11.1432467291003);
#419=CIRCLE('',#1140,3.2);
#420=CIRCLE('',#1141,8.);
#421=CIRCLE('',#1142,3.2);
#422=CIRCLE('',#1144,1.2);
#423=CIRCLE('',#1146,3.2);
#424=CIRCLE('',#1147,3.2);
#425=CIRCLE('',#1149,1.2);
#426=CIRCLE('',#1150,1.2);
#427=CIRCLE('',#1151,3.2);
#428=CIRCLE('',#1152,1.35);
#429=CIRCLE('',#1153,1.35);
#430=CIRCLE('',#1154,1.35);
#431=CIRCLE('',#1155,1.35);
#432=CIRCLE('',#1157,3.2);
#433=CIRCLE('',#1159,4.1);
#434=CIRCLE('',#1160,4.1);
#435=CIRCLE('',#1165,1.2);
#436=CIRCLE('',#1169,1.2);
#437=CIRCLE('',#1172,1.2);
#438=CIRCLE('',#1173,0.4);
#439=CIRCLE('',#1176,0.4);
#440=CIRCLE('',#1180,1.);
#441=CIRCLE('',#1183,1.);
#442=CIRCLE('',#1187,1.);
#443=CIRCLE('',#1188,1.);
#444=CIRCLE('',#1189,1.35);
#445=CIRCLE('',#1190,1.35);
#446=CIRCLE('',#1191,1.35);
#447=CIRCLE('',#1192,1.35);
#448=CIRCLE('',#1193,1.35);
#449=CIRCLE('',#1194,1.35);
#450=CIRCLE('',#1195,0.4);
#451=CIRCLE('',#1198,0.400000000000001);
#452=CIRCLE('',#1205,0.4);
#453=CIRCLE('',#1207,1.35);
#454=CIRCLE('',#1208,1.35);
#455=CIRCLE('',#1209,1.35);
#456=CIRCLE('',#1211,0.4);
#457=CIRCLE('',#1215,0.4);
#458=CIRCLE('',#1217,1.35);
#459=CIRCLE('',#1218,1.35);
#460=CIRCLE('',#1219,1.35);
#461=CIRCLE('',#1221,0.4);
#462=CIRCLE('',#1224,1.35);
#463=CIRCLE('',#1226,1.35);
#464=CIRCLE('',#1228,1.35);
#465=CIRCLE('',#1230,1.35);
#466=CIRCLE('',#1232,2.5);
#467=CIRCLE('',#1233,2.5);
#468=CIRCLE('',#1236,2.5);
#469=CIRCLE('',#1237,2.5);
#470=CIRCLE('',#1240,2.5);
#471=CIRCLE('',#1241,2.5);
#472=CIRCLE('',#1244,2.5);
#473=CIRCLE('',#1245,2.5);
#474=VERTEX_POINT('',#1598);
#475=VERTEX_POINT('',#1599);
#476=VERTEX_POINT('',#1603);
#477=VERTEX_POINT('',#1605);
#478=VERTEX_POINT('',#1609);
#479=VERTEX_POINT('',#1611);
#480=VERTEX_POINT('',#1614);
#481=VERTEX_POINT('',#1617);
#482=VERTEX_POINT('',#1619);
#483=VERTEX_POINT('',#1623);
#484=VERTEX_POINT('',#1625);
#485=VERTEX_POINT('',#1627);
#486=VERTEX_POINT('',#1629);
#487=VERTEX_POINT('',#1631);
#488=VERTEX_POINT('',#1634);
#489=VERTEX_POINT('',#1636);
#490=VERTEX_POINT('',#1638);
#491=VERTEX_POINT('',#1640);
#492=VERTEX_POINT('',#1643);
#493=VERTEX_POINT('',#1647);
#494=VERTEX_POINT('',#1649);
#495=VERTEX_POINT('',#1653);
#496=VERTEX_POINT('',#1654);
#497=VERTEX_POINT('',#1656);
#498=VERTEX_POINT('',#1658);
#499=VERTEX_POINT('',#1662);
#500=VERTEX_POINT('',#1664);
#501=VERTEX_POINT('',#1668);
#502=VERTEX_POINT('',#1670);
#503=VERTEX_POINT('',#1675);
#504=VERTEX_POINT('',#1678);
#505=VERTEX_POINT('',#1679);
#506=VERTEX_POINT('',#1681);
#507=VERTEX_POINT('',#1684);
#508=VERTEX_POINT('',#1690);
#509=VERTEX_POINT('',#1692);
#510=VERTEX_POINT('',#1694);
#511=VERTEX_POINT('',#1698);
#512=VERTEX_POINT('',#1702);
#513=VERTEX_POINT('',#1704);
#514=VERTEX_POINT('',#1732);
#515=VERTEX_POINT('',#1733);
#516=VERTEX_POINT('',#1735);
#517=VERTEX_POINT('',#1763);
#518=VERTEX_POINT('',#1764);
#519=VERTEX_POINT('',#1766);
#520=VERTEX_POINT('',#1770);
#521=VERTEX_POINT('',#1772);
#522=VERTEX_POINT('',#1779);
#523=VERTEX_POINT('',#1781);
#524=VERTEX_POINT('',#1790);
#525=VERTEX_POINT('',#1792);
#526=VERTEX_POINT('',#1794);
#527=VERTEX_POINT('',#1796);
#528=VERTEX_POINT('',#1798);
#529=VERTEX_POINT('',#1800);
#530=VERTEX_POINT('',#1804);
#531=VERTEX_POINT('',#1806);
#532=VERTEX_POINT('',#1809);
#533=VERTEX_POINT('',#1811);
#534=VERTEX_POINT('',#1813);
#535=VERTEX_POINT('',#1815);
#536=VERTEX_POINT('',#1817);
#537=VERTEX_POINT('',#1819);
#538=VERTEX_POINT('',#1846);
#539=VERTEX_POINT('',#1847);
#540=VERTEX_POINT('',#1849);
#541=VERTEX_POINT('',#1877);
#542=VERTEX_POINT('',#1878);
#543=VERTEX_POINT('',#1880);
#544=VERTEX_POINT('',#1893);
#545=VERTEX_POINT('',#1898);
#546=VERTEX_POINT('',#1901);
#547=VERTEX_POINT('',#1903);
#548=VERTEX_POINT('',#1905);
#549=VERTEX_POINT('',#1908);
#550=VERTEX_POINT('',#1915);
#551=VERTEX_POINT('',#1919);
#552=VERTEX_POINT('',#1922);
#553=VERTEX_POINT('',#1924);
#554=VERTEX_POINT('',#1926);
#555=VERTEX_POINT('',#1929);
#556=VERTEX_POINT('',#1934);
#557=VERTEX_POINT('',#1938);
#558=VERTEX_POINT('',#1942);
#559=VERTEX_POINT('',#1946);
#560=VERTEX_POINT('',#1950);
#561=VERTEX_POINT('',#1952);
#562=VERTEX_POINT('',#1957);
#563=VERTEX_POINT('',#1959);
#564=VERTEX_POINT('',#1964);
#565=VERTEX_POINT('',#1966);
#566=VERTEX_POINT('',#1971);
#567=VERTEX_POINT('',#1973);
#568=VERTEX_POINT('',#1994);
#569=VERTEX_POINT('',#1996);
#570=EDGE_CURVE('',#474,#475,#418,.T.);
#571=EDGE_CURVE('',#475,#474,#242,.T.);
#572=EDGE_CURVE('',#476,#475,#419,.T.);
#573=EDGE_CURVE('',#476,#477,#420,.T.);
#574=EDGE_CURVE('',#474,#477,#421,.T.);
#575=EDGE_CURVE('',#478,#476,#243,.T.);
#576=EDGE_CURVE('',#478,#479,#244,.T.);
#577=EDGE_CURVE('',#477,#479,#245,.T.);
#578=EDGE_CURVE('',#480,#480,#422,.T.);
#579=EDGE_CURVE('',#481,#478,#423,.T.);
#580=EDGE_CURVE('',#475,#482,#424,.T.);
#581=EDGE_CURVE('',#482,#481,#246,.T.);
#582=EDGE_CURVE('',#483,#481,#247,.T.);
#583=EDGE_CURVE('',#484,#483,#425,.T.);
#584=EDGE_CURVE('',#485,#484,#248,.T.);
#585=EDGE_CURVE('',#486,#485,#426,.T.);
#586=EDGE_CURVE('',#486,#487,#249,.T.);
#587=EDGE_CURVE('',#479,#487,#427,.T.);
#588=EDGE_CURVE('',#488,#488,#428,.T.);
#589=EDGE_CURVE('',#489,#489,#429,.T.);
#590=EDGE_CURVE('',#490,#490,#430,.T.);
#591=EDGE_CURVE('',#491,#491,#431,.T.);
#592=EDGE_CURVE('',#492,#474,#432,.T.);
#593=EDGE_CURVE('',#487,#492,#250,.T.);
#594=EDGE_CURVE('',#493,#493,#433,.T.);
#595=EDGE_CURVE('',#493,#494,#251,.T.);
#596=EDGE_CURVE('',#494,#494,#434,.T.);
#597=EDGE_CURVE('',#495,#496,#252,.T.);
#598=EDGE_CURVE('',#495,#497,#253,.T.);
#599=EDGE_CURVE('',#497,#498,#254,.T.);
#600=EDGE_CURVE('',#496,#498,#255,.T.);
#601=EDGE_CURVE('',#499,#495,#256,.T.);
#602=EDGE_CURVE('',#499,#500,#257,.T.);
#603=EDGE_CURVE('',#500,#497,#258,.T.);
#604=EDGE_CURVE('',#501,#499,#259,.T.);
#605=EDGE_CURVE('',#501,#502,#260,.T.);
#606=EDGE_CURVE('',#502,#500,#261,.T.);
#607=EDGE_CURVE('',#498,#502,#262,.T.);
#608=EDGE_CURVE('',#503,#503,#435,.T.);
#609=EDGE_CURVE('',#504,#505,#263,.T.);
#610=EDGE_CURVE('',#505,#506,#264,.T.);
#611=EDGE_CURVE('',#501,#506,#265,.T.);
#612=EDGE_CURVE('',#507,#496,#266,.T.);
#613=EDGE_CURVE('',#504,#507,#267,.T.);
#614=EDGE_CURVE('',#480,#503,#268,.T.);
#615=EDGE_CURVE('',#485,#508,#269,.T.);
#616=EDGE_CURVE('',#508,#509,#436,.T.);
#617=EDGE_CURVE('',#509,#510,#270,.T.);
#618=EDGE_CURVE('',#510,#486,#271,.T.);
#619=EDGE_CURVE('',#511,#484,#272,.T.);
#620=EDGE_CURVE('',#508,#511,#273,.T.);
#621=EDGE_CURVE('',#483,#512,#274,.T.);
#622=EDGE_CURVE('',#512,#513,#275,.T.);
#623=EDGE_CURVE('',#513,#511,#437,.T.);
#624=EDGE_CURVE('',#514,#515,#438,.T.);
#625=EDGE_CURVE('',#515,#516,#15,.T.);
#626=EDGE_CURVE('',#516,#514,#16,.T.);
#627=EDGE_CURVE('',#517,#518,#439,.T.);
#628=EDGE_CURVE('',#518,#519,#17,.T.);
#629=EDGE_CURVE('',#519,#517,#18,.T.);
#630=EDGE_CURVE('',#518,#520,#276,.T.);
#631=EDGE_CURVE('',#520,#521,#440,.T.);
#632=EDGE_CURVE('',#521,#519,#277,.T.);
#633=EDGE_CURVE('',#515,#517,#278,.T.);
#634=EDGE_CURVE('',#519,#516,#279,.T.);
#635=EDGE_CURVE('',#516,#522,#280,.T.);
#636=EDGE_CURVE('',#522,#523,#441,.T.);
#637=EDGE_CURVE('',#523,#514,#281,.T.);
#638=EDGE_CURVE('',#513,#523,#282,.T.);
#639=EDGE_CURVE('',#514,#512,#283,.T.);
#640=EDGE_CURVE('',#522,#521,#284,.T.);
#641=EDGE_CURVE('',#524,#482,#285,.T.);
#642=EDGE_CURVE('',#492,#525,#286,.T.);
#643=EDGE_CURVE('',#525,#526,#287,.T.);
#644=EDGE_CURVE('',#527,#526,#442,.T.);
#645=EDGE_CURVE('',#527,#528,#288,.T.);
#646=EDGE_CURVE('',#529,#528,#443,.T.);
#647=EDGE_CURVE('',#529,#509,#289,.T.);
#648=EDGE_CURVE('',#520,#524,#290,.T.);
#649=EDGE_CURVE('',#504,#530,#291,.T.);
#650=EDGE_CURVE('',#530,#531,#292,.T.);
#651=EDGE_CURVE('',#531,#505,#293,.T.);
#652=EDGE_CURVE('',#532,#532,#444,.T.);
#653=EDGE_CURVE('',#533,#533,#445,.T.);
#654=EDGE_CURVE('',#534,#534,#446,.T.);
#655=EDGE_CURVE('',#535,#535,#447,.T.);
#656=EDGE_CURVE('',#536,#536,#448,.T.);
#657=EDGE_CURVE('',#537,#537,#449,.T.);
#658=EDGE_CURVE('',#538,#539,#450,.T.);
#659=EDGE_CURVE('',#539,#540,#19,.T.);
#660=EDGE_CURVE('',#540,#538,#20,.T.);
#661=EDGE_CURVE('',#541,#542,#451,.T.);
#662=EDGE_CURVE('',#542,#543,#21,.T.);
#663=EDGE_CURVE('',#543,#541,#22,.T.);
#664=EDGE_CURVE('',#542,#529,#294,.T.);
#665=EDGE_CURVE('',#528,#543,#295,.T.);
#666=EDGE_CURVE('',#539,#541,#296,.T.);
#667=EDGE_CURVE('',#543,#540,#297,.T.);
#668=EDGE_CURVE('',#540,#527,#298,.T.);
#669=EDGE_CURVE('',#526,#538,#299,.T.);
#670=EDGE_CURVE('',#541,#544,#300,.T.);
#671=EDGE_CURVE('',#510,#544,#452,.T.);
#672=EDGE_CURVE('',#510,#542,#301,.T.);
#673=EDGE_CURVE('',#545,#539,#302,.T.);
#674=EDGE_CURVE('',#544,#545,#303,.T.);
#675=EDGE_CURVE('',#546,#546,#453,.T.);
#676=EDGE_CURVE('',#547,#547,#454,.T.);
#677=EDGE_CURVE('',#548,#548,#455,.T.);
#678=EDGE_CURVE('',#538,#549,#304,.T.);
#679=EDGE_CURVE('',#549,#545,#456,.F.);
#680=EDGE_CURVE('',#549,#525,#305,.T.);
#681=EDGE_CURVE('',#512,#550,#457,.F.);
#682=EDGE_CURVE('',#550,#515,#306,.T.);
#683=EDGE_CURVE('',#551,#550,#307,.T.);
#684=EDGE_CURVE('',#517,#551,#308,.T.);
#685=EDGE_CURVE('',#552,#552,#458,.T.);
#686=EDGE_CURVE('',#553,#553,#459,.T.);
#687=EDGE_CURVE('',#554,#554,#460,.T.);
#688=EDGE_CURVE('',#551,#555,#461,.F.);
#689=EDGE_CURVE('',#555,#518,#309,.T.);
#690=EDGE_CURVE('',#556,#556,#462,.T.);
#691=EDGE_CURVE('',#556,#491,#310,.T.);
#692=EDGE_CURVE('',#557,#557,#463,.T.);
#693=EDGE_CURVE('',#557,#490,#311,.T.);
#694=EDGE_CURVE('',#558,#558,#464,.T.);
#695=EDGE_CURVE('',#558,#489,#312,.T.);
#696=EDGE_CURVE('',#559,#559,#465,.T.);
#697=EDGE_CURVE('',#559,#488,#313,.T.);
#698=EDGE_CURVE('',#560,#560,#466,.T.);
#699=EDGE_CURVE('',#560,#561,#314,.T.);
#700=EDGE_CURVE('',#561,#561,#467,.T.);
#701=EDGE_CURVE('',#562,#562,#468,.T.);
#702=EDGE_CURVE('',#562,#563,#315,.T.);
#703=EDGE_CURVE('',#563,#563,#469,.T.);
#704=EDGE_CURVE('',#564,#564,#470,.T.);
#705=EDGE_CURVE('',#564,#565,#316,.T.);
#706=EDGE_CURVE('',#565,#565,#471,.T.);
#707=EDGE_CURVE('',#566,#566,#472,.T.);
#708=EDGE_CURVE('',#566,#567,#317,.T.);
#709=EDGE_CURVE('',#567,#567,#473,.T.);
#710=EDGE_CURVE('',#532,#552,#318,.T.);
#711=EDGE_CURVE('',#533,#546,#319,.T.);
#712=EDGE_CURVE('',#534,#547,#320,.T.);
#713=EDGE_CURVE('',#535,#548,#321,.T.);
#714=EDGE_CURVE('',#536,#553,#322,.T.);
#715=EDGE_CURVE('',#537,#554,#323,.T.);
#716=EDGE_CURVE('',#524,#555,#324,.T.);
#717=EDGE_CURVE('',#568,#507,#325,.T.);
#718=EDGE_CURVE('',#506,#569,#326,.T.);
#719=EDGE_CURVE('',#569,#568,#327,.T.);
#720=EDGE_CURVE('',#530,#568,#328,.T.);
#721=EDGE_CURVE('',#531,#569,#329,.T.);
#722=ORIENTED_EDGE('',*,*,#570,.F.);
#723=ORIENTED_EDGE('',*,*,#571,.F.);
#724=ORIENTED_EDGE('',*,*,#570,.T.);
#725=ORIENTED_EDGE('',*,*,#572,.F.);
#726=ORIENTED_EDGE('',*,*,#573,.T.);
#727=ORIENTED_EDGE('',*,*,#574,.F.);
#728=ORIENTED_EDGE('',*,*,#573,.F.);
#729=ORIENTED_EDGE('',*,*,#575,.F.);
#730=ORIENTED_EDGE('',*,*,#576,.T.);
#731=ORIENTED_EDGE('',*,*,#577,.F.);
#732=ORIENTED_EDGE('',*,*,#578,.T.);
#733=ORIENTED_EDGE('',*,*,#579,.T.);
#734=ORIENTED_EDGE('',*,*,#575,.T.);
#735=ORIENTED_EDGE('',*,*,#572,.T.);
#736=ORIENTED_EDGE('',*,*,#580,.T.);
#737=ORIENTED_EDGE('',*,*,#581,.T.);
#738=ORIENTED_EDGE('',*,*,#579,.F.);
#739=ORIENTED_EDGE('',*,*,#582,.F.);
#740=ORIENTED_EDGE('',*,*,#583,.F.);
#741=ORIENTED_EDGE('',*,*,#584,.F.);
#742=ORIENTED_EDGE('',*,*,#585,.F.);
#743=ORIENTED_EDGE('',*,*,#586,.T.);
#744=ORIENTED_EDGE('',*,*,#587,.F.);
#745=ORIENTED_EDGE('',*,*,#576,.F.);
#746=ORIENTED_EDGE('',*,*,#588,.F.);
#747=ORIENTED_EDGE('',*,*,#589,.F.);
#748=ORIENTED_EDGE('',*,*,#590,.F.);
#749=ORIENTED_EDGE('',*,*,#591,.F.);
#750=ORIENTED_EDGE('',*,*,#592,.T.);
#751=ORIENTED_EDGE('',*,*,#574,.T.);
#752=ORIENTED_EDGE('',*,*,#577,.T.);
#753=ORIENTED_EDGE('',*,*,#587,.T.);
#754=ORIENTED_EDGE('',*,*,#593,.T.);
#755=ORIENTED_EDGE('',*,*,#594,.F.);
#756=ORIENTED_EDGE('',*,*,#595,.T.);
#757=ORIENTED_EDGE('',*,*,#596,.F.);
#758=ORIENTED_EDGE('',*,*,#595,.F.);
#759=ORIENTED_EDGE('',*,*,#597,.F.);
#760=ORIENTED_EDGE('',*,*,#598,.T.);
#761=ORIENTED_EDGE('',*,*,#599,.T.);
#762=ORIENTED_EDGE('',*,*,#600,.F.);
#763=ORIENTED_EDGE('',*,*,#601,.F.);
#764=ORIENTED_EDGE('',*,*,#602,.T.);
#765=ORIENTED_EDGE('',*,*,#603,.T.);
#766=ORIENTED_EDGE('',*,*,#598,.F.);
#767=ORIENTED_EDGE('',*,*,#604,.F.);
#768=ORIENTED_EDGE('',*,*,#605,.T.);
#769=ORIENTED_EDGE('',*,*,#606,.T.);
#770=ORIENTED_EDGE('',*,*,#602,.F.);
#771=ORIENTED_EDGE('',*,*,#606,.F.);
#772=ORIENTED_EDGE('',*,*,#607,.F.);
#773=ORIENTED_EDGE('',*,*,#599,.F.);
#774=ORIENTED_EDGE('',*,*,#603,.F.);
#775=ORIENTED_EDGE('',*,*,#608,.F.);
#776=ORIENTED_EDGE('',*,*,#609,.T.);
#777=ORIENTED_EDGE('',*,*,#610,.T.);
#778=ORIENTED_EDGE('',*,*,#611,.F.);
#779=ORIENTED_EDGE('',*,*,#604,.T.);
#780=ORIENTED_EDGE('',*,*,#601,.T.);
#781=ORIENTED_EDGE('',*,*,#597,.T.);
#782=ORIENTED_EDGE('',*,*,#612,.F.);
#783=ORIENTED_EDGE('',*,*,#613,.F.);
#784=ORIENTED_EDGE('',*,*,#578,.F.);
#785=ORIENTED_EDGE('',*,*,#614,.T.);
#786=ORIENTED_EDGE('',*,*,#608,.T.);
#787=ORIENTED_EDGE('',*,*,#614,.F.);
#788=ORIENTED_EDGE('',*,*,#585,.T.);
#789=ORIENTED_EDGE('',*,*,#615,.T.);
#790=ORIENTED_EDGE('',*,*,#616,.T.);
#791=ORIENTED_EDGE('',*,*,#617,.T.);
#792=ORIENTED_EDGE('',*,*,#618,.T.);
#793=ORIENTED_EDGE('',*,*,#584,.T.);
#794=ORIENTED_EDGE('',*,*,#619,.F.);
#795=ORIENTED_EDGE('',*,*,#620,.F.);
#796=ORIENTED_EDGE('',*,*,#615,.F.);
#797=ORIENTED_EDGE('',*,*,#594,.T.);
#798=ORIENTED_EDGE('',*,*,#583,.T.);
#799=ORIENTED_EDGE('',*,*,#621,.T.);
#800=ORIENTED_EDGE('',*,*,#622,.T.);
#801=ORIENTED_EDGE('',*,*,#623,.T.);
#802=ORIENTED_EDGE('',*,*,#619,.T.);
#803=ORIENTED_EDGE('',*,*,#624,.T.);
#804=ORIENTED_EDGE('',*,*,#625,.T.);
#805=ORIENTED_EDGE('',*,*,#626,.T.);
#806=ORIENTED_EDGE('',*,*,#627,.T.);
#807=ORIENTED_EDGE('',*,*,#628,.T.);
#808=ORIENTED_EDGE('',*,*,#629,.T.);
#809=ORIENTED_EDGE('',*,*,#628,.F.);
#810=ORIENTED_EDGE('',*,*,#630,.T.);
#811=ORIENTED_EDGE('',*,*,#631,.T.);
#812=ORIENTED_EDGE('',*,*,#632,.T.);
#813=ORIENTED_EDGE('',*,*,#625,.F.);
#814=ORIENTED_EDGE('',*,*,#633,.T.);
#815=ORIENTED_EDGE('',*,*,#629,.F.);
#816=ORIENTED_EDGE('',*,*,#634,.T.);
#817=ORIENTED_EDGE('',*,*,#626,.F.);
#818=ORIENTED_EDGE('',*,*,#635,.T.);
#819=ORIENTED_EDGE('',*,*,#636,.T.);
#820=ORIENTED_EDGE('',*,*,#637,.T.);
#821=ORIENTED_EDGE('',*,*,#637,.F.);
#822=ORIENTED_EDGE('',*,*,#638,.F.);
#823=ORIENTED_EDGE('',*,*,#622,.F.);
#824=ORIENTED_EDGE('',*,*,#639,.F.);
#825=ORIENTED_EDGE('',*,*,#635,.F.);
#826=ORIENTED_EDGE('',*,*,#634,.F.);
#827=ORIENTED_EDGE('',*,*,#632,.F.);
#828=ORIENTED_EDGE('',*,*,#640,.F.);
#829=ORIENTED_EDGE('',*,*,#641,.T.);
#830=ORIENTED_EDGE('',*,*,#580,.F.);
#831=ORIENTED_EDGE('',*,*,#571,.T.);
#832=ORIENTED_EDGE('',*,*,#592,.F.);
#833=ORIENTED_EDGE('',*,*,#642,.T.);
#834=ORIENTED_EDGE('',*,*,#643,.T.);
#835=ORIENTED_EDGE('',*,*,#644,.F.);
#836=ORIENTED_EDGE('',*,*,#645,.T.);
#837=ORIENTED_EDGE('',*,*,#646,.F.);
#838=ORIENTED_EDGE('',*,*,#647,.T.);
#839=ORIENTED_EDGE('',*,*,#616,.F.);
#840=ORIENTED_EDGE('',*,*,#620,.T.);
#841=ORIENTED_EDGE('',*,*,#623,.F.);
#842=ORIENTED_EDGE('',*,*,#638,.T.);
#843=ORIENTED_EDGE('',*,*,#636,.F.);
#844=ORIENTED_EDGE('',*,*,#640,.T.);
#845=ORIENTED_EDGE('',*,*,#631,.F.);
#846=ORIENTED_EDGE('',*,*,#648,.T.);
#847=ORIENTED_EDGE('',*,*,#649,.T.);
#848=ORIENTED_EDGE('',*,*,#650,.T.);
#849=ORIENTED_EDGE('',*,*,#651,.T.);
#850=ORIENTED_EDGE('',*,*,#609,.F.);
#851=ORIENTED_EDGE('',*,*,#652,.T.);
#852=ORIENTED_EDGE('',*,*,#653,.T.);
#853=ORIENTED_EDGE('',*,*,#654,.T.);
#854=ORIENTED_EDGE('',*,*,#655,.T.);
#855=ORIENTED_EDGE('',*,*,#656,.T.);
#856=ORIENTED_EDGE('',*,*,#657,.T.);
#857=ORIENTED_EDGE('',*,*,#658,.T.);
#858=ORIENTED_EDGE('',*,*,#659,.T.);
#859=ORIENTED_EDGE('',*,*,#660,.T.);
#860=ORIENTED_EDGE('',*,*,#661,.T.);
#861=ORIENTED_EDGE('',*,*,#662,.T.);
#862=ORIENTED_EDGE('',*,*,#663,.T.);
#863=ORIENTED_EDGE('',*,*,#662,.F.);
#864=ORIENTED_EDGE('',*,*,#664,.T.);
#865=ORIENTED_EDGE('',*,*,#646,.T.);
#866=ORIENTED_EDGE('',*,*,#665,.T.);
#867=ORIENTED_EDGE('',*,*,#659,.F.);
#868=ORIENTED_EDGE('',*,*,#666,.T.);
#869=ORIENTED_EDGE('',*,*,#663,.F.);
#870=ORIENTED_EDGE('',*,*,#667,.T.);
#871=ORIENTED_EDGE('',*,*,#660,.F.);
#872=ORIENTED_EDGE('',*,*,#668,.T.);
#873=ORIENTED_EDGE('',*,*,#644,.T.);
#874=ORIENTED_EDGE('',*,*,#669,.T.);
#875=ORIENTED_EDGE('',*,*,#661,.F.);
#876=ORIENTED_EDGE('',*,*,#670,.T.);
#877=ORIENTED_EDGE('',*,*,#671,.F.);
#878=ORIENTED_EDGE('',*,*,#672,.T.);
#879=ORIENTED_EDGE('',*,*,#666,.F.);
#880=ORIENTED_EDGE('',*,*,#673,.F.);
#881=ORIENTED_EDGE('',*,*,#674,.F.);
#882=ORIENTED_EDGE('',*,*,#670,.F.);
#883=ORIENTED_EDGE('',*,*,#675,.T.);
#884=ORIENTED_EDGE('',*,*,#676,.T.);
#885=ORIENTED_EDGE('',*,*,#677,.T.);
#886=ORIENTED_EDGE('',*,*,#658,.F.);
#887=ORIENTED_EDGE('',*,*,#678,.T.);
#888=ORIENTED_EDGE('',*,*,#679,.T.);
#889=ORIENTED_EDGE('',*,*,#673,.T.);
#890=ORIENTED_EDGE('',*,*,#669,.F.);
#891=ORIENTED_EDGE('',*,*,#643,.F.);
#892=ORIENTED_EDGE('',*,*,#680,.F.);
#893=ORIENTED_EDGE('',*,*,#678,.F.);
#894=ORIENTED_EDGE('',*,*,#664,.F.);
#895=ORIENTED_EDGE('',*,*,#672,.F.);
#896=ORIENTED_EDGE('',*,*,#617,.F.);
#897=ORIENTED_EDGE('',*,*,#647,.F.);
#898=ORIENTED_EDGE('',*,*,#624,.F.);
#899=ORIENTED_EDGE('',*,*,#639,.T.);
#900=ORIENTED_EDGE('',*,*,#681,.T.);
#901=ORIENTED_EDGE('',*,*,#682,.T.);
#902=ORIENTED_EDGE('',*,*,#633,.F.);
#903=ORIENTED_EDGE('',*,*,#682,.F.);
#904=ORIENTED_EDGE('',*,*,#683,.F.);
#905=ORIENTED_EDGE('',*,*,#684,.F.);
#906=ORIENTED_EDGE('',*,*,#685,.T.);
#907=ORIENTED_EDGE('',*,*,#686,.T.);
#908=ORIENTED_EDGE('',*,*,#687,.T.);
#909=ORIENTED_EDGE('',*,*,#627,.F.);
#910=ORIENTED_EDGE('',*,*,#684,.T.);
#911=ORIENTED_EDGE('',*,*,#688,.T.);
#912=ORIENTED_EDGE('',*,*,#689,.T.);
#913=ORIENTED_EDGE('',*,*,#593,.F.);
#914=ORIENTED_EDGE('',*,*,#586,.F.);
#915=ORIENTED_EDGE('',*,*,#618,.F.);
#916=ORIENTED_EDGE('',*,*,#671,.T.);
#917=ORIENTED_EDGE('',*,*,#674,.T.);
#918=ORIENTED_EDGE('',*,*,#679,.F.);
#919=ORIENTED_EDGE('',*,*,#680,.T.);
#920=ORIENTED_EDGE('',*,*,#642,.F.);
#921=ORIENTED_EDGE('',*,*,#690,.F.);
#922=ORIENTED_EDGE('',*,*,#691,.T.);
#923=ORIENTED_EDGE('',*,*,#591,.T.);
#924=ORIENTED_EDGE('',*,*,#691,.F.);
#925=ORIENTED_EDGE('',*,*,#692,.F.);
#926=ORIENTED_EDGE('',*,*,#693,.T.);
#927=ORIENTED_EDGE('',*,*,#590,.T.);
#928=ORIENTED_EDGE('',*,*,#693,.F.);
#929=ORIENTED_EDGE('',*,*,#694,.F.);
#930=ORIENTED_EDGE('',*,*,#695,.T.);
#931=ORIENTED_EDGE('',*,*,#589,.T.);
#932=ORIENTED_EDGE('',*,*,#695,.F.);
#933=ORIENTED_EDGE('',*,*,#696,.F.);
#934=ORIENTED_EDGE('',*,*,#697,.T.);
#935=ORIENTED_EDGE('',*,*,#588,.T.);
#936=ORIENTED_EDGE('',*,*,#697,.F.);
#937=ORIENTED_EDGE('',*,*,#698,.F.);
#938=ORIENTED_EDGE('',*,*,#699,.T.);
#939=ORIENTED_EDGE('',*,*,#700,.T.);
#940=ORIENTED_EDGE('',*,*,#699,.F.);
#941=ORIENTED_EDGE('',*,*,#700,.F.);
#942=ORIENTED_EDGE('',*,*,#694,.T.);
#943=ORIENTED_EDGE('',*,*,#701,.F.);
#944=ORIENTED_EDGE('',*,*,#702,.T.);
#945=ORIENTED_EDGE('',*,*,#703,.T.);
#946=ORIENTED_EDGE('',*,*,#702,.F.);
#947=ORIENTED_EDGE('',*,*,#703,.F.);
#948=ORIENTED_EDGE('',*,*,#692,.T.);
#949=ORIENTED_EDGE('',*,*,#704,.F.);
#950=ORIENTED_EDGE('',*,*,#705,.T.);
#951=ORIENTED_EDGE('',*,*,#706,.T.);
#952=ORIENTED_EDGE('',*,*,#705,.F.);
#953=ORIENTED_EDGE('',*,*,#706,.F.);
#954=ORIENTED_EDGE('',*,*,#690,.T.);
#955=ORIENTED_EDGE('',*,*,#707,.F.);
#956=ORIENTED_EDGE('',*,*,#708,.T.);
#957=ORIENTED_EDGE('',*,*,#709,.T.);
#958=ORIENTED_EDGE('',*,*,#708,.F.);
#959=ORIENTED_EDGE('',*,*,#709,.F.);
#960=ORIENTED_EDGE('',*,*,#696,.T.);
#961=ORIENTED_EDGE('',*,*,#652,.F.);
#962=ORIENTED_EDGE('',*,*,#710,.T.);
#963=ORIENTED_EDGE('',*,*,#685,.F.);
#964=ORIENTED_EDGE('',*,*,#710,.F.);
#965=ORIENTED_EDGE('',*,*,#653,.F.);
#966=ORIENTED_EDGE('',*,*,#711,.T.);
#967=ORIENTED_EDGE('',*,*,#675,.F.);
#968=ORIENTED_EDGE('',*,*,#711,.F.);
#969=ORIENTED_EDGE('',*,*,#654,.F.);
#970=ORIENTED_EDGE('',*,*,#712,.T.);
#971=ORIENTED_EDGE('',*,*,#676,.F.);
#972=ORIENTED_EDGE('',*,*,#712,.F.);
#973=ORIENTED_EDGE('',*,*,#655,.F.);
#974=ORIENTED_EDGE('',*,*,#713,.T.);
#975=ORIENTED_EDGE('',*,*,#677,.F.);
#976=ORIENTED_EDGE('',*,*,#713,.F.);
#977=ORIENTED_EDGE('',*,*,#656,.F.);
#978=ORIENTED_EDGE('',*,*,#714,.T.);
#979=ORIENTED_EDGE('',*,*,#686,.F.);
#980=ORIENTED_EDGE('',*,*,#714,.F.);
#981=ORIENTED_EDGE('',*,*,#657,.F.);
#982=ORIENTED_EDGE('',*,*,#715,.T.);
#983=ORIENTED_EDGE('',*,*,#687,.F.);
#984=ORIENTED_EDGE('',*,*,#715,.F.);
#985=ORIENTED_EDGE('',*,*,#630,.F.);
#986=ORIENTED_EDGE('',*,*,#689,.F.);
#987=ORIENTED_EDGE('',*,*,#716,.F.);
#988=ORIENTED_EDGE('',*,*,#648,.F.);
#989=ORIENTED_EDGE('',*,*,#665,.F.);
#990=ORIENTED_EDGE('',*,*,#645,.F.);
#991=ORIENTED_EDGE('',*,*,#668,.F.);
#992=ORIENTED_EDGE('',*,*,#667,.F.);
#993=ORIENTED_EDGE('',*,*,#581,.F.);
#994=ORIENTED_EDGE('',*,*,#641,.F.);
#995=ORIENTED_EDGE('',*,*,#716,.T.);
#996=ORIENTED_EDGE('',*,*,#688,.F.);
#997=ORIENTED_EDGE('',*,*,#683,.T.);
#998=ORIENTED_EDGE('',*,*,#681,.F.);
#999=ORIENTED_EDGE('',*,*,#621,.F.);
#1000=ORIENTED_EDGE('',*,*,#582,.T.);
#1001=ORIENTED_EDGE('',*,*,#717,.T.);
#1002=ORIENTED_EDGE('',*,*,#612,.T.);
#1003=ORIENTED_EDGE('',*,*,#600,.T.);
#1004=ORIENTED_EDGE('',*,*,#607,.T.);
#1005=ORIENTED_EDGE('',*,*,#605,.F.);
#1006=ORIENTED_EDGE('',*,*,#611,.T.);
#1007=ORIENTED_EDGE('',*,*,#718,.T.);
#1008=ORIENTED_EDGE('',*,*,#719,.T.);
#1009=ORIENTED_EDGE('',*,*,#698,.T.);
#1010=ORIENTED_EDGE('',*,*,#701,.T.);
#1011=ORIENTED_EDGE('',*,*,#704,.T.);
#1012=ORIENTED_EDGE('',*,*,#707,.T.);
#1013=ORIENTED_EDGE('',*,*,#613,.T.);
#1014=ORIENTED_EDGE('',*,*,#717,.F.);
#1015=ORIENTED_EDGE('',*,*,#720,.F.);
#1016=ORIENTED_EDGE('',*,*,#649,.F.);
#1017=ORIENTED_EDGE('',*,*,#650,.F.);
#1018=ORIENTED_EDGE('',*,*,#720,.T.);
#1019=ORIENTED_EDGE('',*,*,#719,.F.);
#1020=ORIENTED_EDGE('',*,*,#721,.F.);
#1021=ORIENTED_EDGE('',*,*,#596,.T.);
#1022=ORIENTED_EDGE('',*,*,#721,.T.);
#1023=ORIENTED_EDGE('',*,*,#718,.F.);
#1024=ORIENTED_EDGE('',*,*,#610,.F.);
#1025=ORIENTED_EDGE('',*,*,#651,.F.);
#1026=PLANE('',#1137);
#1027=PLANE('',#1143);
#1028=PLANE('',#1148);
#1029=PLANE('',#1161);
#1030=PLANE('',#1162);
#1031=PLANE('',#1163);
#1032=PLANE('',#1164);
#1033=PLANE('',#1166);
#1034=PLANE('',#1170);
#1035=PLANE('',#1184);
#1036=PLANE('',#1185);
#1037=PLANE('',#1186);
#1038=PLANE('',#1206);
#1039=PLANE('',#1212);
#1040=PLANE('',#1213);
#1041=PLANE('',#1216);
#1042=PLANE('',#1222);
#1043=PLANE('',#1234);
#1044=PLANE('',#1238);
#1045=PLANE('',#1242);
#1046=PLANE('',#1246);
#1047=PLANE('',#1253);
#1048=PLANE('',#1254);
#1049=PLANE('',#1255);
#1050=PLANE('',#1256);
#1051=PLANE('',#1257);
#1052=PLANE('',#1258);
#1053=PLANE('',#1259);
#1054=ADVANCED_FACE('',(#87),#1026,.T.);
#1055=ADVANCED_FACE('',(#88),#86,.T.);
#1056=ADVANCED_FACE('',(#89,#57),#1027,.T.);
#1057=ADVANCED_FACE('',(#90),#27,.T.);
#1058=ADVANCED_FACE('',(#91,#58,#59,#60,#61),#1028,.T.);
#1059=ADVANCED_FACE('',(#92),#28,.T.);
#1060=ADVANCED_FACE('',(#93),#29,.F.);
#1061=ADVANCED_FACE('',(#94),#1029,.F.);
#1062=ADVANCED_FACE('',(#95),#1030,.F.);
#1063=ADVANCED_FACE('',(#96),#1031,.F.);
#1064=ADVANCED_FACE('',(#97,#62),#1032,.T.);
#1065=ADVANCED_FACE('',(#98),#1033,.T.);
#1066=ADVANCED_FACE('',(#99),#30,.F.);
#1067=ADVANCED_FACE('',(#100),#31,.T.);
#1068=ADVANCED_FACE('',(#101,#63),#1034,.T.);
#1069=ADVANCED_FACE('',(#102),#32,.T.);
#1070=ADVANCED_FACE('',(#103),#23,.F.);
#1071=ADVANCED_FACE('',(#104),#24,.F.);
#1072=ADVANCED_FACE('',(#105),#33,.T.);
#1073=ADVANCED_FACE('',(#106),#34,.T.);
#1074=ADVANCED_FACE('',(#107),#35,.T.);
#1075=ADVANCED_FACE('',(#108),#1035,.T.);
#1076=ADVANCED_FACE('',(#109),#1036,.T.);
#1077=ADVANCED_FACE('',(#110,#64,#65,#66,#67,#68,#69,#70),#1037,.T.);
#1078=ADVANCED_FACE('',(#111),#25,.F.);
#1079=ADVANCED_FACE('',(#112),#26,.F.);
#1080=ADVANCED_FACE('',(#113),#36,.T.);
#1081=ADVANCED_FACE('',(#114),#37,.T.);
#1082=ADVANCED_FACE('',(#115),#38,.T.);
#1083=ADVANCED_FACE('',(#116),#39,.T.);
#1084=ADVANCED_FACE('',(#117,#71,#72,#73),#1038,.T.);
#1085=ADVANCED_FACE('',(#118),#40,.T.);
#1086=ADVANCED_FACE('',(#119),#1039,.T.);
#1087=ADVANCED_FACE('',(#120),#1040,.T.);
#1088=ADVANCED_FACE('',(#121),#41,.T.);
#1089=ADVANCED_FACE('',(#122,#74,#75,#76),#1041,.T.);
#1090=ADVANCED_FACE('',(#123),#42,.T.);
#1091=ADVANCED_FACE('',(#124),#1042,.T.);
#1092=ADVANCED_FACE('',(#125),#43,.F.);
#1093=ADVANCED_FACE('',(#126),#44,.F.);
#1094=ADVANCED_FACE('',(#127),#45,.F.);
#1095=ADVANCED_FACE('',(#128),#46,.F.);
#1096=ADVANCED_FACE('',(#129),#47,.F.);
#1097=ADVANCED_FACE('',(#130,#77),#1043,.T.);
#1098=ADVANCED_FACE('',(#131),#48,.F.);
#1099=ADVANCED_FACE('',(#132,#78),#1044,.T.);
#1100=ADVANCED_FACE('',(#133),#49,.F.);
#1101=ADVANCED_FACE('',(#134,#79),#1045,.T.);
#1102=ADVANCED_FACE('',(#135),#50,.F.);
#1103=ADVANCED_FACE('',(#136,#80),#1046,.T.);
#1104=ADVANCED_FACE('',(#137),#51,.F.);
#1105=ADVANCED_FACE('',(#138),#52,.F.);
#1106=ADVANCED_FACE('',(#139),#53,.F.);
#1107=ADVANCED_FACE('',(#140),#54,.F.);
#1108=ADVANCED_FACE('',(#141),#55,.F.);
#1109=ADVANCED_FACE('',(#142),#56,.F.);
#1110=ADVANCED_FACE('',(#143),#1047,.T.);
#1111=ADVANCED_FACE('',(#144),#1048,.T.);
#1112=ADVANCED_FACE('',(#145),#1049,.T.);
#1113=ADVANCED_FACE('',(#146,#81,#82,#83,#84),#1050,.F.);
#1114=ADVANCED_FACE('',(#147),#1051,.T.);
#1115=ADVANCED_FACE('',(#148,#85),#1052,.T.);
#1116=ADVANCED_FACE('',(#149),#1053,.T.);
#1117=CLOSED_SHELL('',(#1054,#1055,#1056,#1057,#1058,#1059,#1060,#1061,
#1062,#1063,#1064,#1065,#1066,#1067,#1068,#1069,#1070,#1071,#1072,#1073,
#1074,#1075,#1076,#1077,#1078,#1079,#1080,#1081,#1082,#1083,#1084,#1085,
#1086,#1087,#1088,#1089,#1090,#1091,#1092,#1093,#1094,#1095,#1096,#1097,
#1098,#1099,#1100,#1101,#1102,#1103,#1104,#1105,#1106,#1107,#1108,#1109,
#1110,#1111,#1112,#1113,#1114,#1115,#1116));
#1118=DERIVED_UNIT_ELEMENT(#1120,1.);
#1119=DERIVED_UNIT_ELEMENT(#2009,3.);
#1120=(
MASS_UNIT()
NAMED_UNIT(*)
SI_UNIT($,.GRAM.)
);
#1121=DERIVED_UNIT((#1118,#1119));
#1122=MEASURE_REPRESENTATION_ITEM('density measure',
POSITIVE_RATIO_MEASURE(1.),#1121);
#1123=PROPERTY_DEFINITION_REPRESENTATION(#1128,#1125);
#1124=PROPERTY_DEFINITION_REPRESENTATION(#1129,#1126);
#1125=REPRESENTATION('material name',(#1127),#2006);
#1126=REPRESENTATION('density',(#1122),#2006);
#1127=DESCRIPTIVE_REPRESENTATION_ITEM('Generic','Generic');
#1128=PROPERTY_DEFINITION('material property','material name',#2016);
#1129=PROPERTY_DEFINITION('material property','density of part',#2016);
#1130=DATE_TIME_ROLE('creation_date');
#1131=APPLIED_DATE_AND_TIME_ASSIGNMENT(#1132,#1130,(#2016));
#1132=DATE_AND_TIME(#1133,#1134);
#1133=CALENDAR_DATE(2020,7,9);
#1134=LOCAL_TIME(0,0,0.,#1135);
#1135=COORDINATED_UNIVERSAL_TIME_OFFSET(0,0,.BEHIND.);
#1136=AXIS2_PLACEMENT_3D('placement',#1596,#1260,#1261);
#1137=AXIS2_PLACEMENT_3D('',#1597,#1262,#1263);
#1138=AXIS2_PLACEMENT_3D('',#1600,#1264,#1265);
#1139=AXIS2_PLACEMENT_3D('',#1602,#1267,#1268);
#1140=AXIS2_PLACEMENT_3D('',#1604,#1269,#1270);
#1141=AXIS2_PLACEMENT_3D('',#1606,#1271,#1272);
#1142=AXIS2_PLACEMENT_3D('',#1607,#1273,#1274);
#1143=AXIS2_PLACEMENT_3D('',#1608,#1275,#1276);
#1144=AXIS2_PLACEMENT_3D('',#1615,#1280,#1281);
#1145=AXIS2_PLACEMENT_3D('',#1616,#1282,#1283);
#1146=AXIS2_PLACEMENT_3D('',#1618,#1284,#1285);
#1147=AXIS2_PLACEMENT_3D('',#1620,#1286,#1287);
#1148=AXIS2_PLACEMENT_3D('',#1622,#1289,#1290);
#1149=AXIS2_PLACEMENT_3D('',#1626,#1292,#1293);
#1150=AXIS2_PLACEMENT_3D('',#1630,#1295,#1296);
#1151=AXIS2_PLACEMENT_3D('',#1633,#1298,#1299);
#1152=AXIS2_PLACEMENT_3D('',#1635,#1300,#1301);
#1153=AXIS2_PLACEMENT_3D('',#1637,#1302,#1303);
#1154=AXIS2_PLACEMENT_3D('',#1639,#1304,#1305);
#1155=AXIS2_PLACEMENT_3D('',#1641,#1306,#1307);
#1156=AXIS2_PLACEMENT_3D('',#1642,#1308,#1309);
#1157=AXIS2_PLACEMENT_3D('',#1644,#1310,#1311);
#1158=AXIS2_PLACEMENT_3D('',#1646,#1313,#1314);
#1159=AXIS2_PLACEMENT_3D('',#1648,#1315,#1316);
#1160=AXIS2_PLACEMENT_3D('',#1651,#1318,#1319);
#1161=AXIS2_PLACEMENT_3D('',#1652,#1320,#1321);
#1162=AXIS2_PLACEMENT_3D('',#1661,#1326,#1327);
#1163=AXIS2_PLACEMENT_3D('',#1667,#1331,#1332);
#1164=AXIS2_PLACEMENT_3D('',#1673,#1336,#1337);
#1165=AXIS2_PLACEMENT_3D('',#1676,#1339,#1340);
#1166=AXIS2_PLACEMENT_3D('',#1677,#1341,#1342);
#1167=AXIS2_PLACEMENT_3D('',#1687,#1348,#1349);
#1168=AXIS2_PLACEMENT_3D('',#1689,#1351,#1352);
#1169=AXIS2_PLACEMENT_3D('',#1693,#1354,#1355);
#1170=AXIS2_PLACEMENT_3D('',#1697,#1358,#1359);
#1171=AXIS2_PLACEMENT_3D('',#1701,#1362,#1363);
#1172=AXIS2_PLACEMENT_3D('',#1706,#1366,#1367);
#1173=AXIS2_PLACEMENT_3D('',#1734,#1368,#1369);
#1174=AXIS2_PLACEMENT_3D('',#1736,#1370,#1371);
#1175=AXIS2_PLACEMENT_3D('',#1737,#1372,#1373);
#1176=AXIS2_PLACEMENT_3D('',#1765,#1374,#1375);
#1177=AXIS2_PLACEMENT_3D('',#1767,#1376,#1377);
#1178=AXIS2_PLACEMENT_3D('',#1768,#1378,#1379);
#1179=AXIS2_PLACEMENT_3D('',#1769,#1380,#1381);
#1180=AXIS2_PLACEMENT_3D('',#1773,#1383,#1384);
#1181=AXIS2_PLACEMENT_3D('',#1775,#1386,#1387);
#1182=AXIS2_PLACEMENT_3D('',#1778,#1390,#1391);
#1183=AXIS2_PLACEMENT_3D('',#1782,#1393,#1394);
#1184=AXIS2_PLACEMENT_3D('',#1784,#1396,#1397);
#1185=AXIS2_PLACEMENT_3D('',#1787,#1400,#1401);
#1186=AXIS2_PLACEMENT_3D('',#1789,#1403,#1404);
#1187=AXIS2_PLACEMENT_3D('',#1797,#1408,#1409);
#1188=AXIS2_PLACEMENT_3D('',#1801,#1411,#1412);
#1189=AXIS2_PLACEMENT_3D('',#1810,#1418,#1419);
#1190=AXIS2_PLACEMENT_3D('',#1812,#1420,#1421);
#1191=AXIS2_PLACEMENT_3D('',#1814,#1422,#1423);
#1192=AXIS2_PLACEMENT_3D('',#1816,#1424,#1425);
#1193=AXIS2_PLACEMENT_3D('',#1818,#1426,#1427);
#1194=AXIS2_PLACEMENT_3D('',#1820,#1428,#1429);
#1195=AXIS2_PLACEMENT_3D('',#1848,#1430,#1431);
#1196=AXIS2_PLACEMENT_3D('',#1850,#1432,#1433);
#1197=AXIS2_PLACEMENT_3D('',#1851,#1434,#1435);
#1198=AXIS2_PLACEMENT_3D('',#1879,#1436,#1437);
#1199=AXIS2_PLACEMENT_3D('',#1881,#1438,#1439);
#1200=AXIS2_PLACEMENT_3D('',#1882,#1440,#1441);
#1201=AXIS2_PLACEMENT_3D('',#1883,#1442,#1443);
#1202=AXIS2_PLACEMENT_3D('',#1886,#1446,#1447);
#1203=AXIS2_PLACEMENT_3D('',#1889,#1450,#1451);
#1204=AXIS2_PLACEMENT_3D('',#1892,#1454,#1455);
#1205=AXIS2_PLACEMENT_3D('',#1895,#1457,#1458);
#1206=AXIS2_PLACEMENT_3D('',#1897,#1460,#1461);
#1207=AXIS2_PLACEMENT_3D('',#1902,#1464,#1465);
#1208=AXIS2_PLACEMENT_3D('',#1904,#1466,#1467);
#1209=AXIS2_PLACEMENT_3D('',#1906,#1468,#1469);
#1210=AXIS2_PLACEMENT_3D('',#1907,#1470,#1471);
#1211=AXIS2_PLACEMENT_3D('',#1910,#1473,#1474);
#1212=AXIS2_PLACEMENT_3D('',#1911,#1475,#1476);
#1213=AXIS2_PLACEMENT_3D('',#1913,#1478,#1479);
#1214=AXIS2_PLACEMENT_3D('',#1914,#1480,#1481);
#1215=AXIS2_PLACEMENT_3D('',#1916,#1482,#1483);
#1216=AXIS2_PLACEMENT_3D('',#1918,#1485,#1486);
#1217=AXIS2_PLACEMENT_3D('',#1923,#1489,#1490);
#1218=AXIS2_PLACEMENT_3D('',#1925,#1491,#1492);
#1219=AXIS2_PLACEMENT_3D('',#1927,#1493,#1494);
#1220=AXIS2_PLACEMENT_3D('',#1928,#1495,#1496);
#1221=AXIS2_PLACEMENT_3D('',#1930,#1497,#1498);
#1222=AXIS2_PLACEMENT_3D('',#1932,#1500,#1501);
#1223=AXIS2_PLACEMENT_3D('',#1933,#1502,#1503);
#1224=AXIS2_PLACEMENT_3D('',#1935,#1504,#1505);
#1225=AXIS2_PLACEMENT_3D('',#1937,#1507,#1508);
#1226=AXIS2_PLACEMENT_3D('',#1939,#1509,#1510);
#1227=AXIS2_PLACEMENT_3D('',#1941,#1512,#1513);
#1228=AXIS2_PLACEMENT_3D('',#1943,#1514,#1515);
#1229=AXIS2_PLACEMENT_3D('',#1945,#1517,#1518);
#1230=AXIS2_PLACEMENT_3D('',#1947,#1519,#1520);
#1231=AXIS2_PLACEMENT_3D('',#1949,#1522,#1523);
#1232=AXIS2_PLACEMENT_3D('',#1951,#1524,#1525);
#1233=AXIS2_PLACEMENT_3D('',#1954,#1527,#1528);
#1234=AXIS2_PLACEMENT_3D('',#1955,#1529,#1530);
#1235=AXIS2_PLACEMENT_3D('',#1956,#1531,#1532);
#1236=AXIS2_PLACEMENT_3D('',#1958,#1533,#1534);
#1237=AXIS2_PLACEMENT_3D('',#1961,#1536,#1537);
#1238=AXIS2_PLACEMENT_3D('',#1962,#1538,#1539);
#1239=AXIS2_PLACEMENT_3D('',#1963,#1540,#1541);
#1240=AXIS2_PLACEMENT_3D('',#1965,#1542,#1543);
#1241=AXIS2_PLACEMENT_3D('',#1968,#1545,#1546);
#1242=AXIS2_PLACEMENT_3D('',#1969,#1547,#1548);
#1243=AXIS2_PLACEMENT_3D('',#1970,#1549,#1550);
#1244=AXIS2_PLACEMENT_3D('',#1972,#1551,#1552);
#1245=AXIS2_PLACEMENT_3D('',#1975,#1554,#1555);
#1246=AXIS2_PLACEMENT_3D('',#1976,#1556,#1557);
#1247=AXIS2_PLACEMENT_3D('',#1977,#1558,#1559);
#1248=AXIS2_PLACEMENT_3D('',#1979,#1561,#1562);
#1249=AXIS2_PLACEMENT_3D('',#1981,#1564,#1565);
#1250=AXIS2_PLACEMENT_3D('',#1983,#1567,#1568);
#1251=AXIS2_PLACEMENT_3D('',#1985,#1570,#1571);
#1252=AXIS2_PLACEMENT_3D('',#1987,#1573,#1574);
#1253=AXIS2_PLACEMENT_3D('',#1989,#1576,#1577);
#1254=AXIS2_PLACEMENT_3D('',#1991,#1579,#1580);
#1255=AXIS2_PLACEMENT_3D('',#1992,#1581,#1582);
#1256=AXIS2_PLACEMENT_3D('',#1993,#1583,#1584);
#1257=AXIS2_PLACEMENT_3D('',#1999,#1588,#1589);
#1258=AXIS2_PLACEMENT_3D('',#2001,#1591,#1592);
#1259=AXIS2_PLACEMENT_3D('',#2003,#1594,#1595);
#1260=DIRECTION('axis',(0.,0.,1.));
#1261=DIRECTION('refdir',(1.,0.,0.));
#1262=DIRECTION('center_axis',(0.,1.,0.));
#1263=DIRECTION('ref_axis',(0.,0.,1.));
#1264=DIRECTION('center_axis',(0.,-1.,0.));
#1265=DIRECTION('ref_axis',(0.,0.,-1.));
#1266=DIRECTION('',(1.,0.,0.));
#1267=DIRECTION('center_axis',(0.,-1.,0.));
#1268=DIRECTION('ref_axis',(1.58603289232165E-16,0.,1.));
#1269=DIRECTION('center_axis',(0.,0.,-1.));
#1270=DIRECTION('ref_axis',(-0.707106781186547,-0.707106781186548,0.));
#1271=DIRECTION('center_axis',(0.,1.,0.));
#1272=DIRECTION('ref_axis',(5.9476233462062E-16,0.,1.));
#1273=DIRECTION('center_axis',(0.,0.,-1.));
#1274=DIRECTION('ref_axis',(0.707106781186548,-0.707106781186547,0.));
#1275=DIRECTION('center_axis',(0.,-1.,0.));
#1276=DIRECTION('ref_axis',(0.,0.,-1.));
#1277=DIRECTION('',(0.,0.,1.));
#1278=DIRECTION('',(1.,9.91270557701032E-17,0.));
#1279=DIRECTION('',(0.,0.,-1.));
#1280=DIRECTION('center_axis',(0.,1.,0.));
#1281=DIRECTION('ref_axis',(1.,0.,0.));
#1282=DIRECTION('center_axis',(0.,0.,-1.));
#1283=DIRECTION('ref_axis',(-0.707106781186547,-0.707106781186548,0.));
#1284=DIRECTION('center_axis',(0.,0.,1.));
#1285=DIRECTION('ref_axis',(-0.707106781186547,-0.707106781186548,0.));
#1286=DIRECTION('center_axis',(0.,0.,-1.));
#1287=DIRECTION('ref_axis',(-0.707106781186547,-0.707106781186548,0.));
#1288=DIRECTION('',(0.,0.,-1.));
#1289=DIRECTION('center_axis',(0.,0.,-1.));
#1290=DIRECTION('ref_axis',(-1.,0.,0.));
#1291=DIRECTION('',(0.,-1.,0.));
#1292=DIRECTION('center_axis',(0.,0.,1.));
#1293=DIRECTION('ref_axis',(-0.707106781186547,0.707106781186547,0.));
#1294=DIRECTION('',(-1.,-1.98254111540207E-16,0.));
#1295=DIRECTION('center_axis',(0.,0.,1.));
#1296=DIRECTION('ref_axis',(0.707106781186547,0.707106781186548,0.));
#1297=DIRECTION('',(0.,-1.,0.));
#1298=DIRECTION('center_axis',(0.,0.,1.));
#1299=DIRECTION('ref_axis',(0.707106781186548,-0.707106781186547,0.));
#1300=DIRECTION('center_axis',(0.,0.,-1.));
#1301=DIRECTION('ref_axis',(1.,0.,0.));
#1302=DIRECTION('center_axis',(0.,0.,-1.));
#1303=DIRECTION('ref_axis',(1.,0.,0.));
#1304=DIRECTION('center_axis',(0.,0.,-1.));
#1305=DIRECTION('ref_axis',(1.,0.,0.));
#1306=DIRECTION('center_axis',(0.,0.,-1.));
#1307=DIRECTION('ref_axis',(1.,0.,0.));
#1308=DIRECTION('center_axis',(0.,0.,1.));
#1309=DIRECTION('ref_axis',(0.707106781186548,-0.707106781186547,0.));
#1310=DIRECTION('center_axis',(0.,0.,-1.));
#1311=DIRECTION('ref_axis',(0.707106781186548,-0.707106781186547,0.));
#1312=DIRECTION('',(0.,0.,1.));
#1313=DIRECTION('center_axis',(0.,-1.,0.));
#1314=DIRECTION('ref_axis',(1.,0.,0.));
#1315=DIRECTION('center_axis',(1.98254111540207E-16,-1.,0.));
#1316=DIRECTION('ref_axis',(1.,0.,0.));
#1317=DIRECTION('',(0.,-1.,0.));
#1318=DIRECTION('center_axis',(0.,1.,0.));
#1319=DIRECTION('ref_axis',(1.,0.,0.));
#1320=DIRECTION('center_axis',(-1.,0.,0.));
#1321=DIRECTION('ref_axis',(0.,0.,-1.));
#1322=DIRECTION('',(0.,0.,-1.));
#1323=DIRECTION('',(0.,-1.,0.));
#1324=DIRECTION('',(0.,0.,-1.));
#1325=DIRECTION('',(0.,-1.,0.));
#1326=DIRECTION('center_axis',(3.96508223080413E-16,0.,1.));
#1327=DIRECTION('ref_axis',(-1.,0.,3.96508223080413E-16));
#1328=DIRECTION('',(-1.,0.,3.96508223080413E-16));
#1329=DIRECTION('',(0.,-1.,0.));
#1330=DIRECTION('',(-1.,0.,3.96508223080413E-16));
#1331=DIRECTION('center_axis',(1.,0.,0.));
#1332=DIRECTION('ref_axis',(0.,0.,1.));
#1333=DIRECTION('',(0.,0.,1.));
#1334=DIRECTION('',(0.,-1.,0.));
#1335=DIRECTION('',(0.,0.,1.));
#1336=DIRECTION('center_axis',(0.,1.,0.));
#1337=DIRECTION('ref_axis',(0.,0.,1.));
#1338=DIRECTION('',(1.,0.,0.));
#1339=DIRECTION('center_axis',(0.,1.,0.));
#1340=DIRECTION('ref_axis',(1.,0.,0.));
#1341=DIRECTION('center_axis',(0.,1.,0.));
#1342=DIRECTION('ref_axis',(1.,0.,0.));
#1343=DIRECTION('',(1.,0.,0.));
#1344=DIRECTION('',(0.,0.,-1.));
#1345=DIRECTION('',(1.,0.,0.));
#1346=DIRECTION('',(1.,0.,0.));
#1347=DIRECTION('',(0.,0.,-1.));
#1348=DIRECTION('center_axis',(0.,-1.,0.));
#1349=DIRECTION('ref_axis',(1.,0.,0.));
#1350=DIRECTION('',(0.,1.,0.));
#1351=DIRECTION('center_axis',(0.,0.,-1.));
#1352=DIRECTION('ref_axis',(0.707106781186547,0.707106781186548,0.));
#1353=DIRECTION('',(0.,0.,1.));
#1354=DIRECTION('center_axis',(0.,0.,-1.));
#1355=DIRECTION('ref_axis',(0.707106781186547,0.707106781186548,0.));
#1356=DIRECTION('',(0.,0.,-1.));
#1357=DIRECTION('',(0.,0.,-1.));
#1358=DIRECTION('center_axis',(-1.98254111540207E-16,1.,0.));
#1359=DIRECTION('ref_axis',(1.,1.98254111540207E-16,0.));
#1360=DIRECTION('',(0.,0.,-1.));
#1361=DIRECTION('',(-1.,-1.98254111540207E-16,0.));
#1362=DIRECTION('center_axis',(0.,0.,-1.));
#1363=DIRECTION('ref_axis',(-0.707106781186547,0.707106781186547,0.));
#1364=DIRECTION('',(0.,0.,1.));
#1365=DIRECTION('',(0.,0.,1.));
#1366=DIRECTION('center_axis',(0.,0.,-1.));
#1367=DIRECTION('ref_axis',(-0.707106781186547,0.707106781186547,0.));
#1368=DIRECTION('center_axis',(-1.,1.11022302462516E-14,0.));
#1369=DIRECTION('ref_axis',(1.11022302462516E-14,1.,0.));
#1370=DIRECTION('center_axis',(-3.57003146092221E-17,0.857492925712544,
0.514495755427527));
#1371=DIRECTION('ref_axis',(0.,0.514495755427527,-0.857492925712544));
#1372=DIRECTION('center_axis',(0.,-0.514495755427526,-0.857492925712545));
#1373=DIRECTION('ref_axis',(0.,0.857492925712544,-0.514495755427526));
#1374=DIRECTION('center_axis',(-1.,0.,0.));
#1375=DIRECTION('ref_axis',(0.,3.46944695195361E-16,-1.));
#1376=DIRECTION('center_axis',(0.,0.514495755427527,-0.857492925712544));
#1377=DIRECTION('ref_axis',(0.,-0.857492925712544,-0.514495755427527));
#1378=DIRECTION('center_axis',(-3.4510304122248E-16,-0.857492925712544,
0.514495755427526));
#1379=DIRECTION('ref_axis',(0.,-0.514495755427526,-0.857492925712544));
#1380=DIRECTION('center_axis',(0.,0.,-1.));
#1381=DIRECTION('ref_axis',(-0.707106781186549,-0.707106781186546,0.));
#1382=DIRECTION('',(0.,0.,1.));
#1383=DIRECTION('center_axis',(0.,0.,-1.));
#1384=DIRECTION('ref_axis',(-0.707106781186549,-0.707106781186546,0.));
#1385=DIRECTION('',(0.,0.,-1.));
#1386=DIRECTION('center_axis',(0.,1.,0.));
#1387=DIRECTION('ref_axis',(-0.707106781186549,0.,-0.707106781186546));
#1388=DIRECTION('',(0.,-1.,0.));
#1389=DIRECTION('',(0.,1.,0.));
#1390=DIRECTION('center_axis',(0.,0.,-1.));
#1391=DIRECTION('ref_axis',(-0.707106781186546,0.707106781186549,0.));
#1392=DIRECTION('',(0.,0.,1.));
#1393=DIRECTION('center_axis',(0.,0.,-1.));
#1394=DIRECTION('ref_axis',(-0.707106781186546,0.707106781186549,0.));
#1395=DIRECTION('',(0.,0.,-1.));
#1396=DIRECTION('center_axis',(-2.96059473233375E-16,1.,0.));
#1397=DIRECTION('ref_axis',(1.,2.96059473233375E-16,0.));
#1398=DIRECTION('',(-1.,-2.96059473233375E-16,0.));
#1399=DIRECTION('',(1.,2.96059473233375E-16,0.));
#1400=DIRECTION('center_axis',(-1.,0.,0.));
#1401=DIRECTION('ref_axis',(0.,1.,0.));
#1402=DIRECTION('',(0.,-1.,0.));
#1403=DIRECTION('center_axis',(0.,0.,1.));
#1404=DIRECTION('ref_axis',(1.,0.,0.));
#1405=DIRECTION('',(0.,-1.,0.));
#1406=DIRECTION('',(-2.71175164060742E-16,1.,0.));
#1407=DIRECTION('',(1.,0.,0.));
#1408=DIRECTION('center_axis',(0.,0.,-1.));
#1409=DIRECTION('ref_axis',(0.707106781186548,-0.707106781186547,0.));
#1410=DIRECTION('',(0.,1.,0.));
#1411=DIRECTION('center_axis',(0.,0.,-1.));
#1412=DIRECTION('ref_axis',(0.707106781186547,0.707106781186548,0.));
#1413=DIRECTION('',(-1.,0.,0.));
#1414=DIRECTION('',(1.,2.55223683821875E-16,0.));
#1415=DIRECTION('',(0.,1.,0.));
#1416=DIRECTION('',(1.,0.,0.));
#1417=DIRECTION('',(0.,-1.,0.));
#1418=DIRECTION('center_axis',(0.,0.,-1.));
#1419=DIRECTION('ref_axis',(1.,0.,0.));
#1420=DIRECTION('center_axis',(0.,0.,-1.));
#1421=DIRECTION('ref_axis',(1.,0.,0.));
#1422=DIRECTION('center_axis',(0.,0.,-1.));
#1423=DIRECTION('ref_axis',(1.,0.,0.));
#1424=DIRECTION('center_axis',(0.,0.,-1.));
#1425=DIRECTION('ref_axis',(1.,0.,0.));
#1426=DIRECTION('center_axis',(0.,0.,-1.));
#1427=DIRECTION('ref_axis',(1.,0.,0.));
#1428=DIRECTION('center_axis',(0.,0.,-1.));
#1429=DIRECTION('ref_axis',(1.,0.,0.));
#1430=DIRECTION('center_axis',(1.,5.55111512312578E-15,8.66668474974256E-30));
#1431=DIRECTION('ref_axis',(5.55111512312578E-15,-1.,0.));
#1432=DIRECTION('center_axis',(-3.57003146092221E-17,-0.857492925712544,
0.514495755427527));
#1433=DIRECTION('ref_axis',(0.,-0.514495755427527,-0.857492925712544));
#1434=DIRECTION('center_axis',(8.56807550621327E-16,0.514495755427526,-0.857492925712544));
#1435=DIRECTION('ref_axis',(0.,-0.857492925712544,-0.514495755427526));
#1436=DIRECTION('center_axis',(1.,0.,0.));
#1437=DIRECTION('ref_axis',(0.,0.,-1.));
#1438=DIRECTION('center_axis',(0.,-0.514495755427526,-0.857492925712545));
#1439=DIRECTION('ref_axis',(0.,0.857492925712545,-0.514495755427526));
#1440=DIRECTION('center_axis',(3.57003146092221E-17,0.857492925712544,0.514495755427527));
#1441=DIRECTION('ref_axis',(0.,0.514495755427527,-0.857492925712544));
#1442=DIRECTION('center_axis',(0.,0.,-1.));
#1443=DIRECTION('ref_axis',(0.707106781186547,0.707106781186548,0.));
#1444=DIRECTION('',(0.,0.,1.));
#1445=DIRECTION('',(0.,0.,-1.));
#1446=DIRECTION('center_axis',(0.,-1.,0.));
#1447=DIRECTION('ref_axis',(0.707106781186547,0.,-0.707106781186548));
#1448=DIRECTION('',(0.,1.,0.));
#1449=DIRECTION('',(0.,-1.,0.));
#1450=DIRECTION('center_axis',(0.,0.,-1.));
#1451=DIRECTION('ref_axis',(0.707106781186548,-0.707106781186547,0.));
#1452=DIRECTION('',(0.,0.,1.));
#1453=DIRECTION('',(0.,0.,-1.));
#1454=DIRECTION('center_axis',(1.,0.,0.));
#1455=DIRECTION('ref_axis',(0.,0.707106781186548,-0.707106781186547));
#1456=DIRECTION('',(-1.,0.,0.));
#1457=DIRECTION('center_axis',(-1.,-2.71175164060742E-16,0.));
#1458=DIRECTION('ref_axis',(0.,0.707106781186548,-0.707106781186547));
#1459=DIRECTION('',(1.,0.,0.));
#1460=DIRECTION('center_axis',(0.,0.,-1.));
#1461=DIRECTION('ref_axis',(-1.,0.,0.));
#1462=DIRECTION('',(1.,0.,0.));
#1463=DIRECTION('',(2.71175164060742E-16,-1.,0.));
#1464=DIRECTION('center_axis',(0.,0.,1.));
#1465=DIRECTION('ref_axis',(1.,0.,0.));
#1466=DIRECTION('center_axis',(0.,0.,1.));
#1467=DIRECTION('ref_axis',(1.,0.,0.));
#1468=DIRECTION('center_axis',(0.,0.,1.));
#1469=DIRECTION('ref_axis',(1.,0.,0.));
#1470=DIRECTION('center_axis',(-1.,0.,0.));
#1471=DIRECTION('ref_axis',(0.,-0.707106781186548,-0.707106781186547));
#1472=DIRECTION('',(-1.,0.,0.));
#1473=DIRECTION('center_axis',(-1.,-2.71175164060742E-16,0.));
#1474=DIRECTION('ref_axis',(0.,-0.707106781186548,-0.707106781186547));
#1475=DIRECTION('center_axis',(0.,-1.,0.));
#1476=DIRECTION('ref_axis',(-1.,0.,0.));
#1477=DIRECTION('',(0.,0.,1.));
#1478=DIRECTION('center_axis',(0.,1.,0.));
#1479=DIRECTION('ref_axis',(1.,0.,0.));
#1480=DIRECTION('center_axis',(1.,2.96059473233375E-16,0.));
#1481=DIRECTION('ref_axis',(0.,0.707106781186548,-0.707106781186547));
#1482=DIRECTION('center_axis',(1.,0.,0.));
#1483=DIRECTION('ref_axis',(0.,0.707106781186548,-0.707106781186547));
#1484=DIRECTION('',(-1.,-2.96059473233375E-16,0.));
#1485=DIRECTION('center_axis',(0.,0.,-1.));
#1486=DIRECTION('ref_axis',(-1.,0.,0.));
#1487=DIRECTION('',(0.,1.,0.));
#1488=DIRECTION('',(1.,2.55223683821875E-16,0.));
#1489=DIRECTION('center_axis',(0.,0.,1.));
#1490=DIRECTION('ref_axis',(1.,0.,0.));
#1491=DIRECTION('center_axis',(0.,0.,1.));
#1492=DIRECTION('ref_axis',(1.,0.,0.));
#1493=DIRECTION('center_axis',(0.,0.,1.));
#1494=DIRECTION('ref_axis',(1.,0.,0.));
#1495=DIRECTION('center_axis',(-1.,-2.55223683821875E-16,0.));
#1496=DIRECTION('ref_axis',(0.,-0.707106781186548,-0.707106781186548));
#1497=DIRECTION('center_axis',(1.,0.,0.));
#1498=DIRECTION('ref_axis',(0.,-0.707106781186548,-0.707106781186548));
#1499=DIRECTION('',(-1.,-2.55223683821875E-16,0.));
#1500=DIRECTION('center_axis',(1.,2.71175164060742E-16,0.));
#1501=DIRECTION('ref_axis',(2.71175164060742E-16,-1.,0.));
#1502=DIRECTION('center_axis',(0.,0.,1.));
#1503=DIRECTION('ref_axis',(1.,0.,0.));
#1504=DIRECTION('center_axis',(0.,0.,-1.));
#1505=DIRECTION('ref_axis',(1.,0.,0.));
#1506=DIRECTION('',(0.,0.,-1.));
#1507=DIRECTION('center_axis',(0.,0.,1.));
#1508=DIRECTION('ref_axis',(1.,0.,0.));
#1509=DIRECTION('center_axis',(0.,0.,-1.));
#1510=DIRECTION('ref_axis',(1.,0.,0.));
#1511=DIRECTION('',(0.,0.,-1.));
#1512=DIRECTION('center_axis',(0.,0.,1.));
#1513=DIRECTION('ref_axis',(1.,0.,0.));
#1514=DIRECTION('center_axis',(0.,0.,-1.));
#1515=DIRECTION('ref_axis',(1.,0.,0.));
#1516=DIRECTION('',(0.,0.,-1.));
#1517=DIRECTION('center_axis',(0.,0.,1.));
#1518=DIRECTION('ref_axis',(1.,0.,0.));
#1519=DIRECTION('center_axis',(0.,0.,-1.));
#1520=DIRECTION('ref_axis',(1.,0.,0.));
#1521=DIRECTION('',(0.,0.,-1.));
#1522=DIRECTION('center_axis',(0.,0.,-1.));
#1523=DIRECTION('ref_axis',(1.,0.,0.));
#1524=DIRECTION('center_axis',(0.,0.,-1.));
#1525=DIRECTION('ref_axis',(1.,0.,0.));
#1526=DIRECTION('',(0.,0.,-1.));
#1527=DIRECTION('center_axis',(0.,0.,-1.));
#1528=DIRECTION('ref_axis',(1.,0.,0.));
#1529=DIRECTION('center_axis',(0.,0.,1.));
#1530=DIRECTION('ref_axis',(1.,0.,0.));
#1531=DIRECTION('center_axis',(0.,0.,-1.));
#1532=DIRECTION('ref_axis',(1.,0.,0.));
#1533=DIRECTION('center_axis',(0.,0.,-1.));
#1534=DIRECTION('ref_axis',(1.,0.,0.));
#1535=DIRECTION('',(0.,0.,-1.));
#1536=DIRECTION('center_axis',(0.,0.,-1.));
#1537=DIRECTION('ref_axis',(1.,0.,0.));
#1538=DIRECTION('center_axis',(0.,0.,1.));
#1539=DIRECTION('ref_axis',(1.,0.,0.));
#1540=DIRECTION('center_axis',(0.,0.,-1.));
#1541=DIRECTION('ref_axis',(1.,0.,0.));
#1542=DIRECTION('center_axis',(0.,0.,-1.));
#1543=DIRECTION('ref_axis',(1.,0.,0.));
#1544=DIRECTION('',(0.,0.,-1.));
#1545=DIRECTION('center_axis',(0.,0.,-1.));
#1546=DIRECTION('ref_axis',(1.,0.,0.));
#1547=DIRECTION('center_axis',(0.,0.,1.));
#1548=DIRECTION('ref_axis',(1.,0.,0.));
#1549=DIRECTION('center_axis',(0.,0.,-1.));
#1550=DIRECTION('ref_axis',(1.,0.,0.));
#1551=DIRECTION('center_axis',(0.,0.,-1.));
#1552=DIRECTION('ref_axis',(1.,0.,0.));
#1553=DIRECTION('',(0.,0.,-1.));
#1554=DIRECTION('center_axis',(0.,0.,-1.));
#1555=DIRECTION('ref_axis',(1.,0.,0.));
#1556=DIRECTION('center_axis',(0.,0.,1.));
#1557=DIRECTION('ref_axis',(1.,0.,0.));
#1558=DIRECTION('center_axis',(0.,0.,1.));
#1559=DIRECTION('ref_axis',(1.,0.,0.));
#1560=DIRECTION('',(0.,0.,-1.));
#1561=DIRECTION('center_axis',(0.,0.,1.));
#1562=DIRECTION('ref_axis',(1.,0.,0.));
#1563=DIRECTION('',(0.,0.,-1.));
#1564=DIRECTION('center_axis',(0.,0.,1.));
#1565=DIRECTION('ref_axis',(1.,0.,0.));
#1566=DIRECTION('',(0.,0.,-1.));
#1567=DIRECTION('center_axis',(0.,0.,1.));
#1568=DIRECTION('ref_axis',(1.,0.,0.));
#1569=DIRECTION('',(0.,0.,-1.));
#1570=DIRECTION('center_axis',(0.,0.,1.));
#1571=DIRECTION('ref_axis',(1.,0.,0.));
#1572=DIRECTION('',(0.,0.,-1.));
#1573=DIRECTION('center_axis',(0.,0.,1.));
#1574=DIRECTION('ref_axis',(1.,0.,0.));
#1575=DIRECTION('',(0.,0.,-1.));
#1576=DIRECTION('center_axis',(2.55223683821875E-16,-1.,0.));
#1577=DIRECTION('ref_axis',(-1.,-2.55223683821875E-16,0.));
#1578=DIRECTION('',(0.,0.,-1.));
#1579=DIRECTION('center_axis',(1.,0.,0.));
#1580=DIRECTION('ref_axis',(0.,-1.,0.));
#1581=DIRECTION('center_axis',(-1.,0.,0.));
#1582=DIRECTION('ref_axis',(0.,1.,0.));
#1583=DIRECTION('center_axis',(0.,0.,-1.));
#1584=DIRECTION('ref_axis',(-1.,0.,0.));
#1585=DIRECTION('',(0.,-1.,0.));
#1586=DIRECTION('',(0.,1.,0.));
#1587=DIRECTION('',(-1.,0.,0.));
#1588=DIRECTION('center_axis',(1.,0.,0.));
#1589=DIRECTION('ref_axis',(0.,-1.,0.));
#1590=DIRECTION('',(0.,0.,-1.));
#1591=DIRECTION('center_axis',(0.,-1.,0.));
#1592=DIRECTION('ref_axis',(-1.,0.,0.));
#1593=DIRECTION('',(0.,0.,-1.));
#1594=DIRECTION('center_axis',(-1.,0.,0.));
#1595=DIRECTION('ref_axis',(0.,1.,0.));
#1596=CARTESIAN_POINT('',(0.,0.,0.));
#1597=CARTESIAN_POINT('Origin',(-10.,-1.2,5.6));
#1598=CARTESIAN_POINT('',(1.14324672910034,-1.2,0.));
#1599=CARTESIAN_POINT('',(-21.1432467291003,-1.2,0.));
#1600=CARTESIAN_POINT('Origin',(-10.,-1.2,-2.22044604925031E-15));
#1601=CARTESIAN_POINT('',(1.2,-1.2,0.));
#1602=CARTESIAN_POINT('Origin',(-10.,-0.600000000000001,-2.22044604925031E-15));
#1603=CARTESIAN_POINT('',(-18.,-3.8,0.));
#1604=CARTESIAN_POINT('Origin',(-18.,-0.600000000000001,0.));
#1605=CARTESIAN_POINT('',(-2.,-3.8,0.));
#1606=CARTESIAN_POINT('Origin',(-10.,-3.8,-2.22044604925031E-15));
#1607=CARTESIAN_POINT('Origin',(-2.,-0.600000000000001,0.));
#1608=CARTESIAN_POINT('Origin',(-10.,-3.8,-7.));
#1609=CARTESIAN_POINT('',(-18.,-3.8,-14.));
#1610=CARTESIAN_POINT('',(-18.,-3.8,-3.5));
#1611=CARTESIAN_POINT('',(-2.,-3.8,-14.));
#1612=CARTESIAN_POINT('',(-21.2,-3.8,-14.));
#1613=CARTESIAN_POINT('',(-2.,-3.8,-3.5));
#1614=CARTESIAN_POINT('',(-11.2,-3.8,-5.9));
#1615=CARTESIAN_POINT('Origin',(-10.,-3.8,-5.9));
#1616=CARTESIAN_POINT('Origin',(-18.,-0.600000000000001,-3.5));
#1617=CARTESIAN_POINT('',(-21.2,-0.600000000000001,-14.));
#1618=CARTESIAN_POINT('Origin',(-18.,-0.600000000000001,-14.));
#1619=CARTESIAN_POINT('',(-21.2,-0.600000000000001,0.));
#1620=CARTESIAN_POINT('Origin',(-18.,-0.600000000000001,0.));
#1621=CARTESIAN_POINT('',(-21.2,-0.600000000000001,-3.5));
#1622=CARTESIAN_POINT('Origin',(-10.,7.5,-14.));
#1623=CARTESIAN_POINT('',(-21.2,15.,-14.));
#1624=CARTESIAN_POINT('',(-21.2,3.15,-14.));
#1625=CARTESIAN_POINT('',(-20.,16.2,-14.));
#1626=CARTESIAN_POINT('Origin',(-20.,15.,-14.));
#1627=CARTESIAN_POINT('',(-4.44089209850063E-15,16.2,-14.));
#1628=CARTESIAN_POINT('',(-15.6,16.2,-14.));
#1629=CARTESIAN_POINT('',(1.2,15.,-14.));
#1630=CARTESIAN_POINT('Origin',(-2.22044604925031E-15,15.,-14.));
#1631=CARTESIAN_POINT('',(1.2,-0.6,-14.));
#1632=CARTESIAN_POINT('',(1.2,-1.2,-14.));
#1633=CARTESIAN_POINT('Origin',(-2.,-0.600000000000001,-14.));
#1634=CARTESIAN_POINT('',(-5.35,11.5,-14.));
#1635=CARTESIAN_POINT('Origin',(-4.,11.5,-14.));
#1636=CARTESIAN_POINT('',(-17.35,3.5,-14.));
#1637=CARTESIAN_POINT('Origin',(-16.,3.5,-14.));
#1638=CARTESIAN_POINT('',(-5.35,3.5,-14.));
#1639=CARTESIAN_POINT('Origin',(-4.,3.5,-14.));
#1640=CARTESIAN_POINT('',(-17.35,11.5,-14.));
#1641=CARTESIAN_POINT('Origin',(-16.,11.5,-14.));
#1642=CARTESIAN_POINT('Origin',(-2.,-0.600000000000001,-3.5));
#1643=CARTESIAN_POINT('',(1.2,-0.6,0.));
#1644=CARTESIAN_POINT('Origin',(-2.,-0.600000000000001,0.));
#1645=CARTESIAN_POINT('',(1.2,-0.6,-3.5));
#1646=CARTESIAN_POINT('Origin',(-10.,16.2,-5.86802675595627));
#1647=CARTESIAN_POINT('',(-14.1,16.2,-5.86802675595627));
#1648=CARTESIAN_POINT('Origin',(-10.,16.2,-5.86802675595627));
#1649=CARTESIAN_POINT('',(-14.1,15.,-5.86802675595627));
#1650=CARTESIAN_POINT('',(-14.1,16.2,-5.86802675595627));
#1651=CARTESIAN_POINT('Origin',(-10.,15.,-5.86802675595627));
#1652=CARTESIAN_POINT('Origin',(-14.2,0.,-1.7));
#1653=CARTESIAN_POINT('',(-14.2,0.,-1.7));
#1654=CARTESIAN_POINT('',(-14.2,0.,-10.));
#1655=CARTESIAN_POINT('',(-14.2,0.,-0.849999999999998));
#1656=CARTESIAN_POINT('',(-14.2,-2.6,-1.7));
#1657=CARTESIAN_POINT('',(-14.2,0.,-1.7));
#1658=CARTESIAN_POINT('',(-14.2,-2.6,-10.));
#1659=CARTESIAN_POINT('',(-14.2,-2.6,-10.));
#1660=CARTESIAN_POINT('',(-14.2,0.,-10.));
#1661=CARTESIAN_POINT('Origin',(-5.8,0.,-1.7));
#1662=CARTESIAN_POINT('',(-5.8,0.,-1.7));
#1663=CARTESIAN_POINT('',(-12.9,0.,-1.7));
#1664=CARTESIAN_POINT('',(-5.8,-2.6,-1.7));
#1665=CARTESIAN_POINT('',(-5.8,0.,-1.7));
#1666=CARTESIAN_POINT('',(-14.2,-2.6,-1.7));
#1667=CARTESIAN_POINT('Origin',(-5.8,0.,-10.));
#1668=CARTESIAN_POINT('',(-5.8,0.,-10.));
#1669=CARTESIAN_POINT('',(-5.8,0.,-5.));
#1670=CARTESIAN_POINT('',(-5.8,-2.6,-10.));
#1671=CARTESIAN_POINT('',(-5.8,0.,-10.));
#1672=CARTESIAN_POINT('',(-5.8,-2.6,0.));
#1673=CARTESIAN_POINT('Origin',(-10.,-2.6,-5.85));
#1674=CARTESIAN_POINT('',(0.,-2.6,-10.));
#1675=CARTESIAN_POINT('',(-11.2,-2.6,-5.9));
#1676=CARTESIAN_POINT('Origin',(-10.,-2.6,-5.9));
#1677=CARTESIAN_POINT('Origin',(-20.,0.,0.));
#1678=CARTESIAN_POINT('',(-20.,0.,0.));
#1679=CARTESIAN_POINT('',(0.,0.,0.));
#1680=CARTESIAN_POINT('',(-20.6,0.,0.));
#1681=CARTESIAN_POINT('',(0.,0.,-10.));
#1682=CARTESIAN_POINT('',(0.,0.,0.));
#1683=CARTESIAN_POINT('',(0.,0.,-10.));
#1684=CARTESIAN_POINT('',(-20.,0.,-10.));
#1685=CARTESIAN_POINT('',(0.,0.,-10.));
#1686=CARTESIAN_POINT('',(-20.,0.,0.));
#1687=CARTESIAN_POINT('Origin',(-10.,38.8763041828571,-5.9));
#1688=CARTESIAN_POINT('',(-11.2,38.8763041828571,-5.9));
#1689=CARTESIAN_POINT('Origin',(-2.22044604925031E-15,15.,0.));
#1690=CARTESIAN_POINT('',(-2.4980018054066E-15,16.2,0.));
#1691=CARTESIAN_POINT('',(-2.45835098309856E-15,16.2,0.));
#1692=CARTESIAN_POINT('',(1.2,15.,0.));
#1693=CARTESIAN_POINT('Origin',(-2.22044604925031E-15,15.,0.));
#1694=CARTESIAN_POINT('',(1.2,15.,-1.1));
#1695=CARTESIAN_POINT('',(1.2,15.,0.));
#1696=CARTESIAN_POINT('',(1.2,15.,0.));
#1697=CARTESIAN_POINT('Origin',(-21.2,16.2,0.));
#1698=CARTESIAN_POINT('',(-20.,16.2,0.));
#1699=CARTESIAN_POINT('',(-20.,16.2,0.));
#1700=CARTESIAN_POINT('',(1.2,16.2,0.));
#1701=CARTESIAN_POINT('Origin',(-20.,15.,0.));
#1702=CARTESIAN_POINT('',(-21.2,15.,-1.1));
#1703=CARTESIAN_POINT('',(-21.2,15.,0.));
#1704=CARTESIAN_POINT('',(-21.2,15.,0.));
#1705=CARTESIAN_POINT('',(-21.2,15.,0.));
#1706=CARTESIAN_POINT('Origin',(-20.,15.,0.));
#1707=CARTESIAN_POINT('Ctrl Pts',(-27.5,14.,-0.5));
#1708=CARTESIAN_POINT('Ctrl Pts',(-27.5,14.2243994752564,-0.634639685153848));
#1709=CARTESIAN_POINT('Ctrl Pts',(-27.3173716955729,14.7490139751568,-0.949408385094061));
#1710=CARTESIAN_POINT('Ctrl Pts',(-26.7991993003419,15.,-1.1));
#1711=CARTESIAN_POINT('Ctrl Pts',(-26.5,15.,-1.1));
#1712=CARTESIAN_POINT('Ctrl Pts',(-27.5,14.,-0.5));
#1713=CARTESIAN_POINT('Ctrl Pts',(-27.5,14.2094395102393,-0.649599650170944));
#1714=CARTESIAN_POINT('Ctrl Pts',(-27.3554925892087,14.6979827949951,-0.997367957926583));
#1715=CARTESIAN_POINT('Ctrl Pts',(-26.830840890225,15.,-1.20471975511966));
#1716=CARTESIAN_POINT('Ctrl Pts',(-26.5,15.,-1.20471975511966));
#1717=CARTESIAN_POINT('Ctrl Pts',(-27.5,14.,-0.5));
#1718=CARTESIAN_POINT('Ctrl Pts',(-27.5,14.1795195802051,-0.679519580205132));
#1719=CARTESIAN_POINT('Ctrl Pts',(-27.3945735807354,14.5939939327717,-1.09399393277175));
#1720=CARTESIAN_POINT('Ctrl Pts',(-26.8667577034378,14.9132810647934,-1.41328106479343));
#1721=CARTESIAN_POINT('Ctrl Pts',(-26.5,14.9132810647934,-1.41328106479342));
#1722=CARTESIAN_POINT('Ctrl Pts',(-27.5,14.,-0.5));
#1723=CARTESIAN_POINT('Ctrl Pts',(-27.5,14.1495996501709,-0.709439510239323));
#1724=CARTESIAN_POINT('Ctrl Pts',(-27.3554925892087,14.4973679579266,-1.19798279499506));
#1725=CARTESIAN_POINT('Ctrl Pts',(-26.830840890225,14.7047197551197,-1.5));
#1726=CARTESIAN_POINT('Ctrl Pts',(-26.5,14.7047197551197,-1.5));
#1727=CARTESIAN_POINT('Ctrl Pts',(-27.5,14.,-0.5));
#1728=CARTESIAN_POINT('Ctrl Pts',(-27.5,14.1346396851538,-0.724399475256418));
#1729=CARTESIAN_POINT('Ctrl Pts',(-27.3173716955729,14.4494083850941,-1.24901397515677));
#1730=CARTESIAN_POINT('Ctrl Pts',(-26.7991993003419,14.6,-1.5));
#1731=CARTESIAN_POINT('Ctrl Pts',(-26.5,14.6,-1.5));
#1732=CARTESIAN_POINT('',(-26.5,15.,-1.1));
#1733=CARTESIAN_POINT('',(-26.5,14.6,-1.5));
#1734=CARTESIAN_POINT('Origin',(-26.5,14.6,-1.1));
#1735=CARTESIAN_POINT('',(-27.5,14.,-0.5));
#1736=CARTESIAN_POINT('Origin',(-26.5,14.,-0.5));
#1737=CARTESIAN_POINT('Origin',(-26.5,14.,-0.5));
#1738=CARTESIAN_POINT('Ctrl Pts',(-27.5,0.999999999999996,-0.5));
#1739=CARTESIAN_POINT('Ctrl Pts',(-27.5,0.865360314846148,-0.724399475256414));
#1740=CARTESIAN_POINT('Ctrl Pts',(-27.3174809295335,0.550536991506125,-1.24910501415645));
#1741=CARTESIAN_POINT('Ctrl Pts',(-26.7991993003419,0.399999999999996,-1.5));
#1742=CARTESIAN_POINT('Ctrl Pts',(-26.5,0.399999999999996,-1.5));
#1743=CARTESIAN_POINT('Ctrl Pts',(-27.5,0.999999999999996,-0.5));
#1744=CARTESIAN_POINT('Ctrl Pts',(-27.5,0.850400349829053,-0.70943951023932));
#1745=CARTESIAN_POINT('Ctrl Pts',(-27.3556944669078,0.502583764378583,-1.1980773661651));
#1746=CARTESIAN_POINT('Ctrl Pts',(-26.830840890225,0.295280244880337,-1.5));
#1747=CARTESIAN_POINT('Ctrl Pts',(-26.5,0.295280244880337,-1.5));
#1748=CARTESIAN_POINT('Ctrl Pts',(-27.5,0.999999999999996,-0.5));
#1749=CARTESIAN_POINT('Ctrl Pts',(-27.5,0.820480419794865,-0.679519580205131));
#1750=CARTESIAN_POINT('Ctrl Pts',(-27.3949900608447,0.406030871596074,-1.09396912840392));
#1751=CARTESIAN_POINT('Ctrl Pts',(-26.8667577034378,0.0866807977550985,
-1.4133192022449));
#1752=CARTESIAN_POINT('Ctrl Pts',(-26.5,0.0866807977550985,-1.4133192022449));
#1753=CARTESIAN_POINT('Ctrl Pts',(-27.5,0.999999999999996,-0.5));
#1754=CARTESIAN_POINT('Ctrl Pts',(-27.5,0.790560489760676,-0.649599650170942));
#1755=CARTESIAN_POINT('Ctrl Pts',(-27.3556944669078,0.301922633834895,-0.997416235621414));
#1756=CARTESIAN_POINT('Ctrl Pts',(-26.830840890225,-3.66264892545481E-15,
-1.20471975511966));
#1757=CARTESIAN_POINT('Ctrl Pts',(-26.5,-3.70425850894324E-15,-1.20471975511966));
#1758=CARTESIAN_POINT('Ctrl Pts',(-27.5,0.999999999999996,-0.5));
#1759=CARTESIAN_POINT('Ctrl Pts',(-27.5,0.775600524743582,-0.634639685153848));
#1760=CARTESIAN_POINT('Ctrl Pts',(-27.3174809295335,0.250894985843545,-0.949463008493871));
#1761=CARTESIAN_POINT('Ctrl Pts',(-26.7991993003419,-3.70548046408599E-15,
-1.1));
#1762=CARTESIAN_POINT('Ctrl Pts',(-26.5,-3.7470027081099E-15,-1.1));
#1763=CARTESIAN_POINT('',(-26.5,0.399999999999996,-1.5));
#1764=CARTESIAN_POINT('',(-26.5,-3.7470027081099E-15,-1.1));
#1765=CARTESIAN_POINT('Origin',(-26.5,0.399999999999996,-1.1));
#1766=CARTESIAN_POINT('',(-27.5,0.999999999999996,-0.5));
#1767=CARTESIAN_POINT('Origin',(-26.5,0.999999999999996,-0.5));
#1768=CARTESIAN_POINT('Origin',(-26.5,0.999999999999996,-0.5));
#1769=CARTESIAN_POINT('Origin',(-26.5,0.999999999999996,0.));
#1770=CARTESIAN_POINT('',(-26.5,-3.8793999940925E-15,0.));
#1771=CARTESIAN_POINT('',(-26.5,-3.88578058618805E-15,0.));
#1772=CARTESIAN_POINT('',(-27.5,0.999999999999996,0.));
#1773=CARTESIAN_POINT('Origin',(-26.5,0.999999999999996,0.));
#1774=CARTESIAN_POINT('',(-27.5,0.999999999999996,0.));
#1775=CARTESIAN_POINT('Origin',(-26.5,3.75,-0.5));
#1776=CARTESIAN_POINT('',(-26.5,3.75,-1.5));
#1777=CARTESIAN_POINT('',(-27.5,3.75,-0.5));
#1778=CARTESIAN_POINT('Origin',(-26.5,14.,0.));
#1779=CARTESIAN_POINT('',(-27.5,14.,0.));
#1780=CARTESIAN_POINT('',(-27.5,14.,0.));
#1781=CARTESIAN_POINT('',(-26.5,15.,0.));
#1782=CARTESIAN_POINT('Origin',(-26.5,14.,0.));
#1783=CARTESIAN_POINT('',(-26.5,15.,0.));
#1784=CARTESIAN_POINT('Origin',(-27.5,15.,0.));
#1785=CARTESIAN_POINT('',(-20.,15.,0.));
#1786=CARTESIAN_POINT('',(-25.625,15.,-1.1));
#1787=CARTESIAN_POINT('Origin',(-27.5,-4.44089209850063E-15,0.));
#1788=CARTESIAN_POINT('',(-27.5,15.,0.));
#1789=CARTESIAN_POINT('Origin',(-10.,7.5,0.));
#1790=CARTESIAN_POINT('',(-21.2,-2.52671446983656E-15,0.));
#1791=CARTESIAN_POINT('',(-21.2,16.2,0.));
#1792=CARTESIAN_POINT('',(1.2,0.,0.));
#1793=CARTESIAN_POINT('',(1.2,-1.2,0.));
#1794=CARTESIAN_POINT('',(6.5,0.,0.));
#1795=CARTESIAN_POINT('',(0.,0.,0.));
#1796=CARTESIAN_POINT('',(7.5,1.,0.));
#1797=CARTESIAN_POINT('Origin',(6.5,1.,0.));
#1798=CARTESIAN_POINT('',(7.5,14.,0.));
#1799=CARTESIAN_POINT('',(7.5,0.,0.));
#1800=CARTESIAN_POINT('',(6.5,15.,0.));
#1801=CARTESIAN_POINT('Origin',(6.5,14.,0.));
#1802=CARTESIAN_POINT('',(7.5,15.,0.));
#1803=CARTESIAN_POINT('',(-27.5,-4.13462367791438E-15,0.));
#1804=CARTESIAN_POINT('',(-20.,15.,0.));
#1805=CARTESIAN_POINT('',(-20.,0.,0.));
#1806=CARTESIAN_POINT('',(0.,15.,0.));
#1807=CARTESIAN_POINT('',(-20.,15.,0.));
#1808=CARTESIAN_POINT('',(0.,15.,0.));
#1809=CARTESIAN_POINT('',(-26.35,7.5,0.));
#1810=CARTESIAN_POINT('Origin',(-25.,7.5,0.));
#1811=CARTESIAN_POINT('',(3.65,13.,0.));
#1812=CARTESIAN_POINT('Origin',(5.,13.,0.));
#1813=CARTESIAN_POINT('',(3.65,2.,0.));
#1814=CARTESIAN_POINT('Origin',(5.,2.,0.));
#1815=CARTESIAN_POINT('',(3.65,7.5,0.));
#1816=CARTESIAN_POINT('Origin',(5.,7.5,0.));
#1817=CARTESIAN_POINT('',(-26.35,13.,0.));
#1818=CARTESIAN_POINT('Origin',(-25.,13.,0.));
#1819=CARTESIAN_POINT('',(-26.35,2.,0.));
#1820=CARTESIAN_POINT('Origin',(-25.,2.,0.));
#1821=CARTESIAN_POINT('Ctrl Pts',(7.5,1.,-0.500000000000001));
#1822=CARTESIAN_POINT('Ctrl Pts',(7.5,0.775600524743587,-0.634639685153849));
#1823=CARTESIAN_POINT('Ctrl Pts',(7.31778329819248,0.250642982344784,-0.94961421059313));
#1824=CARTESIAN_POINT('Ctrl Pts',(6.79919930034189,8.84832700580616E-17,
-1.1));
#1825=CARTESIAN_POINT('Ctrl Pts',(6.5,-5.55111512312578E-16,-1.1));
#1826=CARTESIAN_POINT('Ctrl Pts',(7.5,1.,-0.500000000000001));
#1827=CARTESIAN_POINT('Ctrl Pts',(7.5,0.790560489760682,-0.649599650170943));
#1828=CARTESIAN_POINT('Ctrl Pts',(7.35625328111585,0.30166085299574,-0.997549872283202));
#1829=CARTESIAN_POINT('Ctrl Pts',(6.83084089022496,1.95981610380163E-16,
-1.20471975511966));
#1830=CARTESIAN_POINT('Ctrl Pts',(6.5,-5.55111512312578E-16,-1.20471975511966));
#1831=CARTESIAN_POINT('Ctrl Pts',(7.5,1.,-0.500000000000001));
#1832=CARTESIAN_POINT('Ctrl Pts',(7.5,0.820480419794869,-0.679519580205131));
#1833=CARTESIAN_POINT('Ctrl Pts',(7.39617110785488,0.406128023106322,-1.09387197689368));
#1834=CARTESIAN_POINT('Ctrl Pts',(6.86675770343776,0.0865541502223292,-1.41344584977767));
#1835=CARTESIAN_POINT('Ctrl Pts',(6.5,0.0865541502223285,-1.41344584977767));
#1836=CARTESIAN_POINT('Ctrl Pts',(7.5,1.,-0.500000000000001));
#1837=CARTESIAN_POINT('Ctrl Pts',(7.5,0.850400349829058,-0.709439510239319));
#1838=CARTESIAN_POINT('Ctrl Pts',(7.35625328111585,0.502450127716799,-1.19833914700426));
#1839=CARTESIAN_POINT('Ctrl Pts',(6.83084089022496,0.295280244880341,-1.5));
#1840=CARTESIAN_POINT('Ctrl Pts',(6.5,0.29528024488034,-1.5));
#1841=CARTESIAN_POINT('Ctrl Pts',(7.5,1.,-0.500000000000001));
#1842=CARTESIAN_POINT('Ctrl Pts',(7.5,0.865360314846151,-0.724399475256413));
#1843=CARTESIAN_POINT('Ctrl Pts',(7.31778329819249,0.55038578940687,-1.24935701765522));
#1844=CARTESIAN_POINT('Ctrl Pts',(6.79919930034188,0.4,-1.5));
#1845=CARTESIAN_POINT('Ctrl Pts',(6.5,0.4,-1.5));
#1846=CARTESIAN_POINT('',(6.5,-2.77555756156289E-16,-1.1));
#1847=CARTESIAN_POINT('',(6.5,0.4,-1.5));
#1848=CARTESIAN_POINT('Origin',(6.5,0.4,-1.1));
#1849=CARTESIAN_POINT('',(7.5,1.,-0.500000000000001));
#1850=CARTESIAN_POINT('Origin',(6.5,1.,-0.5));
#1851=CARTESIAN_POINT('Origin',(6.5,1.,-0.5));
#1852=CARTESIAN_POINT('Ctrl Pts',(7.5,14.,-0.5));
#1853=CARTESIAN_POINT('Ctrl Pts',(7.5,14.1346396851538,-0.724399475256414));
#1854=CARTESIAN_POINT('Ctrl Pts',(7.31754695301897,14.4494960241167,-1.24916004019452));
#1855=CARTESIAN_POINT('Ctrl Pts',(6.79919930034189,14.6,-1.5));
#1856=CARTESIAN_POINT('Ctrl Pts',(6.5,14.6,-1.5));
#1857=CARTESIAN_POINT('Ctrl Pts',(7.5,14.,-0.5));
#1858=CARTESIAN_POINT('Ctrl Pts',(7.5,14.1495996501709,-0.70943951023932));
#1859=CARTESIAN_POINT('Ctrl Pts',(7.355816486372,14.4974454157561,-1.19813452712712));
#1860=CARTESIAN_POINT('Ctrl Pts',(6.83084089022496,14.7047197551197,-1.5));
#1861=CARTESIAN_POINT('Ctrl Pts',(6.5,14.7047197551197,-1.5));
#1862=CARTESIAN_POINT('Ctrl Pts',(7.5,14.,-0.5));
#1863=CARTESIAN_POINT('Ctrl Pts',(7.5,14.1795195802051,-0.67951958020513));
#1864=CARTESIAN_POINT('Ctrl Pts',(7.39524414266735,14.5939517596494,-1.09395175964941));
#1865=CARTESIAN_POINT('Ctrl Pts',(6.86675770343776,14.9133440116614,-1.4133440116614));
#1866=CARTESIAN_POINT('Ctrl Pts',(6.5,14.9133440116614,-1.4133440116614));
#1867=CARTESIAN_POINT('Ctrl Pts',(7.5,14.,-0.5));
#1868=CARTESIAN_POINT('Ctrl Pts',(7.5,14.2094395102393,-0.649599650170942));
#1869=CARTESIAN_POINT('Ctrl Pts',(7.355816486372,14.6981345271271,-0.997445415756116));
#1870=CARTESIAN_POINT('Ctrl Pts',(6.83084089022496,15.,-1.20471975511966));
#1871=CARTESIAN_POINT('Ctrl Pts',(6.5,15.,-1.20471975511966));
#1872=CARTESIAN_POINT('Ctrl Pts',(7.5,14.,-0.5));
#1873=CARTESIAN_POINT('Ctrl Pts',(7.5,14.2243994752564,-0.634639685153848));
#1874=CARTESIAN_POINT('Ctrl Pts',(7.31754695301897,14.7491600401945,-0.949496024116715));
#1875=CARTESIAN_POINT('Ctrl Pts',(6.79919930034189,15.,-1.1));
#1876=CARTESIAN_POINT('Ctrl Pts',(6.5,15.,-1.1));
#1877=CARTESIAN_POINT('',(6.5,14.6,-1.5));
#1878=CARTESIAN_POINT('',(6.5,15.,-1.1));
#1879=CARTESIAN_POINT('Origin',(6.5,14.6,-1.1));
#1880=CARTESIAN_POINT('',(7.5,14.,-0.5));
#1881=CARTESIAN_POINT('Origin',(6.5,14.,-0.5));
#1882=CARTESIAN_POINT('Origin',(6.5,14.,-0.5));
#1883=CARTESIAN_POINT('Origin',(6.5,14.,0.));
#1884=CARTESIAN_POINT('',(6.5,15.,0.));
#1885=CARTESIAN_POINT('',(7.5,14.,0.));
#1886=CARTESIAN_POINT('Origin',(6.5,11.25,-0.5));
#1887=CARTESIAN_POINT('',(6.5,11.25,-1.5));
#1888=CARTESIAN_POINT('',(7.5,11.25,-0.5));
#1889=CARTESIAN_POINT('Origin',(6.5,1.,0.));
#1890=CARTESIAN_POINT('',(7.5,1.,0.));
#1891=CARTESIAN_POINT('',(6.5,0.,0.));
#1892=CARTESIAN_POINT('Origin',(1.875,14.6,-1.1));
#1893=CARTESIAN_POINT('',(1.2,14.6,-1.5));
#1894=CARTESIAN_POINT('',(1.875,14.6,-1.5));
#1895=CARTESIAN_POINT('Origin',(1.2,14.6,-1.1));
#1896=CARTESIAN_POINT('',(1.875,15.,-1.1));
#1897=CARTESIAN_POINT('Origin',(3.75,7.5,-1.5));
#1898=CARTESIAN_POINT('',(1.2,0.4,-1.5));
#1899=CARTESIAN_POINT('',(5.625,0.4,-1.5));
#1900=CARTESIAN_POINT('',(1.2,11.85,-1.5));
#1901=CARTESIAN_POINT('',(3.65,13.,-1.5));
#1902=CARTESIAN_POINT('Origin',(5.,13.,-1.5));
#1903=CARTESIAN_POINT('',(3.65,2.,-1.5));
#1904=CARTESIAN_POINT('Origin',(5.,2.,-1.5));
#1905=CARTESIAN_POINT('',(3.65,7.5,-1.5));
#1906=CARTESIAN_POINT('Origin',(5.,7.5,-1.5));
#1907=CARTESIAN_POINT('Origin',(5.625,0.4,-1.1));
#1908=CARTESIAN_POINT('',(1.2,0.,-1.1));
#1909=CARTESIAN_POINT('',(5.625,0.,-1.1));
#1910=CARTESIAN_POINT('Origin',(1.2,0.4,-1.1));
#1911=CARTESIAN_POINT('Origin',(7.5,0.,0.));
#1912=CARTESIAN_POINT('',(1.2,0.,0.));
#1913=CARTESIAN_POINT('Origin',(0.,15.,0.));
#1914=CARTESIAN_POINT('Origin',(-25.625,14.6,-1.1));
#1915=CARTESIAN_POINT('',(-21.2,14.6,-1.5));
#1916=CARTESIAN_POINT('Origin',(-21.2,14.6,-1.1));
#1917=CARTESIAN_POINT('',(-25.625,14.6,-1.5));
#1918=CARTESIAN_POINT('Origin',(-23.75,7.5,-1.5));
#1919=CARTESIAN_POINT('',(-21.2,0.399999999999997,-1.5));
#1920=CARTESIAN_POINT('',(-21.2,3.15,-1.5));
#1921=CARTESIAN_POINT('',(-21.875,0.399999999999997,-1.5));
#1922=CARTESIAN_POINT('',(-26.35,7.5,-1.5));
#1923=CARTESIAN_POINT('Origin',(-25.,7.5,-1.5));
#1924=CARTESIAN_POINT('',(-26.35,13.,-1.5));
#1925=CARTESIAN_POINT('Origin',(-25.,13.,-1.5));
#1926=CARTESIAN_POINT('',(-26.35,2.,-1.5));
#1927=CARTESIAN_POINT('Origin',(-25.,2.,-1.5));
#1928=CARTESIAN_POINT('Origin',(-21.875,0.399999999999997,-1.1));
#1929=CARTESIAN_POINT('',(-21.2,-2.51235813762158E-15,-1.1));
#1930=CARTESIAN_POINT('Origin',(-21.2,0.399999999999997,-1.1));
#1931=CARTESIAN_POINT('',(-21.875,-2.70616862252382E-15,-1.1));
#1932=CARTESIAN_POINT('Origin',(1.2,16.2,0.));
#1933=CARTESIAN_POINT('Origin',(-16.,11.5,-54.3659766397489));
#1934=CARTESIAN_POINT('',(-17.35,11.5,-12.5));
#1935=CARTESIAN_POINT('Origin',(-16.,11.5,-12.5));
#1936=CARTESIAN_POINT('',(-17.35,11.5,-54.3659766397489));
#1937=CARTESIAN_POINT('Origin',(-4.,3.5,-54.3659766397489));
#1938=CARTESIAN_POINT('',(-5.35,3.5,-12.5));
#1939=CARTESIAN_POINT('Origin',(-4.,3.5,-12.5));
#1940=CARTESIAN_POINT('',(-5.35,3.5,-54.3659766397489));
#1941=CARTESIAN_POINT('Origin',(-16.,3.5,-54.3659766397489));
#1942=CARTESIAN_POINT('',(-17.35,3.5,-12.5));
#1943=CARTESIAN_POINT('Origin',(-16.,3.5,-12.5));
#1944=CARTESIAN_POINT('',(-17.35,3.5,-54.3659766397489));
#1945=CARTESIAN_POINT('Origin',(-4.,11.5,-54.3659766397489));
#1946=CARTESIAN_POINT('',(-5.35,11.5,-12.5));
#1947=CARTESIAN_POINT('Origin',(-4.,11.5,-12.5));
#1948=CARTESIAN_POINT('',(-5.35,11.5,-54.3659766397489));
#1949=CARTESIAN_POINT('Origin',(-16.,3.5,-10.));
#1950=CARTESIAN_POINT('',(-18.5,3.5,-10.));
#1951=CARTESIAN_POINT('Origin',(-16.,3.5,-10.));
#1952=CARTESIAN_POINT('',(-18.5,3.5,-12.5));
#1953=CARTESIAN_POINT('',(-18.5,3.5,-10.));
#1954=CARTESIAN_POINT('Origin',(-16.,3.5,-12.5));
#1955=CARTESIAN_POINT('Origin',(-16.,3.5,-12.5));
#1956=CARTESIAN_POINT('Origin',(-4.,3.5,-10.));
#1957=CARTESIAN_POINT('',(-6.5,3.5,-10.));
#1958=CARTESIAN_POINT('Origin',(-4.,3.5,-10.));
#1959=CARTESIAN_POINT('',(-6.5,3.5,-12.5));
#1960=CARTESIAN_POINT('',(-6.5,3.5,-10.));
#1961=CARTESIAN_POINT('Origin',(-4.,3.5,-12.5));
#1962=CARTESIAN_POINT('Origin',(-4.,3.5,-12.5));
#1963=CARTESIAN_POINT('Origin',(-16.,11.5,-10.));
#1964=CARTESIAN_POINT('',(-18.5,11.5,-10.));
#1965=CARTESIAN_POINT('Origin',(-16.,11.5,-10.));
#1966=CARTESIAN_POINT('',(-18.5,11.5,-12.5));
#1967=CARTESIAN_POINT('',(-18.5,11.5,-10.));
#1968=CARTESIAN_POINT('Origin',(-16.,11.5,-12.5));
#1969=CARTESIAN_POINT('Origin',(-16.,11.5,-12.5));
#1970=CARTESIAN_POINT('Origin',(-4.,11.5,-10.));
#1971=CARTESIAN_POINT('',(-6.5,11.5,-10.));
#1972=CARTESIAN_POINT('Origin',(-4.,11.5,-10.));
#1973=CARTESIAN_POINT('',(-6.5,11.5,-12.5));
#1974=CARTESIAN_POINT('',(-6.5,11.5,-10.));
#1975=CARTESIAN_POINT('Origin',(-4.,11.5,-12.5));
#1976=CARTESIAN_POINT('Origin',(-4.,11.5,-12.5));
#1977=CARTESIAN_POINT('Origin',(-25.,7.5,-41.8659766397489));
#1978=CARTESIAN_POINT('',(-26.35,7.5,-41.8659766397489));
#1979=CARTESIAN_POINT('Origin',(5.,13.,-41.8659766397489));
#1980=CARTESIAN_POINT('',(3.65,13.,-41.8659766397489));
#1981=CARTESIAN_POINT('Origin',(5.,2.,-41.8659766397489));
#1982=CARTESIAN_POINT('',(3.65,2.,-41.8659766397489));
#1983=CARTESIAN_POINT('Origin',(5.,7.5,-41.8659766397489));
#1984=CARTESIAN_POINT('',(3.65,7.5,-41.8659766397489));
#1985=CARTESIAN_POINT('Origin',(-25.,13.,-41.8659766397489));
#1986=CARTESIAN_POINT('',(-26.35,13.,-41.8659766397489));
#1987=CARTESIAN_POINT('Origin',(-25.,2.,-41.8659766397489));
#1988=CARTESIAN_POINT('',(-26.35,2.,-41.8659766397489));
#1989=CARTESIAN_POINT('Origin',(-20.,-2.22044604925031E-15,0.));
#1990=CARTESIAN_POINT('',(-21.2,-2.51235813762158E-15,0.));
#1991=CARTESIAN_POINT('Origin',(7.5,15.,0.));
#1992=CARTESIAN_POINT('Origin',(-21.2,-1.2,0.));
#1993=CARTESIAN_POINT('Origin',(-10.,7.5,-10.));
#1994=CARTESIAN_POINT('',(-20.,15.,-10.));
#1995=CARTESIAN_POINT('',(-20.,0.,-10.));
#1996=CARTESIAN_POINT('',(0.,15.,-10.));
#1997=CARTESIAN_POINT('',(0.,15.,-10.));
#1998=CARTESIAN_POINT('',(-20.,15.,-10.));
#1999=CARTESIAN_POINT('Origin',(-20.,15.,0.));
#2000=CARTESIAN_POINT('',(-20.,15.,0.));
#2001=CARTESIAN_POINT('Origin',(0.,15.,0.));
#2002=CARTESIAN_POINT('',(0.,15.,0.));
#2003=CARTESIAN_POINT('Origin',(0.,0.,0.));
#2004=UNCERTAINTY_MEASURE_WITH_UNIT(LENGTH_MEASURE(0.01),#2008,
'DISTANCE_ACCURACY_VALUE',
'Maximum model space distance between geometric entities at asserted c
onnectivities');
#2005=UNCERTAINTY_MEASURE_WITH_UNIT(LENGTH_MEASURE(0.01),#2008,
'DISTANCE_ACCURACY_VALUE',
'Maximum model space distance between geometric entities at asserted c
onnectivities');
#2006=(
GEOMETRIC_REPRESENTATION_CONTEXT(3)
GLOBAL_UNCERTAINTY_ASSIGNED_CONTEXT((#2004))
GLOBAL_UNIT_ASSIGNED_CONTEXT((#2008,#2010,#2011))
REPRESENTATION_CONTEXT('','3D')
);
#2007=(
GEOMETRIC_REPRESENTATION_CONTEXT(3)
GLOBAL_UNCERTAINTY_ASSIGNED_CONTEXT((#2005))
GLOBAL_UNIT_ASSIGNED_CONTEXT((#2008,#2010,#2011))
REPRESENTATION_CONTEXT('','3D')
);
#2008=(
LENGTH_UNIT()
NAMED_UNIT(*)
SI_UNIT(.MILLI.,.METRE.)
);
#2009=(
LENGTH_UNIT()
NAMED_UNIT(*)
SI_UNIT(.CENTI.,.METRE.)
);
#2010=(
NAMED_UNIT(*)
PLANE_ANGLE_UNIT()
SI_UNIT($,.RADIAN.)
);
#2011=(
NAMED_UNIT(*)
SI_UNIT($,.STERADIAN.)
SOLID_ANGLE_UNIT()
);
#2012=SHAPE_DEFINITION_REPRESENTATION(#2013,#2014);
#2013=PRODUCT_DEFINITION_SHAPE('',$,#2016);
#2014=SHAPE_REPRESENTATION('',(#1136),#2006);
#2015=PRODUCT_DEFINITION_CONTEXT('part definition',#2020,'design');
#2016=PRODUCT_DEFINITION('obudowa_20mm_dol','obudowa_20mm_dol',#2017,#2015);
#2017=PRODUCT_DEFINITION_FORMATION('',$,#2022);
#2018=PRODUCT_RELATED_PRODUCT_CATEGORY('obudowa_20mm_dol',
'obudowa_20mm_dol',(#2022));
#2019=APPLICATION_PROTOCOL_DEFINITION('international standard',
'automotive_design',2009,#2020);
#2020=APPLICATION_CONTEXT(
'Core Data for Automotive Mechanical Design Process');
#2021=PRODUCT_CONTEXT('part definition',#2020,'mechanical');
#2022=PRODUCT('obudowa_20mm_dol','obudowa_20mm_dol',$,(#2021));
#2023=PRESENTATION_STYLE_ASSIGNMENT((#2024));
#2024=SURFACE_STYLE_USAGE(.BOTH.,#2027);
#2025=SURFACE_STYLE_RENDERING_WITH_PROPERTIES($,#2031,(#2026));
#2026=SURFACE_STYLE_TRANSPARENT(0.);
#2027=SURFACE_SIDE_STYLE('',(#2028,#2025));
#2028=SURFACE_STYLE_FILL_AREA(#2029);
#2029=FILL_AREA_STYLE('',(#2030));
#2030=FILL_AREA_STYLE_COLOUR('',#2031);
#2031=COLOUR_RGB('',0.749019607843137,0.749019607843137,0.749019607843137);
ENDSEC;
END-ISO-10303-21;
