ISO-10303-21;
HEADER;
/* Generated by software containing ST-Developer
 * from STEP Tools, Inc. (www.steptools.com) 
 */

FILE_DESCRIPTION(
/* description */ (''),
/* implementation_level */ '2;1');

FILE_NAME(
/* name */ 
'C:\\Users\\Kacper\\MATLAB\\Projects\\release_mechanism\\models\\capsu
le\\\\SICHERUNGSHUELSE_ipt_489823da.STEP',
/* time_stamp */ '2020-08-13T22:35:43+02:00',
/* author */ ('Kacper'),
/* organization */ (''),
/* preprocessor_version */ 'ST-DEVELOPER v18.1',
/* originating_system */ 'Autodesk Inventor 2021',
/* authorisation */ '');

FILE_SCHEMA (('AUTOMOTIVE_DESIGN { 1 0 10303 214 3 1 1 }'));
ENDSEC;

DATA;
#10=MECHANICAL_DESIGN_GEOMETRIC_PRESENTATION_REPRESENTATION('',(#13),#376);
#11=SHAPE_REPRESENTATION_RELATIONSHIP('SRR','None',#383,#12);
#12=ADVANCED_BREP_SHAPE_REPRESENTATION('',(#14),#375);
#13=STYLED_ITEM('',(#392),#14);
#14=MANIFOLD_SOLID_BREP('Solid1',#201);
#15=FACE_BOUND('',#53,.T.);
#16=FACE_BOUND('',#55,.T.);
#17=FACE_BOUND('',#57,.T.);
#18=FACE_BOUND('',#59,.T.);
#19=FACE_BOUND('',#61,.T.);
#20=PLANE('',#245);
#21=PLANE('',#246);
#22=PLANE('',#247);
#23=PLANE('',#248);
#24=PLANE('',#249);
#25=CONICAL_SURFACE('',#230,19.5,0.789175806390342);
#26=CONICAL_SURFACE('',#235,19.4999999999999,0.785398163397448);
#27=CONICAL_SURFACE('',#237,8.81987298107776,0.261799387799149);
#28=CONICAL_SURFACE('',#243,10.5400000000001,0.785398163397448);
#29=FACE_OUTER_BOUND('',#43,.T.);
#30=FACE_OUTER_BOUND('',#44,.T.);
#31=FACE_OUTER_BOUND('',#45,.T.);
#32=FACE_OUTER_BOUND('',#46,.T.);
#33=FACE_OUTER_BOUND('',#47,.T.);
#34=FACE_OUTER_BOUND('',#48,.T.);
#35=FACE_OUTER_BOUND('',#49,.T.);
#36=FACE_OUTER_BOUND('',#50,.T.);
#37=FACE_OUTER_BOUND('',#51,.T.);
#38=FACE_OUTER_BOUND('',#52,.T.);
#39=FACE_OUTER_BOUND('',#54,.T.);
#40=FACE_OUTER_BOUND('',#56,.T.);
#41=FACE_OUTER_BOUND('',#58,.T.);
#42=FACE_OUTER_BOUND('',#60,.T.);
#43=EDGE_LOOP('',(#134,#135,#136,#137));
#44=EDGE_LOOP('',(#138,#139,#140,#141));
#45=EDGE_LOOP('',(#142,#143,#144,#145));
#46=EDGE_LOOP('',(#146,#147,#148,#149));
#47=EDGE_LOOP('',(#150,#151,#152,#153));
#48=EDGE_LOOP('',(#154,#155,#156,#157));
#49=EDGE_LOOP('',(#158,#159,#160,#161));
#50=EDGE_LOOP('',(#162,#163,#164,#165,#166));
#51=EDGE_LOOP('',(#167,#168,#169,#170,#171));
#52=EDGE_LOOP('',(#172));
#53=EDGE_LOOP('',(#173));
#54=EDGE_LOOP('',(#174));
#55=EDGE_LOOP('',(#175));
#56=EDGE_LOOP('',(#176));
#57=EDGE_LOOP('',(#177));
#58=EDGE_LOOP('',(#178));
#59=EDGE_LOOP('',(#179));
#60=EDGE_LOOP('',(#180));
#61=EDGE_LOOP('',(#181));
#62=LINE('',#324,#71);
#63=LINE('',#330,#72);
#64=LINE('',#336,#73);
#65=LINE('',#342,#74);
#66=LINE('',#346,#75);
#67=LINE('',#350,#76);
#68=LINE('',#354,#77);
#69=LINE('',#361,#78);
#70=LINE('',#366,#79);
#71=VECTOR('',#256,8.14999999999998);
#72=VECTOR('',#263,12.7999999999998);
#73=VECTOR('',#270,15.9999999999999);
#74=VECTOR('',#277,19.5);
#75=VECTOR('',#282,20.);
#76=VECTOR('',#287,19.4999999999999);
#77=VECTOR('',#292,8.81987298107776);
#78=VECTOR('',#299,11.0000000000001);
#79=VECTOR('',#306,10.5400000000001);
#80=CIRCLE('',#222,8.14999999999998);
#81=CIRCLE('',#223,8.14999999999998);
#82=CIRCLE('',#225,12.7999999999998);
#83=CIRCLE('',#226,12.7999999999998);
#84=CIRCLE('',#228,15.9999999999999);
#85=CIRCLE('',#229,15.9999999999999);
#86=CIRCLE('',#231,20.);
#87=CIRCLE('',#232,19.);
#88=CIRCLE('',#234,20.);
#89=CIRCLE('',#236,18.9999999999999);
#90=CIRCLE('',#238,9.48974596215555);
#91=CIRCLE('',#240,11.0000000000001);
#92=CIRCLE('',#241,11.0000000000001);
#93=CIRCLE('',#242,11.0000000000001);
#94=CIRCLE('',#244,10.0800000000001);
#95=VERTEX_POINT('',#321);
#96=VERTEX_POINT('',#323);
#97=VERTEX_POINT('',#327);
#98=VERTEX_POINT('',#329);
#99=VERTEX_POINT('',#333);
#100=VERTEX_POINT('',#335);
#101=VERTEX_POINT('',#339);
#102=VERTEX_POINT('',#341);
#103=VERTEX_POINT('',#345);
#104=VERTEX_POINT('',#349);
#105=VERTEX_POINT('',#353);
#106=VERTEX_POINT('',#357);
#107=VERTEX_POINT('',#358);
#108=VERTEX_POINT('',#360);
#109=VERTEX_POINT('',#365);
#110=EDGE_CURVE('',#95,#95,#80,.T.);
#111=EDGE_CURVE('',#95,#96,#62,.T.);
#112=EDGE_CURVE('',#96,#96,#81,.T.);
#113=EDGE_CURVE('',#97,#97,#82,.T.);
#114=EDGE_CURVE('',#97,#98,#63,.T.);
#115=EDGE_CURVE('',#98,#98,#83,.T.);
#116=EDGE_CURVE('',#99,#99,#84,.T.);
#117=EDGE_CURVE('',#99,#100,#64,.T.);
#118=EDGE_CURVE('',#100,#100,#85,.T.);
#119=EDGE_CURVE('',#101,#101,#86,.T.);
#120=EDGE_CURVE('',#101,#102,#65,.T.);
#121=EDGE_CURVE('',#102,#102,#87,.T.);
#122=EDGE_CURVE('',#101,#103,#66,.T.);
#123=EDGE_CURVE('',#103,#103,#88,.T.);
#124=EDGE_CURVE('',#103,#104,#67,.T.);
#125=EDGE_CURVE('',#104,#104,#89,.T.);
#126=EDGE_CURVE('',#95,#105,#68,.T.);
#127=EDGE_CURVE('',#105,#105,#90,.T.);
#128=EDGE_CURVE('',#106,#107,#91,.T.);
#129=EDGE_CURVE('',#106,#108,#69,.T.);
#130=EDGE_CURVE('',#108,#108,#92,.T.);
#131=EDGE_CURVE('',#107,#106,#93,.T.);
#132=EDGE_CURVE('',#107,#109,#70,.T.);
#133=EDGE_CURVE('',#109,#109,#94,.T.);
#134=ORIENTED_EDGE('',*,*,#110,.F.);
#135=ORIENTED_EDGE('',*,*,#111,.T.);
#136=ORIENTED_EDGE('',*,*,#112,.T.);
#137=ORIENTED_EDGE('',*,*,#111,.F.);
#138=ORIENTED_EDGE('',*,*,#113,.F.);
#139=ORIENTED_EDGE('',*,*,#114,.T.);
#140=ORIENTED_EDGE('',*,*,#115,.T.);
#141=ORIENTED_EDGE('',*,*,#114,.F.);
#142=ORIENTED_EDGE('',*,*,#116,.F.);
#143=ORIENTED_EDGE('',*,*,#117,.T.);
#144=ORIENTED_EDGE('',*,*,#118,.T.);
#145=ORIENTED_EDGE('',*,*,#117,.F.);
#146=ORIENTED_EDGE('',*,*,#119,.T.);
#147=ORIENTED_EDGE('',*,*,#120,.T.);
#148=ORIENTED_EDGE('',*,*,#121,.F.);
#149=ORIENTED_EDGE('',*,*,#120,.F.);
#150=ORIENTED_EDGE('',*,*,#119,.F.);
#151=ORIENTED_EDGE('',*,*,#122,.T.);
#152=ORIENTED_EDGE('',*,*,#123,.T.);
#153=ORIENTED_EDGE('',*,*,#122,.F.);
#154=ORIENTED_EDGE('',*,*,#123,.F.);
#155=ORIENTED_EDGE('',*,*,#124,.T.);
#156=ORIENTED_EDGE('',*,*,#125,.T.);
#157=ORIENTED_EDGE('',*,*,#124,.F.);
#158=ORIENTED_EDGE('',*,*,#110,.T.);
#159=ORIENTED_EDGE('',*,*,#126,.T.);
#160=ORIENTED_EDGE('',*,*,#127,.F.);
#161=ORIENTED_EDGE('',*,*,#126,.F.);
#162=ORIENTED_EDGE('',*,*,#128,.F.);
#163=ORIENTED_EDGE('',*,*,#129,.T.);
#164=ORIENTED_EDGE('',*,*,#130,.T.);
#165=ORIENTED_EDGE('',*,*,#129,.F.);
#166=ORIENTED_EDGE('',*,*,#131,.F.);
#167=ORIENTED_EDGE('',*,*,#128,.T.);
#168=ORIENTED_EDGE('',*,*,#132,.T.);
#169=ORIENTED_EDGE('',*,*,#133,.T.);
#170=ORIENTED_EDGE('',*,*,#132,.F.);
#171=ORIENTED_EDGE('',*,*,#131,.T.);
#172=ORIENTED_EDGE('',*,*,#133,.F.);
#173=ORIENTED_EDGE('',*,*,#112,.F.);
#174=ORIENTED_EDGE('',*,*,#125,.F.);
#175=ORIENTED_EDGE('',*,*,#127,.T.);
#176=ORIENTED_EDGE('',*,*,#121,.T.);
#177=ORIENTED_EDGE('',*,*,#118,.F.);
#178=ORIENTED_EDGE('',*,*,#116,.T.);
#179=ORIENTED_EDGE('',*,*,#115,.F.);
#180=ORIENTED_EDGE('',*,*,#113,.T.);
#181=ORIENTED_EDGE('',*,*,#130,.F.);
#182=CYLINDRICAL_SURFACE('',#221,8.14999999999998);
#183=CYLINDRICAL_SURFACE('',#224,12.7999999999998);
#184=CYLINDRICAL_SURFACE('',#227,15.9999999999999);
#185=CYLINDRICAL_SURFACE('',#233,20.);
#186=CYLINDRICAL_SURFACE('',#239,11.0000000000001);
#187=ADVANCED_FACE('',(#29),#182,.F.);
#188=ADVANCED_FACE('',(#30),#183,.T.);
#189=ADVANCED_FACE('',(#31),#184,.F.);
#190=ADVANCED_FACE('',(#32),#25,.T.);
#191=ADVANCED_FACE('',(#33),#185,.T.);
#192=ADVANCED_FACE('',(#34),#26,.T.);
#193=ADVANCED_FACE('',(#35),#27,.F.);
#194=ADVANCED_FACE('',(#36),#186,.T.);
#195=ADVANCED_FACE('',(#37),#28,.T.);
#196=ADVANCED_FACE('',(#38,#15),#20,.T.);
#197=ADVANCED_FACE('',(#39,#16),#21,.T.);
#198=ADVANCED_FACE('',(#40,#17),#22,.T.);
#199=ADVANCED_FACE('',(#41,#18),#23,.T.);
#200=ADVANCED_FACE('',(#42,#19),#24,.T.);
#201=CLOSED_SHELL('',(#187,#188,#189,#190,#191,#192,#193,#194,#195,#196,
#197,#198,#199,#200));
#202=DERIVED_UNIT_ELEMENT(#204,1.);
#203=DERIVED_UNIT_ELEMENT(#378,3.);
#204=(
MASS_UNIT()
NAMED_UNIT(*)
SI_UNIT($,.GRAM.)
);
#205=DERIVED_UNIT((#202,#203));
#206=MEASURE_REPRESENTATION_ITEM('density measure',
POSITIVE_RATIO_MEASURE(1.),#205);
#207=PROPERTY_DEFINITION_REPRESENTATION(#212,#209);
#208=PROPERTY_DEFINITION_REPRESENTATION(#213,#210);
#209=REPRESENTATION('material name',(#211),#375);
#210=REPRESENTATION('density',(#206),#375);
#211=DESCRIPTIVE_REPRESENTATION_ITEM('Generic','Generic');
#212=PROPERTY_DEFINITION('material property','material name',#385);
#213=PROPERTY_DEFINITION('material property','density of part',#385);
#214=DATE_TIME_ROLE('creation_date');
#215=APPLIED_DATE_AND_TIME_ASSIGNMENT(#216,#214,(#385));
#216=DATE_AND_TIME(#217,#218);
#217=CALENDAR_DATE(1996,29,5);
#218=LOCAL_TIME(12,0,0.,#219);
#219=COORDINATED_UNIVERSAL_TIME_OFFSET(0,0,.BEHIND.);
#220=AXIS2_PLACEMENT_3D('placement',#319,#250,#251);
#221=AXIS2_PLACEMENT_3D('',#320,#252,#253);
#222=AXIS2_PLACEMENT_3D('',#322,#254,#255);
#223=AXIS2_PLACEMENT_3D('',#325,#257,#258);
#224=AXIS2_PLACEMENT_3D('',#326,#259,#260);
#225=AXIS2_PLACEMENT_3D('',#328,#261,#262);
#226=AXIS2_PLACEMENT_3D('',#331,#264,#265);
#227=AXIS2_PLACEMENT_3D('',#332,#266,#267);
#228=AXIS2_PLACEMENT_3D('',#334,#268,#269);
#229=AXIS2_PLACEMENT_3D('',#337,#271,#272);
#230=AXIS2_PLACEMENT_3D('',#338,#273,#274);
#231=AXIS2_PLACEMENT_3D('',#340,#275,#276);
#232=AXIS2_PLACEMENT_3D('',#343,#278,#279);
#233=AXIS2_PLACEMENT_3D('',#344,#280,#281);
#234=AXIS2_PLACEMENT_3D('',#347,#283,#284);
#235=AXIS2_PLACEMENT_3D('',#348,#285,#286);
#236=AXIS2_PLACEMENT_3D('',#351,#288,#289);
#237=AXIS2_PLACEMENT_3D('',#352,#290,#291);
#238=AXIS2_PLACEMENT_3D('',#355,#293,#294);
#239=AXIS2_PLACEMENT_3D('',#356,#295,#296);
#240=AXIS2_PLACEMENT_3D('',#359,#297,#298);
#241=AXIS2_PLACEMENT_3D('',#362,#300,#301);
#242=AXIS2_PLACEMENT_3D('',#363,#302,#303);
#243=AXIS2_PLACEMENT_3D('',#364,#304,#305);
#244=AXIS2_PLACEMENT_3D('',#367,#307,#308);
#245=AXIS2_PLACEMENT_3D('',#368,#309,#310);
#246=AXIS2_PLACEMENT_3D('',#369,#311,#312);
#247=AXIS2_PLACEMENT_3D('',#370,#313,#314);
#248=AXIS2_PLACEMENT_3D('',#371,#315,#316);
#249=AXIS2_PLACEMENT_3D('',#372,#317,#318);
#250=DIRECTION('axis',(0.,0.,1.));
#251=DIRECTION('refdir',(1.,0.,0.));
#252=DIRECTION('center_axis',(0.,-1.,0.));
#253=DIRECTION('ref_axis',(1.,0.,0.));
#254=DIRECTION('center_axis',(0.,-1.,0.));
#255=DIRECTION('ref_axis',(1.,0.,0.));
#256=DIRECTION('',(0.,-1.,0.));
#257=DIRECTION('center_axis',(0.,-1.,0.));
#258=DIRECTION('ref_axis',(1.,0.,0.));
#259=DIRECTION('center_axis',(0.,-1.,0.));
#260=DIRECTION('ref_axis',(1.,0.,0.));
#261=DIRECTION('center_axis',(0.,-1.,0.));
#262=DIRECTION('ref_axis',(1.,0.,0.));
#263=DIRECTION('',(0.,1.,0.));
#264=DIRECTION('center_axis',(0.,-1.,0.));
#265=DIRECTION('ref_axis',(1.,0.,0.));
#266=DIRECTION('center_axis',(0.,-1.,0.));
#267=DIRECTION('ref_axis',(1.,0.,0.));
#268=DIRECTION('center_axis',(0.,-1.,0.));
#269=DIRECTION('ref_axis',(1.,0.,0.));
#270=DIRECTION('',(0.,-1.,0.));
#271=DIRECTION('center_axis',(0.,-1.,0.));
#272=DIRECTION('ref_axis',(1.,0.,0.));
#273=DIRECTION('center_axis',(0.,1.,0.));
#274=DIRECTION('ref_axis',(1.,0.,0.));
#275=DIRECTION('center_axis',(0.,-1.,0.));
#276=DIRECTION('ref_axis',(1.,0.,0.));
#277=DIRECTION('',(0.7097729264022,-0.704430545154352,-8.69221142439904E-17));
#278=DIRECTION('center_axis',(0.,-1.,0.));
#279=DIRECTION('ref_axis',(1.,0.,0.));
#280=DIRECTION('center_axis',(0.,-1.,0.));
#281=DIRECTION('ref_axis',(1.,0.,0.));
#282=DIRECTION('',(0.,1.,0.));
#283=DIRECTION('center_axis',(0.,-1.,0.));
#284=DIRECTION('ref_axis',(1.,0.,0.));
#285=DIRECTION('center_axis',(0.,-1.,0.));
#286=DIRECTION('ref_axis',(1.,0.,0.));
#287=DIRECTION('',(0.707106781186548,0.707106781186548,8.65956056235493E-17));
#288=DIRECTION('center_axis',(0.,-1.,0.));
#289=DIRECTION('ref_axis',(1.,0.,0.));
#290=DIRECTION('center_axis',(0.,1.,0.));
#291=DIRECTION('ref_axis',(1.,0.,0.));
#292=DIRECTION('',(-0.258819045102521,0.965925826289068,3.16961915143176E-17));
#293=DIRECTION('center_axis',(0.,-1.,0.));
#294=DIRECTION('ref_axis',(1.,0.,0.));
#295=DIRECTION('center_axis',(0.,-1.,0.));
#296=DIRECTION('ref_axis',(1.,0.,0.));
#297=DIRECTION('center_axis',(0.,-1.,0.));
#298=DIRECTION('ref_axis',(-1.,0.,0.));
#299=DIRECTION('',(0.,1.,0.));
#300=DIRECTION('center_axis',(0.,-1.,0.));
#301=DIRECTION('ref_axis',(1.,0.,0.));
#302=DIRECTION('center_axis',(0.,-1.,0.));
#303=DIRECTION('ref_axis',(-1.,0.,0.));
#304=DIRECTION('center_axis',(0.,1.,0.));
#305=DIRECTION('ref_axis',(-1.,0.,0.));
#306=DIRECTION('',(-0.707106781186548,-0.707106781186548,8.65956056235493E-17));
#307=DIRECTION('center_axis',(0.,1.,0.));
#308=DIRECTION('ref_axis',(-1.,0.,0.));
#309=DIRECTION('center_axis',(0.,-1.,0.));
#310=DIRECTION('ref_axis',(0.,0.,-1.));
#311=DIRECTION('center_axis',(0.,1.,0.));
#312=DIRECTION('ref_axis',(0.,0.,1.));
#313=DIRECTION('center_axis',(0.,-1.,0.));
#314=DIRECTION('ref_axis',(0.,0.,-1.));
#315=DIRECTION('center_axis',(0.,-1.,0.));
#316=DIRECTION('ref_axis',(0.,0.,-1.));
#317=DIRECTION('center_axis',(0.,-1.,0.));
#318=DIRECTION('ref_axis',(0.,0.,-1.));
#319=CARTESIAN_POINT('',(0.,0.,0.));
#320=CARTESIAN_POINT('Origin',(0.,2.38365096757882,0.));
#321=CARTESIAN_POINT('',(-8.14999999999996,7.38365096757871,-9.980542E-16));
#322=CARTESIAN_POINT('Origin',(0.,7.38365096757871,0.));
#323=CARTESIAN_POINT('',(-8.14999999999998,-2.61634903242108,-9.980542E-16));
#324=CARTESIAN_POINT('',(-8.14999999999998,2.38365096757882,-9.98087141305091E-16));
#325=CARTESIAN_POINT('Origin',(0.,-2.61634903242108,0.));
#326=CARTESIAN_POINT('Origin',(0.,8.33365096757892,0.));
#327=CARTESIAN_POINT('',(-12.7999999999998,7.38365096757892,-1.567496E-15));
#328=CARTESIAN_POINT('Origin',(0.,7.38365096757892,0.));
#329=CARTESIAN_POINT('',(-12.7999999999998,9.28365096757891,-1.567496E-15));
#330=CARTESIAN_POINT('',(-12.7999999999998,8.33365096757892,-1.56754790290859E-15));
#331=CARTESIAN_POINT('Origin',(0.,9.28365096757891,0.));
#332=CARTESIAN_POINT('Origin',(0.,8.33365096757893,0.));
#333=CARTESIAN_POINT('',(-15.9999999999999,9.28365096757893,-1.95937E-15));
#334=CARTESIAN_POINT('Origin',(0.,9.28365096757893,0.));
#335=CARTESIAN_POINT('',(-15.9999999999999,7.38365096757892,-1.95937E-15));
#336=CARTESIAN_POINT('',(-15.9999999999999,8.33365096757893,-1.95943487863575E-15));
#337=CARTESIAN_POINT('Origin',(0.,7.38365096757892,0.));
#338=CARTESIAN_POINT('Origin',(0.,7.87988752363148,0.));
#339=CARTESIAN_POINT('',(-20.,8.37612407968403,-2.449213E-15));
#340=CARTESIAN_POINT('Origin',(0.,8.37612407968403,0.));
#341=CARTESIAN_POINT('',(-19.,7.38365096757893,-2.326752E-15));
#342=CARTESIAN_POINT('',(-19.5,7.87988752363148,2.38806125833734E-15));
#343=CARTESIAN_POINT('Origin',(0.,7.38365096757894,0.));
#344=CARTESIAN_POINT('Origin',(0.,9.87988752363141,0.));
#345=CARTESIAN_POINT('',(-20.,11.3836509675788,-2.449213E-15));
#346=CARTESIAN_POINT('',(-20.,9.87988752363141,-2.44929359829471E-15));
#347=CARTESIAN_POINT('Origin',(0.,11.3836509675788,0.));
#348=CARTESIAN_POINT('Origin',(0.,11.8836509675789,0.));
#349=CARTESIAN_POINT('',(-18.9999999999999,12.3836509675789,-2.326752E-15));
#350=CARTESIAN_POINT('',(-19.4999999999999,11.8836509675789,-2.38806125833733E-15));
#351=CARTESIAN_POINT('Origin',(0.,12.3836509675789,0.));
#352=CARTESIAN_POINT('Origin',(0.,9.88365096757871,0.));
#353=CARTESIAN_POINT('',(-9.48974596215557,12.3836509675787,-1.16212E-15));
#354=CARTESIAN_POINT('',(-8.81987298107776,9.88365096757871,1.08012292151631E-15));
#355=CARTESIAN_POINT('Origin',(0.,12.3836509675787,0.));
#356=CARTESIAN_POINT('Origin',(0.,2.38365096757893,0.));
#357=CARTESIAN_POINT('',(-11.0000000000001,-1.69634903242107,0.));
#358=CARTESIAN_POINT('',(11.0000000000001,-1.69634903242107,-1.3471114790621E-15));
#359=CARTESIAN_POINT('Origin',(0.,-1.69634903242107,0.));
#360=CARTESIAN_POINT('',(-11.0000000000001,7.38365096757894,-1.347067E-15));
#361=CARTESIAN_POINT('',(-11.0000000000001,2.38365096757893,-1.3471114790621E-15));
#362=CARTESIAN_POINT('Origin',(0.,7.38365096757894,0.));
#363=CARTESIAN_POINT('Origin',(0.,-1.69634903242107,0.));
#364=CARTESIAN_POINT('Origin',(0.,-2.15634903242107,0.));
#365=CARTESIAN_POINT('',(10.0800000000001,-2.61634903242108,-1.234403E-15));
#366=CARTESIAN_POINT('',(10.5400000000001,-2.15634903242107,-1.29077772630132E-15));
#367=CARTESIAN_POINT('Origin',(0.,-2.61634903242108,0.));
#368=CARTESIAN_POINT('Origin',(9.57500000000005,-2.61634903242108,0.));
#369=CARTESIAN_POINT('Origin',(14.2448729810777,12.3836509675788,0.));
#370=CARTESIAN_POINT('Origin',(17.4999999999999,7.38365096757893,0.));
#371=CARTESIAN_POINT('Origin',(14.3999999999999,9.28365096757892,0.));
#372=CARTESIAN_POINT('Origin',(11.9,7.38365096757893,0.));
#373=UNCERTAINTY_MEASURE_WITH_UNIT(LENGTH_MEASURE(0.01),#377,
'DISTANCE_ACCURACY_VALUE',
'Maximum model space distance between geometric entities at asserted c
onnectivities');
#374=UNCERTAINTY_MEASURE_WITH_UNIT(LENGTH_MEASURE(0.01),#377,
'DISTANCE_ACCURACY_VALUE',
'Maximum model space distance between geometric entities at asserted c
onnectivities');
#375=(
GEOMETRIC_REPRESENTATION_CONTEXT(3)
GLOBAL_UNCERTAINTY_ASSIGNED_CONTEXT((#373))
GLOBAL_UNIT_ASSIGNED_CONTEXT((#377,#379,#380))
REPRESENTATION_CONTEXT('','3D')
);
#376=(
GEOMETRIC_REPRESENTATION_CONTEXT(3)
GLOBAL_UNCERTAINTY_ASSIGNED_CONTEXT((#374))
GLOBAL_UNIT_ASSIGNED_CONTEXT((#377,#379,#380))
REPRESENTATION_CONTEXT('','3D')
);
#377=(
LENGTH_UNIT()
NAMED_UNIT(*)
SI_UNIT(.MILLI.,.METRE.)
);
#378=(
LENGTH_UNIT()
NAMED_UNIT(*)
SI_UNIT(.CENTI.,.METRE.)
);
#379=(
NAMED_UNIT(*)
PLANE_ANGLE_UNIT()
SI_UNIT($,.RADIAN.)
);
#380=(
NAMED_UNIT(*)
SI_UNIT($,.STERADIAN.)
SOLID_ANGLE_UNIT()
);
#381=SHAPE_DEFINITION_REPRESENTATION(#382,#383);
#382=PRODUCT_DEFINITION_SHAPE('',$,#385);
#383=SHAPE_REPRESENTATION('',(#220),#375);
#384=PRODUCT_DEFINITION_CONTEXT('part definition',#389,'design');
#385=PRODUCT_DEFINITION('SICHERUNGSHUELSE','SICHERUNGSHUELSE',#386,#384);
#386=PRODUCT_DEFINITION_FORMATION('None',$,#391);
#387=PRODUCT_RELATED_PRODUCT_CATEGORY('SICHERUNGSHUELSE',
'SICHERUNGSHUELSE',(#391));
#388=APPLICATION_PROTOCOL_DEFINITION('international standard',
'automotive_design',2009,#389);
#389=APPLICATION_CONTEXT(
'Core Data for Automotive Mechanical Design Process');
#390=PRODUCT_CONTEXT('part definition',#389,'mechanical');
#391=PRODUCT('SICHERUNGSHUELSE','SICHERUNGSHUELSE',$,(#390));
#392=PRESENTATION_STYLE_ASSIGNMENT((#393));
#393=SURFACE_STYLE_USAGE(.BOTH.,#396);
#394=SURFACE_STYLE_RENDERING_WITH_PROPERTIES($,#400,(#395));
#395=SURFACE_STYLE_TRANSPARENT(0.);
#396=SURFACE_SIDE_STYLE('',(#397,#394));
#397=SURFACE_STYLE_FILL_AREA(#398);
#398=FILL_AREA_STYLE('',(#399));
#399=FILL_AREA_STYLE_COLOUR('',#400);
#400=COLOUR_RGB('',0.749019607843137,0.749019607843137,0.749019607843137);
ENDSEC;
END-ISO-10303-21;
