ISO-10303-21;
HEADER;
/* Generated by software containing ST-Developer
 * from STEP Tools, Inc. (www.steptools.com) 
 */
/* OPTION: using custom schema-name function */

FILE_DESCRIPTION(
/* description */ (''),
/* implementation_level */ '2;1');

FILE_NAME(
/* name */ 'F0013963500-A-P2016.038.026.stp',
/* time_stamp */ '2020-02-10T09:41:42+01:00',
/* author */ ('DR. FRITZ FAULHABER GmbH & Co. KG'),
/* organization */ ('DR. FRITZ FAULHABER GmbH & Co. KG'),
/* preprocessor_version */ 'ST-DEVELOPER v16.7',
/* originating_system */ 'SIEMENS PLM Software NX 12.0',
/* authorisation */ '');

FILE_SCHEMA (('AUTOMOTIVE_DESIGN { 1 0 10303 214 3 1 1 1 }'));
ENDSEC;

DATA;
#10=SHAPE_REPRESENTATION_RELATIONSHIP('None',
'relationship between F0013963500-A-P2016.038.026-None and F0013963500
-A-P2016.038.026-None',#22,#11);
#11=ADVANCED_BREP_SHAPE_REPRESENTATION(
'F0013963500-A-P2016.038.026-None',(#69,#70),#750);
#12=SHAPE_DEFINITION_REPRESENTATION(#13,#22);
#13=PRODUCT_DEFINITION_SHAPE('','',#14);
#14=PRODUCT_DEFINITION(' ','',#16,#15);
#15=PRODUCT_DEFINITION_CONTEXT('part definition',#21,'design');
#16=PRODUCT_DEFINITION_FORMATION_WITH_SPECIFIED_SOURCE(' ',' ',#18,
 .NOT_KNOWN.);
#17=PRODUCT_RELATED_PRODUCT_CATEGORY('part','',(#18));
#18=PRODUCT('F0013963500-A-P2016.038.026','F0013963500-A-P2016.038.026',
' ',(#19));
#19=PRODUCT_CONTEXT(' ',#21,'mechanical');
#20=APPLICATION_PROTOCOL_DEFINITION('international standard',
'automotive_design',2010,#21);
#21=APPLICATION_CONTEXT(
'core data for automotive mechanical design processes');
#22=SHAPE_REPRESENTATION('F0013963500-A-P2016.038.026-None',(#440),#750);
#23=OVER_RIDING_STYLED_ITEM('',(#33),#146,#30);
#24=OVER_RIDING_STYLED_ITEM('',(#35),#157,#31);
#25=OVER_RIDING_STYLED_ITEM('',(#36),#160,#31);
#26=OVER_RIDING_STYLED_ITEM('',(#37),#165,#31);
#27=DRAUGHTING_PRE_DEFINED_COLOUR('red');
#28=DRAUGHTING_PRE_DEFINED_COLOUR('blue');
#29=PRESENTATION_LAYER_ASSIGNMENT('1','Layer 1',(#69,#70));
#30=STYLED_ITEM('',(#32),#69);
#31=STYLED_ITEM('',(#34),#70);
#32=PRESENTATION_STYLE_ASSIGNMENT((#38));
#33=PRESENTATION_STYLE_ASSIGNMENT((#39));
#34=PRESENTATION_STYLE_ASSIGNMENT((#40));
#35=PRESENTATION_STYLE_ASSIGNMENT((#41));
#36=PRESENTATION_STYLE_ASSIGNMENT((#42));
#37=PRESENTATION_STYLE_ASSIGNMENT((#43));
#38=SURFACE_STYLE_USAGE(.BOTH.,#44);
#39=SURFACE_STYLE_USAGE(.BOTH.,#45);
#40=SURFACE_STYLE_USAGE(.BOTH.,#46);
#41=SURFACE_STYLE_USAGE(.BOTH.,#47);
#42=SURFACE_STYLE_USAGE(.BOTH.,#48);
#43=SURFACE_STYLE_USAGE(.BOTH.,#49);
#44=SURFACE_SIDE_STYLE('',(#50));
#45=SURFACE_SIDE_STYLE('',(#51));
#46=SURFACE_SIDE_STYLE('',(#52));
#47=SURFACE_SIDE_STYLE('',(#53));
#48=SURFACE_SIDE_STYLE('',(#54));
#49=SURFACE_SIDE_STYLE('',(#55));
#50=SURFACE_STYLE_FILL_AREA(#56);
#51=SURFACE_STYLE_FILL_AREA(#57);
#52=SURFACE_STYLE_FILL_AREA(#58);
#53=SURFACE_STYLE_FILL_AREA(#59);
#54=SURFACE_STYLE_FILL_AREA(#60);
#55=SURFACE_STYLE_FILL_AREA(#61);
#56=FILL_AREA_STYLE('',(#62));
#57=FILL_AREA_STYLE('',(#63));
#58=FILL_AREA_STYLE('',(#64));
#59=FILL_AREA_STYLE('',(#65));
#60=FILL_AREA_STYLE('',(#66));
#61=FILL_AREA_STYLE('',(#67));
#62=FILL_AREA_STYLE_COLOUR('',#68);
#63=FILL_AREA_STYLE_COLOUR('',#27);
#64=FILL_AREA_STYLE_COLOUR('',#68);
#65=FILL_AREA_STYLE_COLOUR('',#27);
#66=FILL_AREA_STYLE_COLOUR('',#27);
#67=FILL_AREA_STYLE_COLOUR('',#28);
#68=COLOUR_RGB('Light Gray',0.6,0.6,0.6);
#69=MANIFOLD_SOLID_BREP('',#71);
#70=MANIFOLD_SOLID_BREP('',#72);
#71=CLOSED_SHELL('',(#146,#147,#148,#149));
#72=CLOSED_SHELL('',(#150,#151,#152,#153,#154,#155,#156,#157,#158,#159,
#160,#161,#162,#163,#164,#165,#166,#167,#168,#169,#170,#171,#172,#173,#174,
#175,#176,#177,#178,#179,#180));
#73=CONICAL_SURFACE('',#447,3.,45.0000000000002);
#74=CYLINDRICAL_SURFACE('',#446,3.);
#75=CYLINDRICAL_SURFACE('',#450,10.3999999999995);
#76=CYLINDRICAL_SURFACE('',#453,6.);
#77=CYLINDRICAL_SURFACE('',#458,5.034);
#78=CYLINDRICAL_SURFACE('',#462,11.);
#79=CYLINDRICAL_SURFACE('',#474,7.5);
#80=CYLINDRICAL_SURFACE('',#477,4.);
#81=CYLINDRICAL_SURFACE('',#480,10.9995);
#82=CYLINDRICAL_SURFACE('',#487,11.);
#83=CYLINDRICAL_SURFACE('',#490,0.8);
#84=CYLINDRICAL_SURFACE('',#493,0.8);
#85=CYLINDRICAL_SURFACE('',#496,0.8);
#86=CYLINDRICAL_SURFACE('',#499,0.8);
#87=CYLINDRICAL_SURFACE('',#502,0.8);
#88=CYLINDRICAL_SURFACE('',#505,0.8);
#89=CYLINDRICAL_SURFACE('',#508,10.5);
#90=FACE_BOUND('',#211,.T.);
#91=FACE_BOUND('',#212,.T.);
#92=FACE_BOUND('',#213,.T.);
#93=FACE_BOUND('',#214,.T.);
#94=FACE_BOUND('',#215,.T.);
#95=FACE_BOUND('',#216,.T.);
#96=FACE_BOUND('',#217,.T.);
#97=FACE_BOUND('',#218,.T.);
#98=FACE_BOUND('',#219,.T.);
#99=FACE_BOUND('',#220,.T.);
#100=FACE_BOUND('',#222,.T.);
#101=FACE_BOUND('',#223,.T.);
#102=FACE_BOUND('',#224,.T.);
#103=FACE_BOUND('',#225,.T.);
#104=FACE_BOUND('',#226,.T.);
#105=FACE_BOUND('',#227,.T.);
#106=FACE_BOUND('',#228,.T.);
#107=FACE_BOUND('',#229,.T.);
#108=FACE_BOUND('',#230,.T.);
#109=FACE_BOUND('',#231,.T.);
#110=FACE_BOUND('',#232,.T.);
#111=FACE_BOUND('',#233,.T.);
#112=FACE_BOUND('',#234,.T.);
#113=FACE_BOUND('',#235,.T.);
#114=FACE_BOUND('',#236,.T.);
#115=FACE_BOUND('',#237,.T.);
#116=FACE_BOUND('',#238,.T.);
#117=FACE_BOUND('',#239,.T.);
#118=FACE_BOUND('',#241,.T.);
#119=FACE_BOUND('',#242,.T.);
#120=FACE_BOUND('',#243,.T.);
#121=FACE_BOUND('',#244,.T.);
#122=FACE_BOUND('',#245,.T.);
#123=FACE_BOUND('',#246,.T.);
#124=FACE_BOUND('',#247,.T.);
#125=FACE_BOUND('',#248,.T.);
#126=FACE_BOUND('',#249,.T.);
#127=FACE_BOUND('',#250,.T.);
#128=FACE_BOUND('',#251,.T.);
#129=FACE_BOUND('',#252,.T.);
#130=FACE_BOUND('',#254,.T.);
#131=FACE_BOUND('',#255,.T.);
#132=FACE_BOUND('',#257,.T.);
#133=FACE_BOUND('',#258,.T.);
#134=FACE_BOUND('',#260,.T.);
#135=FACE_BOUND('',#261,.T.);
#136=FACE_BOUND('',#263,.T.);
#137=FACE_BOUND('',#264,.T.);
#138=FACE_BOUND('',#266,.T.);
#139=FACE_BOUND('',#267,.T.);
#140=FACE_BOUND('',#269,.T.);
#141=FACE_BOUND('',#270,.T.);
#142=FACE_BOUND('',#271,.T.);
#143=FACE_BOUND('',#272,.T.);
#144=FACE_BOUND('',#273,.T.);
#145=FACE_BOUND('',#274,.T.);
#146=ADVANCED_FACE('AS_WELLE',(#199),#181,.T.);
#147=ADVANCED_FACE('',(#200),#182,.T.);
#148=ADVANCED_FACE('',(#90,#91),#74,.T.);
#149=ADVANCED_FACE('',(#92,#93),#73,.T.);
#150=ADVANCED_FACE('',(#94,#95),#75,.T.);
#151=ADVANCED_FACE('',(#96,#97),#76,.F.);
#152=ADVANCED_FACE('',(#98,#99),#183,.T.);
#153=ADVANCED_FACE('',(#201),#184,.F.);
#154=ADVANCED_FACE('',(#100,#101),#77,.F.);
#155=ADVANCED_FACE('',(#102,#103),#185,.F.);
#156=ADVANCED_FACE('',(#104,#105),#78,.T.);
#157=ADVANCED_FACE('AS_FLANSCH',(#106,#107,#108,#109,#110,#111,#112,#113),
#186,.T.);
#158=ADVANCED_FACE('',(#114,#115),#187,.T.);
#159=ADVANCED_FACE('',(#116,#117),#79,.T.);
#160=ADVANCED_FACE('AS_ROTIEREND',(#202),#188,.T.);
#161=ADVANCED_FACE('',(#118,#119),#80,.T.);
#162=ADVANCED_FACE('',(#120,#121),#81,.T.);
#163=ADVANCED_FACE('',(#122,#123),#189,.T.);
#164=ADVANCED_FACE('',(#124,#125),#190,.F.);
#165=ADVANCED_FACE('BS_FLANSCH',(#126,#127),#191,.T.);
#166=ADVANCED_FACE('',(#128,#129),#82,.T.);
#167=ADVANCED_FACE('',(#203),#192,.F.);
#168=ADVANCED_FACE('',(#130,#131),#83,.F.);
#169=ADVANCED_FACE('',(#204),#193,.F.);
#170=ADVANCED_FACE('',(#132,#133),#84,.F.);
#171=ADVANCED_FACE('',(#205),#194,.F.);
#172=ADVANCED_FACE('',(#134,#135),#85,.F.);
#173=ADVANCED_FACE('',(#206),#195,.F.);
#174=ADVANCED_FACE('',(#136,#137),#86,.F.);
#175=ADVANCED_FACE('',(#207),#196,.F.);
#176=ADVANCED_FACE('',(#138,#139),#87,.F.);
#177=ADVANCED_FACE('',(#208),#197,.F.);
#178=ADVANCED_FACE('',(#140,#141),#88,.F.);
#179=ADVANCED_FACE('',(#142,#143),#198,.F.);
#180=ADVANCED_FACE('',(#144,#145),#89,.F.);
#181=PLANE('',#442);
#182=PLANE('',#444);
#183=PLANE('',#454);
#184=PLANE('',#456);
#185=PLANE('',#459);
#186=PLANE('',#470);
#187=PLANE('',#473);
#188=PLANE('',#476);
#189=PLANE('',#481);
#190=PLANE('',#483);
#191=PLANE('',#486);
#192=PLANE('',#489);
#193=PLANE('',#492);
#194=PLANE('',#495);
#195=PLANE('',#498);
#196=PLANE('',#501);
#197=PLANE('',#504);
#198=PLANE('',#507);
#199=FACE_OUTER_BOUND('',#209,.T.);
#200=FACE_OUTER_BOUND('',#210,.T.);
#201=FACE_OUTER_BOUND('',#221,.T.);
#202=FACE_OUTER_BOUND('',#240,.T.);
#203=FACE_OUTER_BOUND('',#253,.T.);
#204=FACE_OUTER_BOUND('',#256,.T.);
#205=FACE_OUTER_BOUND('',#259,.T.);
#206=FACE_OUTER_BOUND('',#262,.T.);
#207=FACE_OUTER_BOUND('',#265,.T.);
#208=FACE_OUTER_BOUND('',#268,.T.);
#209=EDGE_LOOP('',(#275));
#210=EDGE_LOOP('',(#276));
#211=EDGE_LOOP('',(#277));
#212=EDGE_LOOP('',(#278));
#213=EDGE_LOOP('',(#279));
#214=EDGE_LOOP('',(#280));
#215=EDGE_LOOP('',(#281));
#216=EDGE_LOOP('',(#282));
#217=EDGE_LOOP('',(#283));
#218=EDGE_LOOP('',(#284));
#219=EDGE_LOOP('',(#285));
#220=EDGE_LOOP('',(#286));
#221=EDGE_LOOP('',(#287));
#222=EDGE_LOOP('',(#288));
#223=EDGE_LOOP('',(#289));
#224=EDGE_LOOP('',(#290));
#225=EDGE_LOOP('',(#291));
#226=EDGE_LOOP('',(#292));
#227=EDGE_LOOP('',(#293));
#228=EDGE_LOOP('',(#294));
#229=EDGE_LOOP('',(#295));
#230=EDGE_LOOP('',(#296));
#231=EDGE_LOOP('',(#297));
#232=EDGE_LOOP('',(#298));
#233=EDGE_LOOP('',(#299));
#234=EDGE_LOOP('',(#300));
#235=EDGE_LOOP('',(#301));
#236=EDGE_LOOP('',(#302));
#237=EDGE_LOOP('',(#303));
#238=EDGE_LOOP('',(#304));
#239=EDGE_LOOP('',(#305));
#240=EDGE_LOOP('',(#306));
#241=EDGE_LOOP('',(#307));
#242=EDGE_LOOP('',(#308));
#243=EDGE_LOOP('',(#309));
#244=EDGE_LOOP('',(#310));
#245=EDGE_LOOP('',(#311));
#246=EDGE_LOOP('',(#312));
#247=EDGE_LOOP('',(#313));
#248=EDGE_LOOP('',(#314));
#249=EDGE_LOOP('',(#315));
#250=EDGE_LOOP('',(#316));
#251=EDGE_LOOP('',(#317));
#252=EDGE_LOOP('',(#318));
#253=EDGE_LOOP('',(#319));
#254=EDGE_LOOP('',(#320));
#255=EDGE_LOOP('',(#321));
#256=EDGE_LOOP('',(#322));
#257=EDGE_LOOP('',(#323));
#258=EDGE_LOOP('',(#324));
#259=EDGE_LOOP('',(#325));
#260=EDGE_LOOP('',(#326));
#261=EDGE_LOOP('',(#327));
#262=EDGE_LOOP('',(#328));
#263=EDGE_LOOP('',(#329));
#264=EDGE_LOOP('',(#330));
#265=EDGE_LOOP('',(#331));
#266=EDGE_LOOP('',(#332));
#267=EDGE_LOOP('',(#333));
#268=EDGE_LOOP('',(#334));
#269=EDGE_LOOP('',(#335));
#270=EDGE_LOOP('',(#336));
#271=EDGE_LOOP('',(#337));
#272=EDGE_LOOP('',(#338));
#273=EDGE_LOOP('',(#339));
#274=EDGE_LOOP('',(#340));
#275=ORIENTED_EDGE('',*,*,#374,.T.);
#276=ORIENTED_EDGE('',*,*,#375,.F.);
#277=ORIENTED_EDGE('',*,*,#376,.T.);
#278=ORIENTED_EDGE('',*,*,#375,.T.);
#279=ORIENTED_EDGE('',*,*,#374,.F.);
#280=ORIENTED_EDGE('',*,*,#376,.F.);
#281=ORIENTED_EDGE('',*,*,#377,.F.);
#282=ORIENTED_EDGE('',*,*,#378,.F.);
#283=ORIENTED_EDGE('',*,*,#379,.T.);
#284=ORIENTED_EDGE('',*,*,#380,.F.);
#285=ORIENTED_EDGE('',*,*,#377,.T.);
#286=ORIENTED_EDGE('',*,*,#379,.F.);
#287=ORIENTED_EDGE('',*,*,#381,.T.);
#288=ORIENTED_EDGE('',*,*,#382,.T.);
#289=ORIENTED_EDGE('',*,*,#381,.F.);
#290=ORIENTED_EDGE('',*,*,#382,.F.);
#291=ORIENTED_EDGE('',*,*,#380,.T.);
#292=ORIENTED_EDGE('',*,*,#383,.T.);
#293=ORIENTED_EDGE('',*,*,#384,.T.);
#294=ORIENTED_EDGE('',*,*,#385,.T.);
#295=ORIENTED_EDGE('',*,*,#386,.T.);
#296=ORIENTED_EDGE('',*,*,#387,.T.);
#297=ORIENTED_EDGE('',*,*,#388,.T.);
#298=ORIENTED_EDGE('',*,*,#389,.T.);
#299=ORIENTED_EDGE('',*,*,#390,.T.);
#300=ORIENTED_EDGE('',*,*,#391,.F.);
#301=ORIENTED_EDGE('',*,*,#383,.F.);
#302=ORIENTED_EDGE('',*,*,#392,.F.);
#303=ORIENTED_EDGE('',*,*,#393,.T.);
#304=ORIENTED_EDGE('',*,*,#393,.F.);
#305=ORIENTED_EDGE('',*,*,#391,.T.);
#306=ORIENTED_EDGE('',*,*,#394,.T.);
#307=ORIENTED_EDGE('',*,*,#394,.F.);
#308=ORIENTED_EDGE('',*,*,#392,.T.);
#309=ORIENTED_EDGE('',*,*,#395,.T.);
#310=ORIENTED_EDGE('',*,*,#396,.F.);
#311=ORIENTED_EDGE('',*,*,#384,.F.);
#312=ORIENTED_EDGE('',*,*,#396,.T.);
#313=ORIENTED_EDGE('',*,*,#397,.T.);
#314=ORIENTED_EDGE('',*,*,#395,.F.);
#315=ORIENTED_EDGE('',*,*,#398,.T.);
#316=ORIENTED_EDGE('',*,*,#399,.T.);
#317=ORIENTED_EDGE('',*,*,#397,.F.);
#318=ORIENTED_EDGE('',*,*,#399,.F.);
#319=ORIENTED_EDGE('',*,*,#400,.T.);
#320=ORIENTED_EDGE('',*,*,#400,.F.);
#321=ORIENTED_EDGE('',*,*,#390,.F.);
#322=ORIENTED_EDGE('',*,*,#401,.F.);
#323=ORIENTED_EDGE('',*,*,#401,.T.);
#324=ORIENTED_EDGE('',*,*,#389,.F.);
#325=ORIENTED_EDGE('',*,*,#402,.F.);
#326=ORIENTED_EDGE('',*,*,#402,.T.);
#327=ORIENTED_EDGE('',*,*,#388,.F.);
#328=ORIENTED_EDGE('',*,*,#403,.F.);
#329=ORIENTED_EDGE('',*,*,#403,.T.);
#330=ORIENTED_EDGE('',*,*,#387,.F.);
#331=ORIENTED_EDGE('',*,*,#404,.F.);
#332=ORIENTED_EDGE('',*,*,#404,.T.);
#333=ORIENTED_EDGE('',*,*,#386,.F.);
#334=ORIENTED_EDGE('',*,*,#405,.F.);
#335=ORIENTED_EDGE('',*,*,#405,.T.);
#336=ORIENTED_EDGE('',*,*,#385,.F.);
#337=ORIENTED_EDGE('',*,*,#378,.T.);
#338=ORIENTED_EDGE('',*,*,#406,.T.);
#339=ORIENTED_EDGE('',*,*,#406,.F.);
#340=ORIENTED_EDGE('',*,*,#398,.F.);
#341=VERTEX_POINT('',#649);
#342=VERTEX_POINT('',#652);
#343=VERTEX_POINT('',#655);
#344=VERTEX_POINT('',#659);
#345=VERTEX_POINT('',#661);
#346=VERTEX_POINT('',#664);
#347=VERTEX_POINT('',#666);
#348=VERTEX_POINT('',#670);
#349=VERTEX_POINT('',#673);
#350=VERTEX_POINT('',#677);
#351=VERTEX_POINT('',#679);
#352=VERTEX_POINT('',#682);
#353=VERTEX_POINT('',#684);
#354=VERTEX_POINT('',#686);
#355=VERTEX_POINT('',#688);
#356=VERTEX_POINT('',#690);
#357=VERTEX_POINT('',#692);
#358=VERTEX_POINT('',#694);
#359=VERTEX_POINT('',#697);
#360=VERTEX_POINT('',#699);
#361=VERTEX_POINT('',#703);
#362=VERTEX_POINT('',#707);
#363=VERTEX_POINT('',#709);
#364=VERTEX_POINT('',#713);
#365=VERTEX_POINT('',#716);
#366=VERTEX_POINT('',#718);
#367=VERTEX_POINT('',#722);
#368=VERTEX_POINT('',#726);
#369=VERTEX_POINT('',#730);
#370=VERTEX_POINT('',#734);
#371=VERTEX_POINT('',#738);
#372=VERTEX_POINT('',#742);
#373=VERTEX_POINT('',#746);
#374=EDGE_CURVE('',#341,#341,#407,.T.);
#375=EDGE_CURVE('',#342,#342,#408,.T.);
#376=EDGE_CURVE('',#343,#343,#409,.T.);
#377=EDGE_CURVE('',#344,#344,#410,.T.);
#378=EDGE_CURVE('',#345,#345,#411,.T.);
#379=EDGE_CURVE('',#346,#346,#412,.T.);
#380=EDGE_CURVE('',#347,#347,#413,.T.);
#381=EDGE_CURVE('',#348,#348,#414,.T.);
#382=EDGE_CURVE('',#349,#349,#415,.T.);
#383=EDGE_CURVE('',#350,#350,#416,.T.);
#384=EDGE_CURVE('',#351,#351,#417,.T.);
#385=EDGE_CURVE('',#352,#352,#418,.T.);
#386=EDGE_CURVE('',#353,#353,#419,.T.);
#387=EDGE_CURVE('',#354,#354,#420,.T.);
#388=EDGE_CURVE('',#355,#355,#421,.T.);
#389=EDGE_CURVE('',#356,#356,#422,.T.);
#390=EDGE_CURVE('',#357,#357,#423,.T.);
#391=EDGE_CURVE('',#358,#358,#424,.T.);
#392=EDGE_CURVE('',#359,#359,#425,.T.);
#393=EDGE_CURVE('',#360,#360,#426,.T.);
#394=EDGE_CURVE('',#361,#361,#427,.T.);
#395=EDGE_CURVE('',#362,#362,#428,.T.);
#396=EDGE_CURVE('',#363,#363,#429,.T.);
#397=EDGE_CURVE('',#364,#364,#430,.T.);
#398=EDGE_CURVE('',#365,#365,#431,.T.);
#399=EDGE_CURVE('',#366,#366,#432,.T.);
#400=EDGE_CURVE('',#367,#367,#433,.T.);
#401=EDGE_CURVE('',#368,#368,#434,.T.);
#402=EDGE_CURVE('',#369,#369,#435,.T.);
#403=EDGE_CURVE('',#370,#370,#436,.T.);
#404=EDGE_CURVE('',#371,#371,#437,.T.);
#405=EDGE_CURVE('',#372,#372,#438,.T.);
#406=EDGE_CURVE('',#373,#373,#439,.T.);
#407=CIRCLE('',#441,2.8);
#408=CIRCLE('',#443,3.);
#409=CIRCLE('',#445,3.);
#410=CIRCLE('',#448,10.3999999999995);
#411=CIRCLE('',#449,10.3999999999995);
#412=CIRCLE('',#451,6.);
#413=CIRCLE('',#452,6.);
#414=CIRCLE('',#455,5.034);
#415=CIRCLE('',#457,5.034);
#416=CIRCLE('',#460,11.);
#417=CIRCLE('',#461,11.);
#418=CIRCLE('',#463,0.8);
#419=CIRCLE('',#464,0.8);
#420=CIRCLE('',#465,0.8);
#421=CIRCLE('',#466,0.8);
#422=CIRCLE('',#467,0.8);
#423=CIRCLE('',#468,0.8);
#424=CIRCLE('',#469,7.5);
#425=CIRCLE('',#471,4.);
#426=CIRCLE('',#472,7.5);
#427=CIRCLE('',#475,4.);
#428=CIRCLE('',#478,10.9995);
#429=CIRCLE('',#479,10.9995);
#430=CIRCLE('',#482,11.);
#431=CIRCLE('',#484,10.5);
#432=CIRCLE('',#485,11.);
#433=CIRCLE('',#488,0.8);
#434=CIRCLE('',#491,0.8);
#435=CIRCLE('',#494,0.8);
#436=CIRCLE('',#497,0.8);
#437=CIRCLE('',#500,0.8);
#438=CIRCLE('',#503,0.8);
#439=CIRCLE('',#506,10.5);
#440=AXIS2_PLACEMENT_3D('',#647,#509,#510);
#441=AXIS2_PLACEMENT_3D('',#648,#511,#512);
#442=AXIS2_PLACEMENT_3D('',#650,#513,#514);
#443=AXIS2_PLACEMENT_3D('',#651,#515,#516);
#444=AXIS2_PLACEMENT_3D('',#653,#517,#518);
#445=AXIS2_PLACEMENT_3D('',#654,#519,#520);
#446=AXIS2_PLACEMENT_3D('',#656,#521,#522);
#447=AXIS2_PLACEMENT_3D('',#657,#523,#524);
#448=AXIS2_PLACEMENT_3D('',#658,#525,#526);
#449=AXIS2_PLACEMENT_3D('',#660,#527,#528);
#450=AXIS2_PLACEMENT_3D('',#662,#529,#530);
#451=AXIS2_PLACEMENT_3D('',#663,#531,#532);
#452=AXIS2_PLACEMENT_3D('',#665,#533,#534);
#453=AXIS2_PLACEMENT_3D('',#667,#535,#536);
#454=AXIS2_PLACEMENT_3D('',#668,#537,#538);
#455=AXIS2_PLACEMENT_3D('',#669,#539,#540);
#456=AXIS2_PLACEMENT_3D('',#671,#541,#542);
#457=AXIS2_PLACEMENT_3D('',#672,#543,#544);
#458=AXIS2_PLACEMENT_3D('',#674,#545,#546);
#459=AXIS2_PLACEMENT_3D('',#675,#547,#548);
#460=AXIS2_PLACEMENT_3D('',#676,#549,#550);
#461=AXIS2_PLACEMENT_3D('',#678,#551,#552);
#462=AXIS2_PLACEMENT_3D('',#680,#553,#554);
#463=AXIS2_PLACEMENT_3D('',#681,#555,#556);
#464=AXIS2_PLACEMENT_3D('',#683,#557,#558);
#465=AXIS2_PLACEMENT_3D('',#685,#559,#560);
#466=AXIS2_PLACEMENT_3D('',#687,#561,#562);
#467=AXIS2_PLACEMENT_3D('',#689,#563,#564);
#468=AXIS2_PLACEMENT_3D('',#691,#565,#566);
#469=AXIS2_PLACEMENT_3D('',#693,#567,#568);
#470=AXIS2_PLACEMENT_3D('',#695,#569,#570);
#471=AXIS2_PLACEMENT_3D('',#696,#571,#572);
#472=AXIS2_PLACEMENT_3D('',#698,#573,#574);
#473=AXIS2_PLACEMENT_3D('',#700,#575,#576);
#474=AXIS2_PLACEMENT_3D('',#701,#577,#578);
#475=AXIS2_PLACEMENT_3D('',#702,#579,#580);
#476=AXIS2_PLACEMENT_3D('',#704,#581,#582);
#477=AXIS2_PLACEMENT_3D('',#705,#583,#584);
#478=AXIS2_PLACEMENT_3D('',#706,#585,#586);
#479=AXIS2_PLACEMENT_3D('',#708,#587,#588);
#480=AXIS2_PLACEMENT_3D('',#710,#589,#590);
#481=AXIS2_PLACEMENT_3D('',#711,#591,#592);
#482=AXIS2_PLACEMENT_3D('',#712,#593,#594);
#483=AXIS2_PLACEMENT_3D('',#714,#595,#596);
#484=AXIS2_PLACEMENT_3D('',#715,#597,#598);
#485=AXIS2_PLACEMENT_3D('',#717,#599,#600);
#486=AXIS2_PLACEMENT_3D('',#719,#601,#602);
#487=AXIS2_PLACEMENT_3D('',#720,#603,#604);
#488=AXIS2_PLACEMENT_3D('',#721,#605,#606);
#489=AXIS2_PLACEMENT_3D('',#723,#607,#608);
#490=AXIS2_PLACEMENT_3D('',#724,#609,#610);
#491=AXIS2_PLACEMENT_3D('',#725,#611,#612);
#492=AXIS2_PLACEMENT_3D('',#727,#613,#614);
#493=AXIS2_PLACEMENT_3D('',#728,#615,#616);
#494=AXIS2_PLACEMENT_3D('',#729,#617,#618);
#495=AXIS2_PLACEMENT_3D('',#731,#619,#620);
#496=AXIS2_PLACEMENT_3D('',#732,#621,#622);
#497=AXIS2_PLACEMENT_3D('',#733,#623,#624);
#498=AXIS2_PLACEMENT_3D('',#735,#625,#626);
#499=AXIS2_PLACEMENT_3D('',#736,#627,#628);
#500=AXIS2_PLACEMENT_3D('',#737,#629,#630);
#501=AXIS2_PLACEMENT_3D('',#739,#631,#632);
#502=AXIS2_PLACEMENT_3D('',#740,#633,#634);
#503=AXIS2_PLACEMENT_3D('',#741,#635,#636);
#504=AXIS2_PLACEMENT_3D('',#743,#637,#638);
#505=AXIS2_PLACEMENT_3D('',#744,#639,#640);
#506=AXIS2_PLACEMENT_3D('',#745,#641,#642);
#507=AXIS2_PLACEMENT_3D('',#747,#643,#644);
#508=AXIS2_PLACEMENT_3D('',#748,#645,#646);
#509=DIRECTION('',(0.,0.,1.));
#510=DIRECTION('',(1.,0.,0.));
#511=DIRECTION('',(0.,0.,1.));
#512=DIRECTION('',(1.,0.,0.));
#513=DIRECTION('',(0.,0.,1.));
#514=DIRECTION('',(1.,0.,0.));
#515=DIRECTION('',(0.,0.,1.));
#516=DIRECTION('',(1.,0.,0.));
#517=DIRECTION('',(0.,0.,-1.));
#518=DIRECTION('',(-1.,0.,0.));
#519=DIRECTION('',(0.,0.,-1.));
#520=DIRECTION('',(1.,0.,0.));
#521=DIRECTION('',(0.,0.,1.));
#522=DIRECTION('',(1.,0.,0.));
#523=DIRECTION('',(0.,0.,-1.));
#524=DIRECTION('',(-1.,0.,0.));
#525=DIRECTION('',(0.,0.,-1.));
#526=DIRECTION('',(-1.,0.,0.));
#527=DIRECTION('',(0.,0.,1.));
#528=DIRECTION('',(1.,0.,0.));
#529=DIRECTION('',(0.,0.,1.));
#530=DIRECTION('',(1.,0.,0.));
#531=DIRECTION('',(0.,0.,-1.));
#532=DIRECTION('',(-1.,0.,0.));
#533=DIRECTION('',(0.,0.,-1.));
#534=DIRECTION('',(-1.,0.,0.));
#535=DIRECTION('',(0.,0.,1.));
#536=DIRECTION('',(1.,0.,0.));
#537=DIRECTION('',(0.,0.,-1.));
#538=DIRECTION('',(-1.,0.,0.));
#539=DIRECTION('',(0.,0.,-1.));
#540=DIRECTION('',(1.,0.,0.));
#541=DIRECTION('',(0.,0.,1.));
#542=DIRECTION('',(1.,0.,0.));
#543=DIRECTION('',(0.,0.,-1.));
#544=DIRECTION('',(1.,0.,0.));
#545=DIRECTION('',(0.,0.,1.));
#546=DIRECTION('',(1.,0.,0.));
#547=DIRECTION('',(0.,0.,1.));
#548=DIRECTION('',(1.,0.,0.));
#549=DIRECTION('',(0.,0.,-1.));
#550=DIRECTION('',(1.,0.,0.));
#551=DIRECTION('',(0.,0.,1.));
#552=DIRECTION('',(-1.,0.,0.));
#553=DIRECTION('',(0.,0.,-1.));
#554=DIRECTION('',(1.,0.,0.));
#555=DIRECTION('',(0.,0.,-1.));
#556=DIRECTION('',(-0.499999999999997,0.866025403784441,0.));
#557=DIRECTION('',(0.,0.,-1.));
#558=DIRECTION('',(0.500000000000003,0.866025403784437,0.));
#559=DIRECTION('',(0.,0.,-1.));
#560=DIRECTION('',(1.,-2.16840434497101E-15,0.));
#561=DIRECTION('',(0.,0.,-1.));
#562=DIRECTION('',(0.499999999999999,-0.866025403784439,0.));
#563=DIRECTION('',(0.,0.,-1.));
#564=DIRECTION('',(-0.500000000000001,-0.866025403784439,0.));
#565=DIRECTION('',(0.,0.,-1.));
#566=DIRECTION('',(-1.,0.,0.));
#567=DIRECTION('',(0.,0.,1.));
#568=DIRECTION('',(1.,0.,0.));
#569=DIRECTION('',(0.,0.,1.));
#570=DIRECTION('',(1.,0.,0.));
#571=DIRECTION('',(0.,0.,1.));
#572=DIRECTION('',(1.,0.,0.));
#573=DIRECTION('',(0.,0.,1.));
#574=DIRECTION('',(1.,0.,0.));
#575=DIRECTION('',(0.,0.,1.));
#576=DIRECTION('',(1.,0.,0.));
#577=DIRECTION('',(0.,0.,1.));
#578=DIRECTION('',(1.,0.,0.));
#579=DIRECTION('',(0.,0.,1.));
#580=DIRECTION('',(1.,0.,0.));
#581=DIRECTION('',(0.,0.,1.));
#582=DIRECTION('',(1.,0.,0.));
#583=DIRECTION('',(0.,0.,1.));
#584=DIRECTION('',(1.,0.,0.));
#585=DIRECTION('',(0.,0.,1.));
#586=DIRECTION('',(-1.,0.,0.));
#587=DIRECTION('',(0.,0.,1.));
#588=DIRECTION('',(-1.,0.,0.));
#589=DIRECTION('',(0.,0.,-1.));
#590=DIRECTION('',(-1.,0.,0.));
#591=DIRECTION('',(0.,0.,-1.));
#592=DIRECTION('',(-1.,0.,0.));
#593=DIRECTION('',(0.,0.,1.));
#594=DIRECTION('',(-1.,0.,0.));
#595=DIRECTION('',(0.,0.,-1.));
#596=DIRECTION('',(-1.,0.,0.));
#597=DIRECTION('',(0.,0.,1.));
#598=DIRECTION('',(1.,0.,0.));
#599=DIRECTION('',(0.,0.,-1.));
#600=DIRECTION('',(-1.,0.,0.));
#601=DIRECTION('',(0.,0.,-1.));
#602=DIRECTION('',(-1.,0.,0.));
#603=DIRECTION('',(0.,0.,-1.));
#604=DIRECTION('',(1.,0.,0.));
#605=DIRECTION('',(0.,0.,1.));
#606=DIRECTION('',(-1.,0.,0.));
#607=DIRECTION('',(0.,0.,-1.));
#608=DIRECTION('',(-1.,0.,0.));
#609=DIRECTION('',(0.,0.,-1.));
#610=DIRECTION('',(-1.,0.,0.));
#611=DIRECTION('',(0.,0.,-1.));
#612=DIRECTION('',(-0.500000000000001,-0.866025403784439,0.));
#613=DIRECTION('',(0.,0.,-1.));
#614=DIRECTION('',(-0.500000000000001,-0.866025403784438,0.));
#615=DIRECTION('',(0.,0.,-1.));
#616=DIRECTION('',(-0.500000000000001,-0.866025403784439,0.));
#617=DIRECTION('',(0.,0.,-1.));
#618=DIRECTION('',(0.499999999999999,-0.866025403784439,0.));
#619=DIRECTION('',(0.,0.,-1.));
#620=DIRECTION('',(0.499999999999999,-0.866025403784439,0.));
#621=DIRECTION('',(0.,0.,-1.));
#622=DIRECTION('',(0.499999999999999,-0.866025403784439,0.));
#623=DIRECTION('',(0.,0.,-1.));
#624=DIRECTION('',(1.,-2.16840434497101E-15,0.));
#625=DIRECTION('',(0.,0.,-1.));
#626=DIRECTION('',(1.,-2.34361141604467E-15,0.));
#627=DIRECTION('',(0.,0.,-1.));
#628=DIRECTION('',(1.,-2.16840434497101E-15,0.));
#629=DIRECTION('',(0.,0.,-1.));
#630=DIRECTION('',(0.500000000000003,0.866025403784437,0.));
#631=DIRECTION('',(0.,0.,-1.));
#632=DIRECTION('',(0.500000000000003,0.866025403784437,0.));
#633=DIRECTION('',(0.,0.,-1.));
#634=DIRECTION('',(0.500000000000003,0.866025403784437,0.));
#635=DIRECTION('',(0.,0.,-1.));
#636=DIRECTION('',(-0.499999999999997,0.866025403784441,0.));
#637=DIRECTION('',(0.,0.,-1.));
#638=DIRECTION('',(-0.499999999999996,0.866025403784441,0.));
#639=DIRECTION('',(0.,0.,-1.));
#640=DIRECTION('',(-0.499999999999997,0.866025403784441,0.));
#641=DIRECTION('',(0.,0.,-1.));
#642=DIRECTION('',(1.,0.,0.));
#643=DIRECTION('',(0.,0.,1.));
#644=DIRECTION('',(1.,0.,0.));
#645=DIRECTION('',(0.,0.,1.));
#646=DIRECTION('',(1.,0.,0.));
#647=CARTESIAN_POINT('',(0.,0.,0.));
#648=CARTESIAN_POINT('',(0.,0.,16.3));
#649=CARTESIAN_POINT('',(2.8,0.,16.3));
#650=CARTESIAN_POINT('',(0.,0.,16.3));
#651=CARTESIAN_POINT('',(0.,0.,0.));
#652=CARTESIAN_POINT('',(3.,0.,0.));
#653=CARTESIAN_POINT('',(0.,0.,0.));
#654=CARTESIAN_POINT('',(0.,0.,16.1));
#655=CARTESIAN_POINT('',(3.,0.,16.1));
#656=CARTESIAN_POINT('',(0.,0.,0.));
#657=CARTESIAN_POINT('',(0.,0.,16.1));
#658=CARTESIAN_POINT('',(0.,0.,-23.25));
#659=CARTESIAN_POINT('',(-10.3999999999995,0.,-23.25));
#660=CARTESIAN_POINT('',(0.,0.,-23.2));
#661=CARTESIAN_POINT('',(10.3999999999995,0.,-23.2));
#662=CARTESIAN_POINT('',(0.,0.,-23.25));
#663=CARTESIAN_POINT('',(0.,0.,-23.25));
#664=CARTESIAN_POINT('',(-6.,0.,-23.25));
#665=CARTESIAN_POINT('',(0.,0.,-22.05));
#666=CARTESIAN_POINT('',(-6.,0.,-22.05));
#667=CARTESIAN_POINT('',(0.,0.,-23.25));
#668=CARTESIAN_POINT('',(0.,0.,-23.25));
#669=CARTESIAN_POINT('',(0.,-3.3881317890172E-18,-17.3));
#670=CARTESIAN_POINT('',(5.034,-3.3881317890172E-18,-17.3));
#671=CARTESIAN_POINT('',(0.,-3.3881317890172E-18,-17.3));
#672=CARTESIAN_POINT('',(0.,-3.3881317890172E-18,-22.05));
#673=CARTESIAN_POINT('',(5.034,-3.3881317890172E-18,-22.05));
#674=CARTESIAN_POINT('',(0.,-3.3881317890172E-18,-24.5));
#675=CARTESIAN_POINT('',(0.,-3.3881317890172E-18,-22.05));
#676=CARTESIAN_POINT('',(0.,0.,0.));
#677=CARTESIAN_POINT('',(11.,0.,0.));
#678=CARTESIAN_POINT('',(0.,0.,-4.7999));
#679=CARTESIAN_POINT('',(-11.,0.,-4.7999));
#680=CARTESIAN_POINT('',(0.,0.,0.));
#681=CARTESIAN_POINT('',(8.22724133595219,4.74999999999996,0.));
#682=CARTESIAN_POINT('',(7.82724133595219,5.44282032302752,0.));
#683=CARTESIAN_POINT('',(8.22724133595215,-4.75000000000002,0.));
#684=CARTESIAN_POINT('',(8.62724133595215,-4.05717967697248,0.));
#685=CARTESIAN_POINT('',(-2.2257651927068E-14,-9.5,0.));
#686=CARTESIAN_POINT('',(0.799999999999978,-9.5,0.));
#687=CARTESIAN_POINT('',(-8.22724133595217,-4.74999999999999,0.));
#688=CARTESIAN_POINT('',(-7.82724133595217,-5.44282032302754,0.));
#689=CARTESIAN_POINT('',(-8.22724133595216,4.75000000000001,0.));
#690=CARTESIAN_POINT('',(-8.62724133595216,4.05717967697245,0.));
#691=CARTESIAN_POINT('',(0.,9.5,0.));
#692=CARTESIAN_POINT('',(-0.8,9.5,0.));
#693=CARTESIAN_POINT('',(0.,-8.67361737988404E-16,0.));
#694=CARTESIAN_POINT('',(7.5,-8.67361737988404E-16,0.));
#695=CARTESIAN_POINT('',(0.,0.,0.));
#696=CARTESIAN_POINT('',(4.33680868994202E-16,-1.30104260698261E-15,1.5));
#697=CARTESIAN_POINT('',(4.,-1.30104260698261E-15,1.5));
#698=CARTESIAN_POINT('',(0.,-8.67361737988404E-16,1.5));
#699=CARTESIAN_POINT('',(7.5,-8.67361737988404E-16,1.5));
#700=CARTESIAN_POINT('',(0.,-8.67361737988404E-16,1.5));
#701=CARTESIAN_POINT('',(0.,-8.67361737988404E-16,0.));
#702=CARTESIAN_POINT('',(4.33680868994202E-16,-1.30104260698261E-15,3.1));
#703=CARTESIAN_POINT('',(4.,-1.30104260698261E-15,3.1));
#704=CARTESIAN_POINT('',(4.33680868994202E-16,-1.30104260698261E-15,3.1));
#705=CARTESIAN_POINT('',(4.33680868994202E-16,-1.30104260698261E-15,1.5));
#706=CARTESIAN_POINT('',(0.,0.,-4.8));
#707=CARTESIAN_POINT('',(-10.9995,0.,-4.8));
#708=CARTESIAN_POINT('',(0.,0.,-4.7999));
#709=CARTESIAN_POINT('',(-10.9995,0.,-4.7999));
#710=CARTESIAN_POINT('',(0.,0.,-4.79995));
#711=CARTESIAN_POINT('',(0.,0.,-4.7999));
#712=CARTESIAN_POINT('',(0.,0.,-4.8));
#713=CARTESIAN_POINT('',(-11.,0.,-4.8));
#714=CARTESIAN_POINT('',(0.,0.,-4.8));
#715=CARTESIAN_POINT('',(0.,-3.3881317890172E-18,-24.5));
#716=CARTESIAN_POINT('',(10.5,-3.3881317890172E-18,-24.5));
#717=CARTESIAN_POINT('',(0.,-3.3881317890172E-18,-24.5));
#718=CARTESIAN_POINT('',(-11.,-3.3881317890172E-18,-24.5));
#719=CARTESIAN_POINT('',(0.,-3.3881317890172E-18,-24.5));
#720=CARTESIAN_POINT('',(0.,0.,0.));
#721=CARTESIAN_POINT('',(0.,9.5,-3.));
#722=CARTESIAN_POINT('',(-0.8,9.5,-3.));
#723=CARTESIAN_POINT('',(0.,9.5,-3.));
#724=CARTESIAN_POINT('',(0.,9.5,0.));
#725=CARTESIAN_POINT('',(-8.22724133595216,4.75000000000001,-3.));
#726=CARTESIAN_POINT('',(-8.62724133595216,4.05717967697245,-3.));
#727=CARTESIAN_POINT('',(-8.22724133595216,4.75000000000001,-3.));
#728=CARTESIAN_POINT('',(-8.22724133595216,4.75000000000001,0.));
#729=CARTESIAN_POINT('',(-8.22724133595217,-4.74999999999999,-3.));
#730=CARTESIAN_POINT('',(-7.82724133595217,-5.44282032302754,-3.));
#731=CARTESIAN_POINT('',(-8.22724133595217,-4.74999999999999,-3.));
#732=CARTESIAN_POINT('',(-8.22724133595217,-4.74999999999999,0.));
#733=CARTESIAN_POINT('',(-2.2257651927068E-14,-9.5,-3.));
#734=CARTESIAN_POINT('',(0.799999999999978,-9.5,-3.));
#735=CARTESIAN_POINT('',(-2.2257651927068E-14,-9.5,-3.));
#736=CARTESIAN_POINT('',(-2.2257651927068E-14,-9.5,0.));
#737=CARTESIAN_POINT('',(8.22724133595215,-4.75000000000002,-3.));
#738=CARTESIAN_POINT('',(8.62724133595215,-4.05717967697248,-3.));
#739=CARTESIAN_POINT('',(8.22724133595215,-4.75000000000002,-3.));
#740=CARTESIAN_POINT('',(8.22724133595215,-4.75000000000002,0.));
#741=CARTESIAN_POINT('',(8.22724133595219,4.74999999999996,-3.));
#742=CARTESIAN_POINT('',(7.82724133595219,5.44282032302752,-3.));
#743=CARTESIAN_POINT('',(8.22724133595219,4.74999999999996,-3.));
#744=CARTESIAN_POINT('',(8.22724133595219,4.74999999999996,0.));
#745=CARTESIAN_POINT('',(0.,-3.3881317890172E-18,-23.2));
#746=CARTESIAN_POINT('',(10.5,-3.3881317890172E-18,-23.2));
#747=CARTESIAN_POINT('',(0.,-3.3881317890172E-18,-23.2));
#748=CARTESIAN_POINT('',(0.,-3.3881317890172E-18,-24.5));
#749=MECHANICAL_DESIGN_GEOMETRIC_PRESENTATION_REPRESENTATION('',(#30,#23,
#31,#24,#25,#26),#750);
#750=(
GEOMETRIC_REPRESENTATION_CONTEXT(3)
GLOBAL_UNCERTAINTY_ASSIGNED_CONTEXT((#751))
GLOBAL_UNIT_ASSIGNED_CONTEXT((#757,#753,#752))
REPRESENTATION_CONTEXT('F0013963500-A-P2016.038',
'TOP_LEVEL_ASSEMBLY_PART')
);
#751=UNCERTAINTY_MEASURE_WITH_UNIT(LENGTH_MEASURE(2.E-5),#757,
'DISTANCE_ACCURACY_VALUE','Maximum Tolerance applied to model');
#752=(
NAMED_UNIT(*)
SI_UNIT($,.STERADIAN.)
SOLID_ANGLE_UNIT()
);
#753=(
CONVERSION_BASED_UNIT('DEGREE',#755)
NAMED_UNIT(#754)
PLANE_ANGLE_UNIT()
);
#754=DIMENSIONAL_EXPONENTS(0.,0.,0.,0.,0.,0.,0.);
#755=PLANE_ANGLE_MEASURE_WITH_UNIT(PLANE_ANGLE_MEASURE(0.0174532925),#756);
#756=(
NAMED_UNIT(*)
PLANE_ANGLE_UNIT()
SI_UNIT($,.RADIAN.)
);
#757=(
LENGTH_UNIT()
NAMED_UNIT(*)
SI_UNIT(.MILLI.,.METRE.)
);
ENDSEC;
END-ISO-10303-21;
