ISO-10303-21;
HEADER;
/* Generated by software containing ST-Developer
 * from STEP Tools, Inc. (www.steptools.com) 
 */

FILE_DESCRIPTION(
/* description */ (''),
/* implementation_level */ '2;1');

FILE_NAME(
/* name */ 
'C:\\Users\\Kacper\\MATLAB\\Projects\\release_mechanism\\models\\capsu
le\\\\PLATTFORM_ALU-SCHICHT_ipt_21dfcc73.STEP',
/* time_stamp */ '2020-08-13T22:35:41+02:00',
/* author */ ('Kacper'),
/* organization */ (''),
/* preprocessor_version */ 'ST-DEVELOPER v18.1',
/* originating_system */ 'Autodesk Inventor 2021',
/* authorisation */ '');

FILE_SCHEMA (('AUTOMOTIVE_DESIGN { 1 0 10303 214 3 1 1 }'));
ENDSEC;

DATA;
#10=MECHANICAL_DESIGN_GEOMETRIC_PRESENTATION_REPRESENTATION('',(#13),#1037);
#11=SHAPE_REPRESENTATION_RELATIONSHIP('SRR','None',#1044,#12);
#12=ADVANCED_BREP_SHAPE_REPRESENTATION('',(#14),#1036);
#13=STYLED_ITEM('',(#1053),#14);
#14=MANIFOLD_SOLID_BREP('Solid1',#619);
#15=FACE_BOUND('',#108,.T.);
#16=FACE_BOUND('',#109,.T.);
#17=FACE_BOUND('',#110,.T.);
#18=FACE_BOUND('',#111,.T.);
#19=FACE_BOUND('',#112,.T.);
#20=FACE_BOUND('',#113,.T.);
#21=FACE_BOUND('',#114,.T.);
#22=FACE_BOUND('',#115,.T.);
#23=FACE_BOUND('',#117,.T.);
#24=FACE_BOUND('',#118,.T.);
#25=FACE_BOUND('',#119,.T.);
#26=FACE_BOUND('',#120,.T.);
#27=FACE_BOUND('',#121,.T.);
#28=FACE_BOUND('',#122,.T.);
#29=FACE_BOUND('',#123,.T.);
#30=FACE_BOUND('',#124,.T.);
#31=PLANE('',#666);
#32=PLANE('',#667);
#33=PLANE('',#668);
#34=PLANE('',#669);
#35=PLANE('',#670);
#36=PLANE('',#674);
#37=PLANE('',#675);
#38=PLANE('',#676);
#39=PLANE('',#680);
#40=PLANE('',#681);
#41=PLANE('',#682);
#42=PLANE('',#683);
#43=PLANE('',#684);
#44=PLANE('',#688);
#45=PLANE('',#689);
#46=PLANE('',#690);
#47=PLANE('',#691);
#48=PLANE('',#692);
#49=FACE_OUTER_BOUND('',#79,.T.);
#50=FACE_OUTER_BOUND('',#80,.T.);
#51=FACE_OUTER_BOUND('',#81,.T.);
#52=FACE_OUTER_BOUND('',#82,.T.);
#53=FACE_OUTER_BOUND('',#83,.T.);
#54=FACE_OUTER_BOUND('',#84,.T.);
#55=FACE_OUTER_BOUND('',#85,.T.);
#56=FACE_OUTER_BOUND('',#86,.T.);
#57=FACE_OUTER_BOUND('',#87,.T.);
#58=FACE_OUTER_BOUND('',#88,.T.);
#59=FACE_OUTER_BOUND('',#89,.T.);
#60=FACE_OUTER_BOUND('',#90,.T.);
#61=FACE_OUTER_BOUND('',#91,.T.);
#62=FACE_OUTER_BOUND('',#92,.T.);
#63=FACE_OUTER_BOUND('',#93,.T.);
#64=FACE_OUTER_BOUND('',#94,.T.);
#65=FACE_OUTER_BOUND('',#95,.T.);
#66=FACE_OUTER_BOUND('',#96,.T.);
#67=FACE_OUTER_BOUND('',#97,.T.);
#68=FACE_OUTER_BOUND('',#98,.T.);
#69=FACE_OUTER_BOUND('',#99,.T.);
#70=FACE_OUTER_BOUND('',#100,.T.);
#71=FACE_OUTER_BOUND('',#101,.T.);
#72=FACE_OUTER_BOUND('',#102,.T.);
#73=FACE_OUTER_BOUND('',#103,.T.);
#74=FACE_OUTER_BOUND('',#104,.T.);
#75=FACE_OUTER_BOUND('',#105,.T.);
#76=FACE_OUTER_BOUND('',#106,.T.);
#77=FACE_OUTER_BOUND('',#107,.T.);
#78=FACE_OUTER_BOUND('',#116,.T.);
#79=EDGE_LOOP('',(#409,#410,#411,#412));
#80=EDGE_LOOP('',(#413,#414,#415,#416));
#81=EDGE_LOOP('',(#417,#418,#419,#420));
#82=EDGE_LOOP('',(#421,#422,#423,#424));
#83=EDGE_LOOP('',(#425,#426,#427,#428));
#84=EDGE_LOOP('',(#429,#430,#431,#432));
#85=EDGE_LOOP('',(#433,#434,#435,#436));
#86=EDGE_LOOP('',(#437,#438,#439,#440));
#87=EDGE_LOOP('',(#441,#442,#443,#444));
#88=EDGE_LOOP('',(#445,#446,#447,#448));
#89=EDGE_LOOP('',(#449,#450,#451,#452));
#90=EDGE_LOOP('',(#453,#454,#455,#456));
#91=EDGE_LOOP('',(#457,#458,#459,#460));
#92=EDGE_LOOP('',(#461,#462,#463,#464));
#93=EDGE_LOOP('',(#465,#466,#467,#468));
#94=EDGE_LOOP('',(#469,#470,#471,#472));
#95=EDGE_LOOP('',(#473,#474,#475,#476));
#96=EDGE_LOOP('',(#477,#478,#479,#480));
#97=EDGE_LOOP('',(#481,#482,#483,#484));
#98=EDGE_LOOP('',(#485,#486,#487,#488));
#99=EDGE_LOOP('',(#489,#490,#491,#492));
#100=EDGE_LOOP('',(#493,#494,#495,#496));
#101=EDGE_LOOP('',(#497,#498,#499,#500));
#102=EDGE_LOOP('',(#501,#502,#503,#504));
#103=EDGE_LOOP('',(#505,#506,#507,#508));
#104=EDGE_LOOP('',(#509,#510,#511,#512));
#105=EDGE_LOOP('',(#513,#514,#515,#516));
#106=EDGE_LOOP('',(#517,#518,#519,#520));
#107=EDGE_LOOP('',(#521,#522,#523,#524,#525,#526,#527,#528,#529,#530,#531,
#532,#533,#534,#535,#536,#537,#538,#539,#540));
#108=EDGE_LOOP('',(#541));
#109=EDGE_LOOP('',(#542));
#110=EDGE_LOOP('',(#543));
#111=EDGE_LOOP('',(#544));
#112=EDGE_LOOP('',(#545));
#113=EDGE_LOOP('',(#546));
#114=EDGE_LOOP('',(#547));
#115=EDGE_LOOP('',(#548));
#116=EDGE_LOOP('',(#549,#550,#551,#552,#553,#554,#555,#556,#557,#558,#559,
#560,#561,#562,#563,#564,#565,#566,#567,#568));
#117=EDGE_LOOP('',(#569));
#118=EDGE_LOOP('',(#570));
#119=EDGE_LOOP('',(#571));
#120=EDGE_LOOP('',(#572));
#121=EDGE_LOOP('',(#573));
#122=EDGE_LOOP('',(#574));
#123=EDGE_LOOP('',(#575));
#124=EDGE_LOOP('',(#576));
#125=LINE('',#868,#185);
#126=LINE('',#874,#186);
#127=LINE('',#880,#187);
#128=LINE('',#886,#188);
#129=LINE('',#892,#189);
#130=LINE('',#898,#190);
#131=LINE('',#904,#191);
#132=LINE('',#910,#192);
#133=LINE('',#917,#193);
#134=LINE('',#920,#194);
#135=LINE('',#923,#195);
#136=LINE('',#925,#196);
#137=LINE('',#926,#197);
#138=LINE('',#929,#198);
#139=LINE('',#931,#199);
#140=LINE('',#932,#200);
#141=LINE('',#935,#201);
#142=LINE('',#937,#202);
#143=LINE('',#938,#203);
#144=LINE('',#941,#204);
#145=LINE('',#943,#205);
#146=LINE('',#944,#206);
#147=LINE('',#947,#207);
#148=LINE('',#949,#208);
#149=LINE('',#950,#209);
#150=LINE('',#955,#210);
#151=LINE('',#959,#211);
#152=LINE('',#961,#212);
#153=LINE('',#962,#213);
#154=LINE('',#965,#214);
#155=LINE('',#967,#215);
#156=LINE('',#968,#216);
#157=LINE('',#971,#217);
#158=LINE('',#973,#218);
#159=LINE('',#974,#219);
#160=LINE('',#979,#220);
#161=LINE('',#983,#221);
#162=LINE('',#985,#222);
#163=LINE('',#986,#223);
#164=LINE('',#989,#224);
#165=LINE('',#991,#225);
#166=LINE('',#992,#226);
#167=LINE('',#995,#227);
#168=LINE('',#997,#228);
#169=LINE('',#998,#229);
#170=LINE('',#1001,#230);
#171=LINE('',#1003,#231);
#172=LINE('',#1004,#232);
#173=LINE('',#1007,#233);
#174=LINE('',#1009,#234);
#175=LINE('',#1010,#235);
#176=LINE('',#1015,#236);
#177=LINE('',#1019,#237);
#178=LINE('',#1021,#238);
#179=LINE('',#1022,#239);
#180=LINE('',#1025,#240);
#181=LINE('',#1027,#241);
#182=LINE('',#1028,#242);
#183=LINE('',#1030,#243);
#184=LINE('',#1031,#244);
#185=VECTOR('',#699,6.3);
#186=VECTOR('',#706,6.3);
#187=VECTOR('',#713,6.3);
#188=VECTOR('',#720,6.3);
#189=VECTOR('',#727,6.3);
#190=VECTOR('',#734,6.3);
#191=VECTOR('',#741,6.3);
#192=VECTOR('',#748,6.3);
#193=VECTOR('',#755,5.);
#194=VECTOR('',#758,5.);
#195=VECTOR('',#761,79.4838130528156);
#196=VECTOR('',#762,5.);
#197=VECTOR('',#763,79.4838130528156);
#198=VECTOR('',#766,27.4999999999999);
#199=VECTOR('',#767,5.);
#200=VECTOR('',#768,27.4999999999999);
#201=VECTOR('',#771,90.6);
#202=VECTOR('',#772,5.);
#203=VECTOR('',#773,90.6);
#204=VECTOR('',#776,27.5);
#205=VECTOR('',#777,5.);
#206=VECTOR('',#778,27.5);
#207=VECTOR('',#781,79.4838130528155);
#208=VECTOR('',#782,5.);
#209=VECTOR('',#783,79.4838130528155);
#210=VECTOR('',#788,5.);
#211=VECTOR('',#793,226.607012564395);
#212=VECTOR('',#794,5.);
#213=VECTOR('',#795,226.607012564395);
#214=VECTOR('',#798,27.4999999999999);
#215=VECTOR('',#799,5.);
#216=VECTOR('',#800,27.4999999999999);
#217=VECTOR('',#803,79.2838130528154);
#218=VECTOR('',#804,5.);
#219=VECTOR('',#805,79.2838130528154);
#220=VECTOR('',#810,5.);
#221=VECTOR('',#815,79.4838130528155);
#222=VECTOR('',#816,5.);
#223=VECTOR('',#817,79.4838130528155);
#224=VECTOR('',#820,27.5000000000001);
#225=VECTOR('',#821,5.);
#226=VECTOR('',#822,27.5000000000001);
#227=VECTOR('',#825,90.6);
#228=VECTOR('',#826,5.);
#229=VECTOR('',#827,90.6);
#230=VECTOR('',#830,27.5000000000001);
#231=VECTOR('',#831,5.);
#232=VECTOR('',#832,27.5000000000001);
#233=VECTOR('',#835,79.4838130528154);
#234=VECTOR('',#836,5.);
#235=VECTOR('',#837,79.4838130528154);
#236=VECTOR('',#842,5.);
#237=VECTOR('',#847,79.2838130528154);
#238=VECTOR('',#848,5.);
#239=VECTOR('',#849,79.2838130528154);
#240=VECTOR('',#852,27.5);
#241=VECTOR('',#853,5.);
#242=VECTOR('',#854,27.5);
#243=VECTOR('',#857,226.607012564395);
#244=VECTOR('',#858,226.607012564395);
#245=CIRCLE('',#640,6.3);
#246=CIRCLE('',#641,6.3);
#247=CIRCLE('',#643,6.3);
#248=CIRCLE('',#644,6.3);
#249=CIRCLE('',#646,6.3);
#250=CIRCLE('',#647,6.3);
#251=CIRCLE('',#649,6.3);
#252=CIRCLE('',#650,6.3);
#253=CIRCLE('',#652,6.3);
#254=CIRCLE('',#653,6.3);
#255=CIRCLE('',#655,6.3);
#256=CIRCLE('',#656,6.3);
#257=CIRCLE('',#658,6.3);
#258=CIRCLE('',#659,6.3);
#259=CIRCLE('',#661,6.3);
#260=CIRCLE('',#662,6.3);
#261=CIRCLE('',#664,350.);
#262=CIRCLE('',#665,350.);
#263=CIRCLE('',#672,350.);
#264=CIRCLE('',#673,350.);
#265=CIRCLE('',#678,350.);
#266=CIRCLE('',#679,350.);
#267=CIRCLE('',#686,350.);
#268=CIRCLE('',#687,350.);
#269=VERTEX_POINT('',#865);
#270=VERTEX_POINT('',#867);
#271=VERTEX_POINT('',#871);
#272=VERTEX_POINT('',#873);
#273=VERTEX_POINT('',#877);
#274=VERTEX_POINT('',#879);
#275=VERTEX_POINT('',#883);
#276=VERTEX_POINT('',#885);
#277=VERTEX_POINT('',#889);
#278=VERTEX_POINT('',#891);
#279=VERTEX_POINT('',#895);
#280=VERTEX_POINT('',#897);
#281=VERTEX_POINT('',#901);
#282=VERTEX_POINT('',#903);
#283=VERTEX_POINT('',#907);
#284=VERTEX_POINT('',#909);
#285=VERTEX_POINT('',#913);
#286=VERTEX_POINT('',#914);
#287=VERTEX_POINT('',#916);
#288=VERTEX_POINT('',#918);
#289=VERTEX_POINT('',#922);
#290=VERTEX_POINT('',#924);
#291=VERTEX_POINT('',#928);
#292=VERTEX_POINT('',#930);
#293=VERTEX_POINT('',#934);
#294=VERTEX_POINT('',#936);
#295=VERTEX_POINT('',#940);
#296=VERTEX_POINT('',#942);
#297=VERTEX_POINT('',#946);
#298=VERTEX_POINT('',#948);
#299=VERTEX_POINT('',#952);
#300=VERTEX_POINT('',#954);
#301=VERTEX_POINT('',#958);
#302=VERTEX_POINT('',#960);
#303=VERTEX_POINT('',#964);
#304=VERTEX_POINT('',#966);
#305=VERTEX_POINT('',#970);
#306=VERTEX_POINT('',#972);
#307=VERTEX_POINT('',#976);
#308=VERTEX_POINT('',#978);
#309=VERTEX_POINT('',#982);
#310=VERTEX_POINT('',#984);
#311=VERTEX_POINT('',#988);
#312=VERTEX_POINT('',#990);
#313=VERTEX_POINT('',#994);
#314=VERTEX_POINT('',#996);
#315=VERTEX_POINT('',#1000);
#316=VERTEX_POINT('',#1002);
#317=VERTEX_POINT('',#1006);
#318=VERTEX_POINT('',#1008);
#319=VERTEX_POINT('',#1012);
#320=VERTEX_POINT('',#1014);
#321=VERTEX_POINT('',#1018);
#322=VERTEX_POINT('',#1020);
#323=VERTEX_POINT('',#1024);
#324=VERTEX_POINT('',#1026);
#325=EDGE_CURVE('',#269,#269,#245,.T.);
#326=EDGE_CURVE('',#269,#270,#125,.T.);
#327=EDGE_CURVE('',#270,#270,#246,.T.);
#328=EDGE_CURVE('',#271,#271,#247,.T.);
#329=EDGE_CURVE('',#271,#272,#126,.T.);
#330=EDGE_CURVE('',#272,#272,#248,.T.);
#331=EDGE_CURVE('',#273,#273,#249,.T.);
#332=EDGE_CURVE('',#273,#274,#127,.T.);
#333=EDGE_CURVE('',#274,#274,#250,.T.);
#334=EDGE_CURVE('',#275,#275,#251,.T.);
#335=EDGE_CURVE('',#275,#276,#128,.T.);
#336=EDGE_CURVE('',#276,#276,#252,.T.);
#337=EDGE_CURVE('',#277,#277,#253,.T.);
#338=EDGE_CURVE('',#277,#278,#129,.T.);
#339=EDGE_CURVE('',#278,#278,#254,.T.);
#340=EDGE_CURVE('',#279,#279,#255,.T.);
#341=EDGE_CURVE('',#279,#280,#130,.T.);
#342=EDGE_CURVE('',#280,#280,#256,.T.);
#343=EDGE_CURVE('',#281,#281,#257,.T.);
#344=EDGE_CURVE('',#281,#282,#131,.T.);
#345=EDGE_CURVE('',#282,#282,#258,.T.);
#346=EDGE_CURVE('',#283,#283,#259,.T.);
#347=EDGE_CURVE('',#283,#284,#132,.T.);
#348=EDGE_CURVE('',#284,#284,#260,.T.);
#349=EDGE_CURVE('',#285,#286,#261,.T.);
#350=EDGE_CURVE('',#287,#286,#133,.T.);
#351=EDGE_CURVE('',#287,#288,#262,.T.);
#352=EDGE_CURVE('',#285,#288,#134,.T.);
#353=EDGE_CURVE('',#286,#289,#135,.T.);
#354=EDGE_CURVE('',#290,#289,#136,.T.);
#355=EDGE_CURVE('',#290,#287,#137,.T.);
#356=EDGE_CURVE('',#289,#291,#138,.T.);
#357=EDGE_CURVE('',#292,#291,#139,.T.);
#358=EDGE_CURVE('',#292,#290,#140,.T.);
#359=EDGE_CURVE('',#291,#293,#141,.T.);
#360=EDGE_CURVE('',#294,#293,#142,.T.);
#361=EDGE_CURVE('',#294,#292,#143,.T.);
#362=EDGE_CURVE('',#293,#295,#144,.T.);
#363=EDGE_CURVE('',#296,#295,#145,.T.);
#364=EDGE_CURVE('',#296,#294,#146,.T.);
#365=EDGE_CURVE('',#295,#297,#147,.T.);
#366=EDGE_CURVE('',#298,#297,#148,.T.);
#367=EDGE_CURVE('',#298,#296,#149,.T.);
#368=EDGE_CURVE('',#297,#299,#263,.T.);
#369=EDGE_CURVE('',#300,#299,#150,.T.);
#370=EDGE_CURVE('',#300,#298,#264,.T.);
#371=EDGE_CURVE('',#299,#301,#151,.T.);
#372=EDGE_CURVE('',#302,#301,#152,.T.);
#373=EDGE_CURVE('',#302,#300,#153,.T.);
#374=EDGE_CURVE('',#301,#303,#154,.T.);
#375=EDGE_CURVE('',#304,#303,#155,.T.);
#376=EDGE_CURVE('',#304,#302,#156,.T.);
#377=EDGE_CURVE('',#303,#305,#157,.T.);
#378=EDGE_CURVE('',#306,#305,#158,.T.);
#379=EDGE_CURVE('',#306,#304,#159,.T.);
#380=EDGE_CURVE('',#305,#307,#265,.T.);
#381=EDGE_CURVE('',#308,#307,#160,.T.);
#382=EDGE_CURVE('',#308,#306,#266,.T.);
#383=EDGE_CURVE('',#307,#309,#161,.T.);
#384=EDGE_CURVE('',#310,#309,#162,.T.);
#385=EDGE_CURVE('',#310,#308,#163,.T.);
#386=EDGE_CURVE('',#309,#311,#164,.T.);
#387=EDGE_CURVE('',#312,#311,#165,.T.);
#388=EDGE_CURVE('',#312,#310,#166,.T.);
#389=EDGE_CURVE('',#311,#313,#167,.T.);
#390=EDGE_CURVE('',#314,#313,#168,.T.);
#391=EDGE_CURVE('',#314,#312,#169,.T.);
#392=EDGE_CURVE('',#313,#315,#170,.T.);
#393=EDGE_CURVE('',#316,#315,#171,.T.);
#394=EDGE_CURVE('',#316,#314,#172,.T.);
#395=EDGE_CURVE('',#315,#317,#173,.T.);
#396=EDGE_CURVE('',#318,#317,#174,.T.);
#397=EDGE_CURVE('',#318,#316,#175,.T.);
#398=EDGE_CURVE('',#317,#319,#267,.T.);
#399=EDGE_CURVE('',#320,#319,#176,.T.);
#400=EDGE_CURVE('',#320,#318,#268,.T.);
#401=EDGE_CURVE('',#319,#321,#177,.T.);
#402=EDGE_CURVE('',#322,#321,#178,.T.);
#403=EDGE_CURVE('',#322,#320,#179,.T.);
#404=EDGE_CURVE('',#321,#323,#180,.T.);
#405=EDGE_CURVE('',#324,#323,#181,.T.);
#406=EDGE_CURVE('',#324,#322,#182,.T.);
#407=EDGE_CURVE('',#323,#285,#183,.T.);
#408=EDGE_CURVE('',#288,#324,#184,.T.);
#409=ORIENTED_EDGE('',*,*,#325,.T.);
#410=ORIENTED_EDGE('',*,*,#326,.T.);
#411=ORIENTED_EDGE('',*,*,#327,.T.);
#412=ORIENTED_EDGE('',*,*,#326,.F.);
#413=ORIENTED_EDGE('',*,*,#328,.T.);
#414=ORIENTED_EDGE('',*,*,#329,.T.);
#415=ORIENTED_EDGE('',*,*,#330,.T.);
#416=ORIENTED_EDGE('',*,*,#329,.F.);
#417=ORIENTED_EDGE('',*,*,#331,.T.);
#418=ORIENTED_EDGE('',*,*,#332,.T.);
#419=ORIENTED_EDGE('',*,*,#333,.T.);
#420=ORIENTED_EDGE('',*,*,#332,.F.);
#421=ORIENTED_EDGE('',*,*,#334,.T.);
#422=ORIENTED_EDGE('',*,*,#335,.T.);
#423=ORIENTED_EDGE('',*,*,#336,.T.);
#424=ORIENTED_EDGE('',*,*,#335,.F.);
#425=ORIENTED_EDGE('',*,*,#337,.T.);
#426=ORIENTED_EDGE('',*,*,#338,.T.);
#427=ORIENTED_EDGE('',*,*,#339,.T.);
#428=ORIENTED_EDGE('',*,*,#338,.F.);
#429=ORIENTED_EDGE('',*,*,#340,.T.);
#430=ORIENTED_EDGE('',*,*,#341,.T.);
#431=ORIENTED_EDGE('',*,*,#342,.T.);
#432=ORIENTED_EDGE('',*,*,#341,.F.);
#433=ORIENTED_EDGE('',*,*,#343,.T.);
#434=ORIENTED_EDGE('',*,*,#344,.T.);
#435=ORIENTED_EDGE('',*,*,#345,.T.);
#436=ORIENTED_EDGE('',*,*,#344,.F.);
#437=ORIENTED_EDGE('',*,*,#346,.T.);
#438=ORIENTED_EDGE('',*,*,#347,.T.);
#439=ORIENTED_EDGE('',*,*,#348,.T.);
#440=ORIENTED_EDGE('',*,*,#347,.F.);
#441=ORIENTED_EDGE('',*,*,#349,.T.);
#442=ORIENTED_EDGE('',*,*,#350,.F.);
#443=ORIENTED_EDGE('',*,*,#351,.T.);
#444=ORIENTED_EDGE('',*,*,#352,.F.);
#445=ORIENTED_EDGE('',*,*,#353,.T.);
#446=ORIENTED_EDGE('',*,*,#354,.F.);
#447=ORIENTED_EDGE('',*,*,#355,.T.);
#448=ORIENTED_EDGE('',*,*,#350,.T.);
#449=ORIENTED_EDGE('',*,*,#356,.T.);
#450=ORIENTED_EDGE('',*,*,#357,.F.);
#451=ORIENTED_EDGE('',*,*,#358,.T.);
#452=ORIENTED_EDGE('',*,*,#354,.T.);
#453=ORIENTED_EDGE('',*,*,#359,.T.);
#454=ORIENTED_EDGE('',*,*,#360,.F.);
#455=ORIENTED_EDGE('',*,*,#361,.T.);
#456=ORIENTED_EDGE('',*,*,#357,.T.);
#457=ORIENTED_EDGE('',*,*,#362,.T.);
#458=ORIENTED_EDGE('',*,*,#363,.F.);
#459=ORIENTED_EDGE('',*,*,#364,.T.);
#460=ORIENTED_EDGE('',*,*,#360,.T.);
#461=ORIENTED_EDGE('',*,*,#365,.T.);
#462=ORIENTED_EDGE('',*,*,#366,.F.);
#463=ORIENTED_EDGE('',*,*,#367,.T.);
#464=ORIENTED_EDGE('',*,*,#363,.T.);
#465=ORIENTED_EDGE('',*,*,#368,.T.);
#466=ORIENTED_EDGE('',*,*,#369,.F.);
#467=ORIENTED_EDGE('',*,*,#370,.T.);
#468=ORIENTED_EDGE('',*,*,#366,.T.);
#469=ORIENTED_EDGE('',*,*,#371,.T.);
#470=ORIENTED_EDGE('',*,*,#372,.F.);
#471=ORIENTED_EDGE('',*,*,#373,.T.);
#472=ORIENTED_EDGE('',*,*,#369,.T.);
#473=ORIENTED_EDGE('',*,*,#374,.T.);
#474=ORIENTED_EDGE('',*,*,#375,.F.);
#475=ORIENTED_EDGE('',*,*,#376,.T.);
#476=ORIENTED_EDGE('',*,*,#372,.T.);
#477=ORIENTED_EDGE('',*,*,#377,.T.);
#478=ORIENTED_EDGE('',*,*,#378,.F.);
#479=ORIENTED_EDGE('',*,*,#379,.T.);
#480=ORIENTED_EDGE('',*,*,#375,.T.);
#481=ORIENTED_EDGE('',*,*,#380,.T.);
#482=ORIENTED_EDGE('',*,*,#381,.F.);
#483=ORIENTED_EDGE('',*,*,#382,.T.);
#484=ORIENTED_EDGE('',*,*,#378,.T.);
#485=ORIENTED_EDGE('',*,*,#383,.T.);
#486=ORIENTED_EDGE('',*,*,#384,.F.);
#487=ORIENTED_EDGE('',*,*,#385,.T.);
#488=ORIENTED_EDGE('',*,*,#381,.T.);
#489=ORIENTED_EDGE('',*,*,#386,.T.);
#490=ORIENTED_EDGE('',*,*,#387,.F.);
#491=ORIENTED_EDGE('',*,*,#388,.T.);
#492=ORIENTED_EDGE('',*,*,#384,.T.);
#493=ORIENTED_EDGE('',*,*,#389,.T.);
#494=ORIENTED_EDGE('',*,*,#390,.F.);
#495=ORIENTED_EDGE('',*,*,#391,.T.);
#496=ORIENTED_EDGE('',*,*,#387,.T.);
#497=ORIENTED_EDGE('',*,*,#392,.T.);
#498=ORIENTED_EDGE('',*,*,#393,.F.);
#499=ORIENTED_EDGE('',*,*,#394,.T.);
#500=ORIENTED_EDGE('',*,*,#390,.T.);
#501=ORIENTED_EDGE('',*,*,#395,.T.);
#502=ORIENTED_EDGE('',*,*,#396,.F.);
#503=ORIENTED_EDGE('',*,*,#397,.T.);
#504=ORIENTED_EDGE('',*,*,#393,.T.);
#505=ORIENTED_EDGE('',*,*,#398,.T.);
#506=ORIENTED_EDGE('',*,*,#399,.F.);
#507=ORIENTED_EDGE('',*,*,#400,.T.);
#508=ORIENTED_EDGE('',*,*,#396,.T.);
#509=ORIENTED_EDGE('',*,*,#401,.T.);
#510=ORIENTED_EDGE('',*,*,#402,.F.);
#511=ORIENTED_EDGE('',*,*,#403,.T.);
#512=ORIENTED_EDGE('',*,*,#399,.T.);
#513=ORIENTED_EDGE('',*,*,#404,.T.);
#514=ORIENTED_EDGE('',*,*,#405,.F.);
#515=ORIENTED_EDGE('',*,*,#406,.T.);
#516=ORIENTED_EDGE('',*,*,#402,.T.);
#517=ORIENTED_EDGE('',*,*,#407,.T.);
#518=ORIENTED_EDGE('',*,*,#352,.T.);
#519=ORIENTED_EDGE('',*,*,#408,.T.);
#520=ORIENTED_EDGE('',*,*,#405,.T.);
#521=ORIENTED_EDGE('',*,*,#406,.F.);
#522=ORIENTED_EDGE('',*,*,#408,.F.);
#523=ORIENTED_EDGE('',*,*,#351,.F.);
#524=ORIENTED_EDGE('',*,*,#355,.F.);
#525=ORIENTED_EDGE('',*,*,#358,.F.);
#526=ORIENTED_EDGE('',*,*,#361,.F.);
#527=ORIENTED_EDGE('',*,*,#364,.F.);
#528=ORIENTED_EDGE('',*,*,#367,.F.);
#529=ORIENTED_EDGE('',*,*,#370,.F.);
#530=ORIENTED_EDGE('',*,*,#373,.F.);
#531=ORIENTED_EDGE('',*,*,#376,.F.);
#532=ORIENTED_EDGE('',*,*,#379,.F.);
#533=ORIENTED_EDGE('',*,*,#382,.F.);
#534=ORIENTED_EDGE('',*,*,#385,.F.);
#535=ORIENTED_EDGE('',*,*,#388,.F.);
#536=ORIENTED_EDGE('',*,*,#391,.F.);
#537=ORIENTED_EDGE('',*,*,#394,.F.);
#538=ORIENTED_EDGE('',*,*,#397,.F.);
#539=ORIENTED_EDGE('',*,*,#400,.F.);
#540=ORIENTED_EDGE('',*,*,#403,.F.);
#541=ORIENTED_EDGE('',*,*,#325,.F.);
#542=ORIENTED_EDGE('',*,*,#328,.F.);
#543=ORIENTED_EDGE('',*,*,#331,.F.);
#544=ORIENTED_EDGE('',*,*,#334,.F.);
#545=ORIENTED_EDGE('',*,*,#337,.F.);
#546=ORIENTED_EDGE('',*,*,#340,.F.);
#547=ORIENTED_EDGE('',*,*,#343,.F.);
#548=ORIENTED_EDGE('',*,*,#346,.F.);
#549=ORIENTED_EDGE('',*,*,#349,.F.);
#550=ORIENTED_EDGE('',*,*,#407,.F.);
#551=ORIENTED_EDGE('',*,*,#404,.F.);
#552=ORIENTED_EDGE('',*,*,#401,.F.);
#553=ORIENTED_EDGE('',*,*,#398,.F.);
#554=ORIENTED_EDGE('',*,*,#395,.F.);
#555=ORIENTED_EDGE('',*,*,#392,.F.);
#556=ORIENTED_EDGE('',*,*,#389,.F.);
#557=ORIENTED_EDGE('',*,*,#386,.F.);
#558=ORIENTED_EDGE('',*,*,#383,.F.);
#559=ORIENTED_EDGE('',*,*,#380,.F.);
#560=ORIENTED_EDGE('',*,*,#377,.F.);
#561=ORIENTED_EDGE('',*,*,#374,.F.);
#562=ORIENTED_EDGE('',*,*,#371,.F.);
#563=ORIENTED_EDGE('',*,*,#368,.F.);
#564=ORIENTED_EDGE('',*,*,#365,.F.);
#565=ORIENTED_EDGE('',*,*,#362,.F.);
#566=ORIENTED_EDGE('',*,*,#359,.F.);
#567=ORIENTED_EDGE('',*,*,#356,.F.);
#568=ORIENTED_EDGE('',*,*,#353,.F.);
#569=ORIENTED_EDGE('',*,*,#327,.F.);
#570=ORIENTED_EDGE('',*,*,#330,.F.);
#571=ORIENTED_EDGE('',*,*,#333,.F.);
#572=ORIENTED_EDGE('',*,*,#336,.F.);
#573=ORIENTED_EDGE('',*,*,#339,.F.);
#574=ORIENTED_EDGE('',*,*,#342,.F.);
#575=ORIENTED_EDGE('',*,*,#345,.F.);
#576=ORIENTED_EDGE('',*,*,#348,.F.);
#577=CYLINDRICAL_SURFACE('',#639,6.3);
#578=CYLINDRICAL_SURFACE('',#642,6.3);
#579=CYLINDRICAL_SURFACE('',#645,6.3);
#580=CYLINDRICAL_SURFACE('',#648,6.3);
#581=CYLINDRICAL_SURFACE('',#651,6.3);
#582=CYLINDRICAL_SURFACE('',#654,6.3);
#583=CYLINDRICAL_SURFACE('',#657,6.3);
#584=CYLINDRICAL_SURFACE('',#660,6.3);
#585=CYLINDRICAL_SURFACE('',#663,350.);
#586=CYLINDRICAL_SURFACE('',#671,350.);
#587=CYLINDRICAL_SURFACE('',#677,350.);
#588=CYLINDRICAL_SURFACE('',#685,350.);
#589=ADVANCED_FACE('',(#49),#577,.F.);
#590=ADVANCED_FACE('',(#50),#578,.F.);
#591=ADVANCED_FACE('',(#51),#579,.F.);
#592=ADVANCED_FACE('',(#52),#580,.F.);
#593=ADVANCED_FACE('',(#53),#581,.F.);
#594=ADVANCED_FACE('',(#54),#582,.F.);
#595=ADVANCED_FACE('',(#55),#583,.F.);
#596=ADVANCED_FACE('',(#56),#584,.F.);
#597=ADVANCED_FACE('',(#57),#585,.T.);
#598=ADVANCED_FACE('',(#58),#31,.T.);
#599=ADVANCED_FACE('',(#59),#32,.T.);
#600=ADVANCED_FACE('',(#60),#33,.T.);
#601=ADVANCED_FACE('',(#61),#34,.T.);
#602=ADVANCED_FACE('',(#62),#35,.T.);
#603=ADVANCED_FACE('',(#63),#586,.T.);
#604=ADVANCED_FACE('',(#64),#36,.T.);
#605=ADVANCED_FACE('',(#65),#37,.T.);
#606=ADVANCED_FACE('',(#66),#38,.T.);
#607=ADVANCED_FACE('',(#67),#587,.T.);
#608=ADVANCED_FACE('',(#68),#39,.T.);
#609=ADVANCED_FACE('',(#69),#40,.T.);
#610=ADVANCED_FACE('',(#70),#41,.T.);
#611=ADVANCED_FACE('',(#71),#42,.T.);
#612=ADVANCED_FACE('',(#72),#43,.T.);
#613=ADVANCED_FACE('',(#73),#588,.T.);
#614=ADVANCED_FACE('',(#74),#44,.T.);
#615=ADVANCED_FACE('',(#75),#45,.T.);
#616=ADVANCED_FACE('',(#76),#46,.T.);
#617=ADVANCED_FACE('',(#77,#15,#16,#17,#18,#19,#20,#21,#22),#47,.T.);
#618=ADVANCED_FACE('',(#78,#23,#24,#25,#26,#27,#28,#29,#30),#48,.F.);
#619=CLOSED_SHELL('',(#589,#590,#591,#592,#593,#594,#595,#596,#597,#598,
#599,#600,#601,#602,#603,#604,#605,#606,#607,#608,#609,#610,#611,#612,#613,
#614,#615,#616,#617,#618));
#620=DERIVED_UNIT_ELEMENT(#622,1.);
#621=DERIVED_UNIT_ELEMENT(#1039,3.);
#622=(
MASS_UNIT()
NAMED_UNIT(*)
SI_UNIT($,.GRAM.)
);
#623=DERIVED_UNIT((#620,#621));
#624=MEASURE_REPRESENTATION_ITEM('density measure',
POSITIVE_RATIO_MEASURE(1.),#623);
#625=PROPERTY_DEFINITION_REPRESENTATION(#630,#627);
#626=PROPERTY_DEFINITION_REPRESENTATION(#631,#628);
#627=REPRESENTATION('material name',(#629),#1036);
#628=REPRESENTATION('density',(#624),#1036);
#629=DESCRIPTIVE_REPRESENTATION_ITEM('Generic','Generic');
#630=PROPERTY_DEFINITION('material property','material name',#1046);
#631=PROPERTY_DEFINITION('material property','density of part',#1046);
#632=DATE_TIME_ROLE('creation_date');
#633=APPLIED_DATE_AND_TIME_ASSIGNMENT(#634,#632,(#1046));
#634=DATE_AND_TIME(#635,#636);
#635=CALENDAR_DATE(1996,29,5);
#636=LOCAL_TIME(12,0,0.,#637);
#637=COORDINATED_UNIVERSAL_TIME_OFFSET(0,0,.BEHIND.);
#638=AXIS2_PLACEMENT_3D('placement',#863,#693,#694);
#639=AXIS2_PLACEMENT_3D('',#864,#695,#696);
#640=AXIS2_PLACEMENT_3D('',#866,#697,#698);
#641=AXIS2_PLACEMENT_3D('',#869,#700,#701);
#642=AXIS2_PLACEMENT_3D('',#870,#702,#703);
#643=AXIS2_PLACEMENT_3D('',#872,#704,#705);
#644=AXIS2_PLACEMENT_3D('',#875,#707,#708);
#645=AXIS2_PLACEMENT_3D('',#876,#709,#710);
#646=AXIS2_PLACEMENT_3D('',#878,#711,#712);
#647=AXIS2_PLACEMENT_3D('',#881,#714,#715);
#648=AXIS2_PLACEMENT_3D('',#882,#716,#717);
#649=AXIS2_PLACEMENT_3D('',#884,#718,#719);
#650=AXIS2_PLACEMENT_3D('',#887,#721,#722);
#651=AXIS2_PLACEMENT_3D('',#888,#723,#724);
#652=AXIS2_PLACEMENT_3D('',#890,#725,#726);
#653=AXIS2_PLACEMENT_3D('',#893,#728,#729);
#654=AXIS2_PLACEMENT_3D('',#894,#730,#731);
#655=AXIS2_PLACEMENT_3D('',#896,#732,#733);
#656=AXIS2_PLACEMENT_3D('',#899,#735,#736);
#657=AXIS2_PLACEMENT_3D('',#900,#737,#738);
#658=AXIS2_PLACEMENT_3D('',#902,#739,#740);
#659=AXIS2_PLACEMENT_3D('',#905,#742,#743);
#660=AXIS2_PLACEMENT_3D('',#906,#744,#745);
#661=AXIS2_PLACEMENT_3D('',#908,#746,#747);
#662=AXIS2_PLACEMENT_3D('',#911,#749,#750);
#663=AXIS2_PLACEMENT_3D('',#912,#751,#752);
#664=AXIS2_PLACEMENT_3D('',#915,#753,#754);
#665=AXIS2_PLACEMENT_3D('',#919,#756,#757);
#666=AXIS2_PLACEMENT_3D('',#921,#759,#760);
#667=AXIS2_PLACEMENT_3D('',#927,#764,#765);
#668=AXIS2_PLACEMENT_3D('',#933,#769,#770);
#669=AXIS2_PLACEMENT_3D('',#939,#774,#775);
#670=AXIS2_PLACEMENT_3D('',#945,#779,#780);
#671=AXIS2_PLACEMENT_3D('',#951,#784,#785);
#672=AXIS2_PLACEMENT_3D('',#953,#786,#787);
#673=AXIS2_PLACEMENT_3D('',#956,#789,#790);
#674=AXIS2_PLACEMENT_3D('',#957,#791,#792);
#675=AXIS2_PLACEMENT_3D('',#963,#796,#797);
#676=AXIS2_PLACEMENT_3D('',#969,#801,#802);
#677=AXIS2_PLACEMENT_3D('',#975,#806,#807);
#678=AXIS2_PLACEMENT_3D('',#977,#808,#809);
#679=AXIS2_PLACEMENT_3D('',#980,#811,#812);
#680=AXIS2_PLACEMENT_3D('',#981,#813,#814);
#681=AXIS2_PLACEMENT_3D('',#987,#818,#819);
#682=AXIS2_PLACEMENT_3D('',#993,#823,#824);
#683=AXIS2_PLACEMENT_3D('',#999,#828,#829);
#684=AXIS2_PLACEMENT_3D('',#1005,#833,#834);
#685=AXIS2_PLACEMENT_3D('',#1011,#838,#839);
#686=AXIS2_PLACEMENT_3D('',#1013,#840,#841);
#687=AXIS2_PLACEMENT_3D('',#1016,#843,#844);
#688=AXIS2_PLACEMENT_3D('',#1017,#845,#846);
#689=AXIS2_PLACEMENT_3D('',#1023,#850,#851);
#690=AXIS2_PLACEMENT_3D('',#1029,#855,#856);
#691=AXIS2_PLACEMENT_3D('',#1032,#859,#860);
#692=AXIS2_PLACEMENT_3D('',#1033,#861,#862);
#693=DIRECTION('axis',(0.,0.,1.));
#694=DIRECTION('refdir',(1.,0.,0.));
#695=DIRECTION('center_axis',(0.,0.,-1.));
#696=DIRECTION('ref_axis',(1.,0.,0.));
#697=DIRECTION('center_axis',(0.,0.,1.));
#698=DIRECTION('ref_axis',(1.,0.,0.));
#699=DIRECTION('',(0.,0.,-1.));
#700=DIRECTION('center_axis',(0.,0.,-1.));
#701=DIRECTION('ref_axis',(1.,0.,0.));
#702=DIRECTION('center_axis',(0.,0.,-1.));
#703=DIRECTION('ref_axis',(1.,0.,0.));
#704=DIRECTION('center_axis',(0.,0.,1.));
#705=DIRECTION('ref_axis',(1.,0.,0.));
#706=DIRECTION('',(0.,0.,-1.));
#707=DIRECTION('center_axis',(0.,0.,-1.));
#708=DIRECTION('ref_axis',(1.,0.,0.));
#709=DIRECTION('center_axis',(0.,0.,-1.));
#710=DIRECTION('ref_axis',(1.,0.,0.));
#711=DIRECTION('center_axis',(0.,0.,1.));
#712=DIRECTION('ref_axis',(1.,0.,0.));
#713=DIRECTION('',(0.,0.,-1.));
#714=DIRECTION('center_axis',(0.,0.,-1.));
#715=DIRECTION('ref_axis',(1.,0.,0.));
#716=DIRECTION('center_axis',(0.,0.,-1.));
#717=DIRECTION('ref_axis',(1.,0.,0.));
#718=DIRECTION('center_axis',(0.,0.,1.));
#719=DIRECTION('ref_axis',(1.,0.,0.));
#720=DIRECTION('',(0.,0.,-1.));
#721=DIRECTION('center_axis',(0.,0.,-1.));
#722=DIRECTION('ref_axis',(1.,0.,0.));
#723=DIRECTION('center_axis',(0.,0.,-1.));
#724=DIRECTION('ref_axis',(1.,0.,0.));
#725=DIRECTION('center_axis',(0.,0.,1.));
#726=DIRECTION('ref_axis',(1.,0.,0.));
#727=DIRECTION('',(0.,0.,-1.));
#728=DIRECTION('center_axis',(0.,0.,-1.));
#729=DIRECTION('ref_axis',(1.,0.,0.));
#730=DIRECTION('center_axis',(0.,0.,-1.));
#731=DIRECTION('ref_axis',(1.,0.,0.));
#732=DIRECTION('center_axis',(0.,0.,1.));
#733=DIRECTION('ref_axis',(1.,0.,0.));
#734=DIRECTION('',(0.,0.,-1.));
#735=DIRECTION('center_axis',(0.,0.,-1.));
#736=DIRECTION('ref_axis',(1.,0.,0.));
#737=DIRECTION('center_axis',(0.,0.,-1.));
#738=DIRECTION('ref_axis',(1.,0.,0.));
#739=DIRECTION('center_axis',(0.,0.,1.));
#740=DIRECTION('ref_axis',(1.,0.,0.));
#741=DIRECTION('',(0.,0.,-1.));
#742=DIRECTION('center_axis',(0.,0.,-1.));
#743=DIRECTION('ref_axis',(1.,0.,0.));
#744=DIRECTION('center_axis',(0.,0.,-1.));
#745=DIRECTION('ref_axis',(1.,0.,0.));
#746=DIRECTION('center_axis',(0.,0.,1.));
#747=DIRECTION('ref_axis',(1.,0.,0.));
#748=DIRECTION('',(0.,0.,-1.));
#749=DIRECTION('center_axis',(0.,0.,-1.));
#750=DIRECTION('ref_axis',(1.,0.,0.));
#751=DIRECTION('center_axis',(0.,0.,-1.));
#752=DIRECTION('ref_axis',(1.,0.,0.));
#753=DIRECTION('center_axis',(0.,0.,1.));
#754=DIRECTION('ref_axis',(1.,0.,0.));
#755=DIRECTION('',(0.,0.,-1.));
#756=DIRECTION('center_axis',(0.,0.,-1.));
#757=DIRECTION('ref_axis',(1.,0.,0.));
#758=DIRECTION('',(0.,0.,1.));
#759=DIRECTION('center_axis',(-1.,0.,0.));
#760=DIRECTION('ref_axis',(0.,0.,1.));
#761=DIRECTION('',(0.,-1.,0.));
#762=DIRECTION('',(0.,0.,-1.));
#763=DIRECTION('',(0.,1.,0.));
#764=DIRECTION('center_axis',(0.,-1.,0.));
#765=DIRECTION('ref_axis',(0.,0.,-1.));
#766=DIRECTION('',(1.,0.,0.));
#767=DIRECTION('',(0.,0.,-1.));
#768=DIRECTION('',(-1.,0.,0.));
#769=DIRECTION('center_axis',(-1.,0.,0.));
#770=DIRECTION('ref_axis',(0.,0.,1.));
#771=DIRECTION('',(0.,-1.,0.));
#772=DIRECTION('',(0.,0.,-1.));
#773=DIRECTION('',(0.,1.,0.));
#774=DIRECTION('center_axis',(0.,1.,0.));
#775=DIRECTION('ref_axis',(0.,0.,1.));
#776=DIRECTION('',(-1.,0.,0.));
#777=DIRECTION('',(0.,0.,-1.));
#778=DIRECTION('',(1.,0.,0.));
#779=DIRECTION('center_axis',(-1.,0.,0.));
#780=DIRECTION('ref_axis',(0.,0.,1.));
#781=DIRECTION('',(0.,-1.,0.));
#782=DIRECTION('',(0.,0.,-1.));
#783=DIRECTION('',(0.,1.,0.));
#784=DIRECTION('center_axis',(0.,0.,-1.));
#785=DIRECTION('ref_axis',(1.,0.,0.));
#786=DIRECTION('center_axis',(0.,0.,1.));
#787=DIRECTION('ref_axis',(1.,0.,0.));
#788=DIRECTION('',(0.,0.,-1.));
#789=DIRECTION('center_axis',(0.,0.,-1.));
#790=DIRECTION('ref_axis',(1.,0.,0.));
#791=DIRECTION('center_axis',(0.,-1.,0.));
#792=DIRECTION('ref_axis',(0.,0.,-1.));
#793=DIRECTION('',(1.,0.,0.));
#794=DIRECTION('',(0.,0.,-1.));
#795=DIRECTION('',(-1.,0.,0.));
#796=DIRECTION('center_axis',(-1.,0.,0.));
#797=DIRECTION('ref_axis',(0.,0.,1.));
#798=DIRECTION('',(0.,-1.,0.));
#799=DIRECTION('',(0.,0.,-1.));
#800=DIRECTION('',(0.,1.,0.));
#801=DIRECTION('center_axis',(0.,-1.,0.));
#802=DIRECTION('ref_axis',(0.,0.,-1.));
#803=DIRECTION('',(1.,0.,0.));
#804=DIRECTION('',(0.,0.,-1.));
#805=DIRECTION('',(-1.,0.,0.));
#806=DIRECTION('center_axis',(0.,0.,-1.));
#807=DIRECTION('ref_axis',(1.,0.,0.));
#808=DIRECTION('center_axis',(0.,0.,1.));
#809=DIRECTION('ref_axis',(1.,0.,0.));
#810=DIRECTION('',(0.,0.,-1.));
#811=DIRECTION('center_axis',(0.,0.,-1.));
#812=DIRECTION('ref_axis',(1.,0.,0.));
#813=DIRECTION('center_axis',(1.,0.,0.));
#814=DIRECTION('ref_axis',(0.,0.,-1.));
#815=DIRECTION('',(0.,1.,0.));
#816=DIRECTION('',(0.,0.,-1.));
#817=DIRECTION('',(0.,-1.,0.));
#818=DIRECTION('center_axis',(0.,1.,0.));
#819=DIRECTION('ref_axis',(0.,0.,1.));
#820=DIRECTION('',(-1.,0.,0.));
#821=DIRECTION('',(0.,0.,-1.));
#822=DIRECTION('',(1.,0.,0.));
#823=DIRECTION('center_axis',(1.,0.,0.));
#824=DIRECTION('ref_axis',(0.,0.,-1.));
#825=DIRECTION('',(0.,1.,0.));
#826=DIRECTION('',(0.,0.,-1.));
#827=DIRECTION('',(0.,-1.,0.));
#828=DIRECTION('center_axis',(0.,-1.,0.));
#829=DIRECTION('ref_axis',(0.,0.,-1.));
#830=DIRECTION('',(1.,0.,0.));
#831=DIRECTION('',(0.,0.,-1.));
#832=DIRECTION('',(-1.,0.,0.));
#833=DIRECTION('center_axis',(1.,0.,0.));
#834=DIRECTION('ref_axis',(0.,0.,-1.));
#835=DIRECTION('',(0.,1.,0.));
#836=DIRECTION('',(0.,0.,-1.));
#837=DIRECTION('',(0.,-1.,0.));
#838=DIRECTION('center_axis',(0.,0.,-1.));
#839=DIRECTION('ref_axis',(1.,0.,0.));
#840=DIRECTION('center_axis',(0.,0.,1.));
#841=DIRECTION('ref_axis',(1.,0.,0.));
#842=DIRECTION('',(0.,0.,-1.));
#843=DIRECTION('center_axis',(0.,0.,-1.));
#844=DIRECTION('ref_axis',(1.,0.,0.));
#845=DIRECTION('center_axis',(0.,1.,0.));
#846=DIRECTION('ref_axis',(0.,0.,1.));
#847=DIRECTION('',(-1.,0.,0.));
#848=DIRECTION('',(0.,0.,-1.));
#849=DIRECTION('',(1.,0.,0.));
#850=DIRECTION('center_axis',(-1.,0.,0.));
#851=DIRECTION('ref_axis',(0.,0.,1.));
#852=DIRECTION('',(0.,-1.,0.));
#853=DIRECTION('',(0.,0.,-1.));
#854=DIRECTION('',(0.,1.,0.));
#855=DIRECTION('center_axis',(0.,1.,0.));
#856=DIRECTION('ref_axis',(0.,0.,1.));
#857=DIRECTION('',(-1.,0.,0.));
#858=DIRECTION('',(1.,0.,0.));
#859=DIRECTION('center_axis',(0.,0.,1.));
#860=DIRECTION('ref_axis',(1.,0.,0.));
#861=DIRECTION('center_axis',(0.,0.,1.));
#862=DIRECTION('ref_axis',(1.,0.,0.));
#863=CARTESIAN_POINT('',(0.,0.,0.));
#864=CARTESIAN_POINT('Origin',(57.04,-314.86,0.));
#865=CARTESIAN_POINT('',(50.74,-314.86,2.5));
#866=CARTESIAN_POINT('Origin',(57.04,-314.86,2.5));
#867=CARTESIAN_POINT('',(50.74,-314.86,-2.5));
#868=CARTESIAN_POINT('',(50.74,-314.86,0.));
#869=CARTESIAN_POINT('Origin',(57.04,-314.86,-2.5));
#870=CARTESIAN_POINT('Origin',(-57.04,-278.54,0.));
#871=CARTESIAN_POINT('',(-63.34,-278.54,2.5));
#872=CARTESIAN_POINT('Origin',(-57.04,-278.54,2.5));
#873=CARTESIAN_POINT('',(-63.34,-278.54,-2.5));
#874=CARTESIAN_POINT('',(-63.34,-278.54,0.));
#875=CARTESIAN_POINT('Origin',(-57.04,-278.54,-2.5));
#876=CARTESIAN_POINT('Origin',(-314.95,-57.,0.));
#877=CARTESIAN_POINT('',(-321.25,-57.,2.5));
#878=CARTESIAN_POINT('Origin',(-314.95,-57.,2.5));
#879=CARTESIAN_POINT('',(-321.25,-57.,-2.5));
#880=CARTESIAN_POINT('',(-321.25,-57.,0.));
#881=CARTESIAN_POINT('Origin',(-314.95,-57.,-2.5));
#882=CARTESIAN_POINT('Origin',(-314.95,57.,0.));
#883=CARTESIAN_POINT('',(-321.25,57.,2.5));
#884=CARTESIAN_POINT('Origin',(-314.95,57.,2.5));
#885=CARTESIAN_POINT('',(-321.25,57.,-2.5));
#886=CARTESIAN_POINT('',(-321.25,57.,0.));
#887=CARTESIAN_POINT('Origin',(-314.95,57.,-2.5));
#888=CARTESIAN_POINT('Origin',(314.95,-57.,0.));
#889=CARTESIAN_POINT('',(308.65,-57.,2.5));
#890=CARTESIAN_POINT('Origin',(314.95,-57.,2.5));
#891=CARTESIAN_POINT('',(308.65,-57.,-2.5));
#892=CARTESIAN_POINT('',(308.65,-57.,0.));
#893=CARTESIAN_POINT('Origin',(314.95,-57.,-2.5));
#894=CARTESIAN_POINT('Origin',(314.95,57.,0.));
#895=CARTESIAN_POINT('',(308.65,57.,2.5));
#896=CARTESIAN_POINT('Origin',(314.95,57.,2.5));
#897=CARTESIAN_POINT('',(308.65,57.,-2.5));
#898=CARTESIAN_POINT('',(308.65,57.,0.));
#899=CARTESIAN_POINT('Origin',(314.95,57.,-2.5));
#900=CARTESIAN_POINT('Origin',(57.0400000000001,314.86,0.));
#901=CARTESIAN_POINT('',(50.7400000000001,314.86,2.5));
#902=CARTESIAN_POINT('Origin',(57.0400000000001,314.86,2.5));
#903=CARTESIAN_POINT('',(50.7400000000001,314.86,-2.5));
#904=CARTESIAN_POINT('',(50.7400000000001,314.86,0.));
#905=CARTESIAN_POINT('Origin',(57.0400000000001,314.86,-2.5));
#906=CARTESIAN_POINT('Origin',(-57.04,278.54,0.));
#907=CARTESIAN_POINT('',(-63.34,278.54,2.5));
#908=CARTESIAN_POINT('Origin',(-57.04,278.54,2.5));
#909=CARTESIAN_POINT('',(-63.34,278.54,-2.5));
#910=CARTESIAN_POINT('',(-63.34,278.54,0.));
#911=CARTESIAN_POINT('Origin',(-57.04,278.54,-2.5));
#912=CARTESIAN_POINT('Origin',(-2.842171E-14,0.,0.));
#913=CARTESIAN_POINT('',(-181.107012564395,299.5,-2.5));
#914=CARTESIAN_POINT('',(-327.,124.783813052816,-2.5));
#915=CARTESIAN_POINT('Origin',(-2.842171E-14,0.,-2.5));
#916=CARTESIAN_POINT('',(-327.,124.783813052816,2.5));
#917=CARTESIAN_POINT('',(-327.,124.783813052816,2.5));
#918=CARTESIAN_POINT('',(-181.107012564395,299.5,2.5));
#919=CARTESIAN_POINT('Origin',(-2.842171E-14,0.,2.5));
#920=CARTESIAN_POINT('',(-181.107012564395,299.5,-2.5));
#921=CARTESIAN_POINT('Origin',(-327.,124.783813052816,0.));
#922=CARTESIAN_POINT('',(-327.,45.3,-2.5));
#923=CARTESIAN_POINT('',(-327.,124.783813052816,-2.5));
#924=CARTESIAN_POINT('',(-327.,45.3,2.5));
#925=CARTESIAN_POINT('',(-327.,45.3,2.5));
#926=CARTESIAN_POINT('',(-327.,45.3,2.5));
#927=CARTESIAN_POINT('Origin',(-327.,45.3,0.));
#928=CARTESIAN_POINT('',(-299.5,45.3,-2.5));
#929=CARTESIAN_POINT('',(-327.,45.3,-2.5));
#930=CARTESIAN_POINT('',(-299.5,45.3,2.5));
#931=CARTESIAN_POINT('',(-299.5,45.3,2.5));
#932=CARTESIAN_POINT('',(-299.5,45.3,2.5));
#933=CARTESIAN_POINT('Origin',(-299.5,45.3,0.));
#934=CARTESIAN_POINT('',(-299.5,-45.3,-2.5));
#935=CARTESIAN_POINT('',(-299.5,45.3,-2.5));
#936=CARTESIAN_POINT('',(-299.5,-45.3,2.5));
#937=CARTESIAN_POINT('',(-299.5,-45.3,2.5));
#938=CARTESIAN_POINT('',(-299.5,-45.3,2.5));
#939=CARTESIAN_POINT('Origin',(-299.5,-45.3,0.));
#940=CARTESIAN_POINT('',(-327.,-45.3,-2.5));
#941=CARTESIAN_POINT('',(-299.5,-45.3,-2.5));
#942=CARTESIAN_POINT('',(-327.,-45.3,2.5));
#943=CARTESIAN_POINT('',(-327.,-45.3,2.5));
#944=CARTESIAN_POINT('',(-327.,-45.3,2.5));
#945=CARTESIAN_POINT('Origin',(-327.,-45.3,0.));
#946=CARTESIAN_POINT('',(-327.,-124.783813052816,-2.5));
#947=CARTESIAN_POINT('',(-327.,-45.3,-2.5));
#948=CARTESIAN_POINT('',(-327.,-124.783813052816,2.5));
#949=CARTESIAN_POINT('',(-327.,-124.783813052816,2.5));
#950=CARTESIAN_POINT('',(-327.,-124.783813052816,2.5));
#951=CARTESIAN_POINT('Origin',(-2.842171E-14,0.,0.));
#952=CARTESIAN_POINT('',(-181.107012564395,-299.5,-2.5));
#953=CARTESIAN_POINT('Origin',(-2.842171E-14,0.,-2.5));
#954=CARTESIAN_POINT('',(-181.107012564395,-299.5,2.5));
#955=CARTESIAN_POINT('',(-181.107012564395,-299.5,2.5));
#956=CARTESIAN_POINT('Origin',(-2.842171E-14,0.,2.5));
#957=CARTESIAN_POINT('Origin',(-181.107012564395,-299.5,0.));
#958=CARTESIAN_POINT('',(45.5,-299.5,-2.5));
#959=CARTESIAN_POINT('',(-181.107012564395,-299.5,-2.5));
#960=CARTESIAN_POINT('',(45.5,-299.5,2.5));
#961=CARTESIAN_POINT('',(45.5,-299.5,2.5));
#962=CARTESIAN_POINT('',(45.5,-299.5,2.5));
#963=CARTESIAN_POINT('Origin',(45.5,-299.5,0.));
#964=CARTESIAN_POINT('',(45.5,-327.,-2.5));
#965=CARTESIAN_POINT('',(45.5,-299.5,-2.5));
#966=CARTESIAN_POINT('',(45.5,-327.,2.5));
#967=CARTESIAN_POINT('',(45.5,-327.,2.5));
#968=CARTESIAN_POINT('',(45.5,-327.,2.5));
#969=CARTESIAN_POINT('Origin',(45.5,-327.,0.));
#970=CARTESIAN_POINT('',(124.783813052815,-327.,-2.5));
#971=CARTESIAN_POINT('',(45.5,-327.,-2.5));
#972=CARTESIAN_POINT('',(124.783813052815,-327.,2.5));
#973=CARTESIAN_POINT('',(124.783813052815,-327.,2.5));
#974=CARTESIAN_POINT('',(124.783813052815,-327.,2.5));
#975=CARTESIAN_POINT('Origin',(-2.842171E-14,0.,0.));
#976=CARTESIAN_POINT('',(327.,-124.783813052816,-2.5));
#977=CARTESIAN_POINT('Origin',(-2.842171E-14,0.,-2.5));
#978=CARTESIAN_POINT('',(327.,-124.783813052816,2.5));
#979=CARTESIAN_POINT('',(327.,-124.783813052816,2.5));
#980=CARTESIAN_POINT('Origin',(-2.842171E-14,0.,2.5));
#981=CARTESIAN_POINT('Origin',(327.,-124.783813052816,0.));
#982=CARTESIAN_POINT('',(327.,-45.3,-2.5));
#983=CARTESIAN_POINT('',(327.,-124.783813052816,-2.5));
#984=CARTESIAN_POINT('',(327.,-45.3,2.5));
#985=CARTESIAN_POINT('',(327.,-45.3,2.5));
#986=CARTESIAN_POINT('',(327.,-45.3,2.5));
#987=CARTESIAN_POINT('Origin',(327.,-45.3,0.));
#988=CARTESIAN_POINT('',(299.5,-45.3,-2.5));
#989=CARTESIAN_POINT('',(327.,-45.3,-2.5));
#990=CARTESIAN_POINT('',(299.5,-45.3,2.5));
#991=CARTESIAN_POINT('',(299.5,-45.3,2.5));
#992=CARTESIAN_POINT('',(299.5,-45.3,2.5));
#993=CARTESIAN_POINT('Origin',(299.5,-45.3,0.));
#994=CARTESIAN_POINT('',(299.5,45.3,-2.5));
#995=CARTESIAN_POINT('',(299.5,-45.3,-2.5));
#996=CARTESIAN_POINT('',(299.5,45.3,2.5));
#997=CARTESIAN_POINT('',(299.5,45.3,2.5));
#998=CARTESIAN_POINT('',(299.5,45.3,2.5));
#999=CARTESIAN_POINT('Origin',(299.5,45.3,0.));
#1000=CARTESIAN_POINT('',(327.,45.3,-2.5));
#1001=CARTESIAN_POINT('',(299.5,45.3,-2.5));
#1002=CARTESIAN_POINT('',(327.,45.3,2.5));
#1003=CARTESIAN_POINT('',(327.,45.3,2.5));
#1004=CARTESIAN_POINT('',(327.,45.3,2.5));
#1005=CARTESIAN_POINT('Origin',(327.,45.3,0.));
#1006=CARTESIAN_POINT('',(327.,124.783813052815,-2.5));
#1007=CARTESIAN_POINT('',(327.,45.3,-2.5));
#1008=CARTESIAN_POINT('',(327.,124.783813052815,2.5));
#1009=CARTESIAN_POINT('',(327.,124.783813052815,2.5));
#1010=CARTESIAN_POINT('',(327.,124.783813052815,2.5));
#1011=CARTESIAN_POINT('Origin',(-2.842171E-14,0.,0.));
#1012=CARTESIAN_POINT('',(124.783813052815,327.,-2.5));
#1013=CARTESIAN_POINT('Origin',(-2.842171E-14,0.,-2.5));
#1014=CARTESIAN_POINT('',(124.783813052815,327.,2.5));
#1015=CARTESIAN_POINT('',(124.783813052815,327.,2.5));
#1016=CARTESIAN_POINT('Origin',(-2.842171E-14,0.,2.5));
#1017=CARTESIAN_POINT('Origin',(124.783813052815,327.,0.));
#1018=CARTESIAN_POINT('',(45.5,327.,-2.5));
#1019=CARTESIAN_POINT('',(124.783813052815,327.,-2.5));
#1020=CARTESIAN_POINT('',(45.5,327.,2.5));
#1021=CARTESIAN_POINT('',(45.5,327.,2.5));
#1022=CARTESIAN_POINT('',(45.5,327.,2.5));
#1023=CARTESIAN_POINT('Origin',(45.5,327.,0.));
#1024=CARTESIAN_POINT('',(45.5,299.5,-2.5));
#1025=CARTESIAN_POINT('',(45.5,327.,-2.5));
#1026=CARTESIAN_POINT('',(45.5,299.5,2.5));
#1027=CARTESIAN_POINT('',(45.5,299.5,2.5));
#1028=CARTESIAN_POINT('',(45.5,299.5,2.5));
#1029=CARTESIAN_POINT('Origin',(45.5,299.5,0.));
#1030=CARTESIAN_POINT('',(45.5,299.5,-2.5));
#1031=CARTESIAN_POINT('',(-181.107012564395,299.5,2.5));
#1032=CARTESIAN_POINT('Origin',(1.77306989413796,-1.065814E-14,2.5));
#1033=CARTESIAN_POINT('Origin',(1.77306989413796,-1.065814E-14,-2.5));
#1034=UNCERTAINTY_MEASURE_WITH_UNIT(LENGTH_MEASURE(0.01),#1038,
'DISTANCE_ACCURACY_VALUE',
'Maximum model space distance between geometric entities at asserted c
onnectivities');
#1035=UNCERTAINTY_MEASURE_WITH_UNIT(LENGTH_MEASURE(0.01),#1038,
'DISTANCE_ACCURACY_VALUE',
'Maximum model space distance between geometric entities at asserted c
onnectivities');
#1036=(
GEOMETRIC_REPRESENTATION_CONTEXT(3)
GLOBAL_UNCERTAINTY_ASSIGNED_CONTEXT((#1034))
GLOBAL_UNIT_ASSIGNED_CONTEXT((#1038,#1040,#1041))
REPRESENTATION_CONTEXT('','3D')
);
#1037=(
GEOMETRIC_REPRESENTATION_CONTEXT(3)
GLOBAL_UNCERTAINTY_ASSIGNED_CONTEXT((#1035))
GLOBAL_UNIT_ASSIGNED_CONTEXT((#1038,#1040,#1041))
REPRESENTATION_CONTEXT('','3D')
);
#1038=(
LENGTH_UNIT()
NAMED_UNIT(*)
SI_UNIT(.MILLI.,.METRE.)
);
#1039=(
LENGTH_UNIT()
NAMED_UNIT(*)
SI_UNIT(.CENTI.,.METRE.)
);
#1040=(
NAMED_UNIT(*)
PLANE_ANGLE_UNIT()
SI_UNIT($,.RADIAN.)
);
#1041=(
NAMED_UNIT(*)
SI_UNIT($,.STERADIAN.)
SOLID_ANGLE_UNIT()
);
#1042=SHAPE_DEFINITION_REPRESENTATION(#1043,#1044);
#1043=PRODUCT_DEFINITION_SHAPE('',$,#1046);
#1044=SHAPE_REPRESENTATION('',(#638),#1036);
#1045=PRODUCT_DEFINITION_CONTEXT('part definition',#1050,'design');
#1046=PRODUCT_DEFINITION('PLATTFORM_ALU-SCHICHT',
'PLATTFORM_ALU-SCHICHT',#1047,#1045);
#1047=PRODUCT_DEFINITION_FORMATION('None',$,#1052);
#1048=PRODUCT_RELATED_PRODUCT_CATEGORY('PLATTFORM_ALU-SCHICHT',
'PLATTFORM_ALU-SCHICHT',(#1052));
#1049=APPLICATION_PROTOCOL_DEFINITION('international standard',
'automotive_design',2009,#1050);
#1050=APPLICATION_CONTEXT(
'Core Data for Automotive Mechanical Design Process');
#1051=PRODUCT_CONTEXT('part definition',#1050,'mechanical');
#1052=PRODUCT('PLATTFORM_ALU-SCHICHT','PLATTFORM_ALU-SCHICHT',$,(#1051));
#1053=PRESENTATION_STYLE_ASSIGNMENT((#1054));
#1054=SURFACE_STYLE_USAGE(.BOTH.,#1057);
#1055=SURFACE_STYLE_RENDERING_WITH_PROPERTIES($,#1061,(#1056));
#1056=SURFACE_STYLE_TRANSPARENT(0.);
#1057=SURFACE_SIDE_STYLE('',(#1058,#1055));
#1058=SURFACE_STYLE_FILL_AREA(#1059);
#1059=FILL_AREA_STYLE('',(#1060));
#1060=FILL_AREA_STYLE_COLOUR('',#1061);
#1061=COLOUR_RGB('',0.749019607843137,0.749019607843137,0.749019607843137);
ENDSEC;
END-ISO-10303-21;
