ISO-10303-21;
HEADER;
/* Generated by software containing ST-Developer
 * from STEP Tools, Inc. (www.steptools.com) 
 */

FILE_DESCRIPTION(
/* description */ (''),
/* implementation_level */ '2;1');

FILE_NAME(
/* name */ 
'C:\\Users\\Kacper\\MATLAB\\Projects\\release_mechanism\\models\\capsu
le\\\\DRUCKSENSOR_ipt_14ce2680.STEP',
/* time_stamp */ '2020-08-13T22:35:34+02:00',
/* author */ ('Kacper'),
/* organization */ (''),
/* preprocessor_version */ 'ST-DEVELOPER v18.1',
/* originating_system */ 'Autodesk Inventor 2021',
/* authorisation */ '');

FILE_SCHEMA (('AUTOMOTIVE_DESIGN { 1 0 10303 214 3 1 1 }'));
ENDSEC;

DATA;
#10=MECHANICAL_DESIGN_GEOMETRIC_PRESENTATION_REPRESENTATION('',(#13),#435);
#11=SHAPE_REPRESENTATION_RELATIONSHIP('SRR','None',#442,#12);
#12=ADVANCED_BREP_SHAPE_REPRESENTATION('',(#14),#434);
#13=STYLED_ITEM('',(#451),#14);
#14=MANIFOLD_SOLID_BREP('Solid1',#249);
#15=FACE_BOUND('',#52,.T.);
#16=FACE_BOUND('',#60,.T.);
#17=FACE_BOUND('',#62,.T.);
#18=FACE_BOUND('',#64,.T.);
#19=PLANE('',#281);
#20=PLANE('',#282);
#21=PLANE('',#283);
#22=PLANE('',#284);
#23=PLANE('',#285);
#24=PLANE('',#286);
#25=PLANE('',#287);
#26=PLANE('',#288);
#27=PLANE('',#289);
#28=PLANE('',#290);
#29=PLANE('',#291);
#30=PLANE('',#292);
#31=FACE_OUTER_BOUND('',#47,.T.);
#32=FACE_OUTER_BOUND('',#48,.T.);
#33=FACE_OUTER_BOUND('',#49,.T.);
#34=FACE_OUTER_BOUND('',#50,.T.);
#35=FACE_OUTER_BOUND('',#51,.T.);
#36=FACE_OUTER_BOUND('',#53,.T.);
#37=FACE_OUTER_BOUND('',#54,.T.);
#38=FACE_OUTER_BOUND('',#55,.T.);
#39=FACE_OUTER_BOUND('',#56,.T.);
#40=FACE_OUTER_BOUND('',#57,.T.);
#41=FACE_OUTER_BOUND('',#58,.T.);
#42=FACE_OUTER_BOUND('',#59,.T.);
#43=FACE_OUTER_BOUND('',#61,.T.);
#44=FACE_OUTER_BOUND('',#63,.T.);
#45=FACE_OUTER_BOUND('',#65,.T.);
#46=FACE_OUTER_BOUND('',#66,.T.);
#47=EDGE_LOOP('',(#169,#170,#171,#172));
#48=EDGE_LOOP('',(#173,#174,#175,#176));
#49=EDGE_LOOP('',(#177,#178,#179,#180));
#50=EDGE_LOOP('',(#181,#182,#183,#184));
#51=EDGE_LOOP('',(#185,#186,#187,#188,#189,#190));
#52=EDGE_LOOP('',(#191));
#53=EDGE_LOOP('',(#192,#193,#194,#195));
#54=EDGE_LOOP('',(#196,#197,#198,#199));
#55=EDGE_LOOP('',(#200,#201,#202,#203));
#56=EDGE_LOOP('',(#204,#205,#206,#207));
#57=EDGE_LOOP('',(#208,#209,#210,#211));
#58=EDGE_LOOP('',(#212,#213,#214,#215));
#59=EDGE_LOOP('',(#216));
#60=EDGE_LOOP('',(#217));
#61=EDGE_LOOP('',(#218,#219,#220,#221,#222,#223));
#62=EDGE_LOOP('',(#224));
#63=EDGE_LOOP('',(#225));
#64=EDGE_LOOP('',(#226));
#65=EDGE_LOOP('',(#227));
#66=EDGE_LOOP('',(#228));
#67=LINE('',#370,#89);
#68=LINE('',#376,#90);
#69=LINE('',#382,#91);
#70=LINE('',#388,#92);
#71=LINE('',#393,#93);
#72=LINE('',#395,#94);
#73=LINE('',#397,#95);
#74=LINE('',#399,#96);
#75=LINE('',#401,#97);
#76=LINE('',#402,#98);
#77=LINE('',#405,#99);
#78=LINE('',#407,#100);
#79=LINE('',#408,#101);
#80=LINE('',#411,#102);
#81=LINE('',#412,#103);
#82=LINE('',#415,#104);
#83=LINE('',#416,#105);
#84=LINE('',#419,#106);
#85=LINE('',#420,#107);
#86=LINE('',#423,#108);
#87=LINE('',#424,#109);
#88=LINE('',#426,#110);
#89=VECTOR('',#299,7.75000000000136);
#90=VECTOR('',#306,10.5000000000015);
#91=VECTOR('',#313,9.00000000000165);
#92=VECTOR('',#320,6.55000000000143);
#93=VECTOR('',#325,12.7017059221718);
#94=VECTOR('',#326,12.7017059221718);
#95=VECTOR('',#327,12.7017059221718);
#96=VECTOR('',#328,12.7017059221718);
#97=VECTOR('',#329,12.7017059221718);
#98=VECTOR('',#330,12.7017059221718);
#99=VECTOR('',#333,10.);
#100=VECTOR('',#334,12.7017059221718);
#101=VECTOR('',#335,10.);
#102=VECTOR('',#338,10.);
#103=VECTOR('',#339,12.7017059221718);
#104=VECTOR('',#342,10.);
#105=VECTOR('',#343,12.7017059221718);
#106=VECTOR('',#346,10.);
#107=VECTOR('',#347,12.7017059221718);
#108=VECTOR('',#350,10.);
#109=VECTOR('',#351,12.7017059221718);
#110=VECTOR('',#354,12.7017059221718);
#111=CIRCLE('',#270,7.75000000000136);
#112=CIRCLE('',#271,7.75000000000136);
#113=CIRCLE('',#273,10.5000000000015);
#114=CIRCLE('',#274,10.5000000000015);
#115=CIRCLE('',#276,9.00000000000171);
#116=CIRCLE('',#277,9.00000000000159);
#117=CIRCLE('',#279,6.55000000000143);
#118=CIRCLE('',#280,6.55000000000143);
#119=VERTEX_POINT('',#367);
#120=VERTEX_POINT('',#369);
#121=VERTEX_POINT('',#373);
#122=VERTEX_POINT('',#375);
#123=VERTEX_POINT('',#379);
#124=VERTEX_POINT('',#381);
#125=VERTEX_POINT('',#385);
#126=VERTEX_POINT('',#387);
#127=VERTEX_POINT('',#391);
#128=VERTEX_POINT('',#392);
#129=VERTEX_POINT('',#394);
#130=VERTEX_POINT('',#396);
#131=VERTEX_POINT('',#398);
#132=VERTEX_POINT('',#400);
#133=VERTEX_POINT('',#404);
#134=VERTEX_POINT('',#406);
#135=VERTEX_POINT('',#410);
#136=VERTEX_POINT('',#414);
#137=VERTEX_POINT('',#418);
#138=VERTEX_POINT('',#422);
#139=EDGE_CURVE('',#119,#119,#111,.T.);
#140=EDGE_CURVE('',#119,#120,#67,.T.);
#141=EDGE_CURVE('',#120,#120,#112,.T.);
#142=EDGE_CURVE('',#121,#121,#113,.T.);
#143=EDGE_CURVE('',#121,#122,#68,.T.);
#144=EDGE_CURVE('',#122,#122,#114,.T.);
#145=EDGE_CURVE('',#123,#123,#115,.T.);
#146=EDGE_CURVE('',#123,#124,#69,.T.);
#147=EDGE_CURVE('',#124,#124,#116,.T.);
#148=EDGE_CURVE('',#125,#125,#117,.T.);
#149=EDGE_CURVE('',#125,#126,#70,.T.);
#150=EDGE_CURVE('',#126,#126,#118,.T.);
#151=EDGE_CURVE('',#127,#128,#71,.T.);
#152=EDGE_CURVE('',#129,#127,#72,.T.);
#153=EDGE_CURVE('',#130,#129,#73,.T.);
#154=EDGE_CURVE('',#131,#130,#74,.T.);
#155=EDGE_CURVE('',#132,#131,#75,.T.);
#156=EDGE_CURVE('',#128,#132,#76,.T.);
#157=EDGE_CURVE('',#133,#128,#77,.T.);
#158=EDGE_CURVE('',#134,#133,#78,.T.);
#159=EDGE_CURVE('',#134,#127,#79,.T.);
#160=EDGE_CURVE('',#135,#132,#80,.T.);
#161=EDGE_CURVE('',#133,#135,#81,.T.);
#162=EDGE_CURVE('',#136,#131,#82,.T.);
#163=EDGE_CURVE('',#135,#136,#83,.T.);
#164=EDGE_CURVE('',#137,#130,#84,.T.);
#165=EDGE_CURVE('',#136,#137,#85,.T.);
#166=EDGE_CURVE('',#138,#129,#86,.T.);
#167=EDGE_CURVE('',#137,#138,#87,.T.);
#168=EDGE_CURVE('',#138,#134,#88,.T.);
#169=ORIENTED_EDGE('',*,*,#139,.F.);
#170=ORIENTED_EDGE('',*,*,#140,.T.);
#171=ORIENTED_EDGE('',*,*,#141,.T.);
#172=ORIENTED_EDGE('',*,*,#140,.F.);
#173=ORIENTED_EDGE('',*,*,#142,.F.);
#174=ORIENTED_EDGE('',*,*,#143,.T.);
#175=ORIENTED_EDGE('',*,*,#144,.T.);
#176=ORIENTED_EDGE('',*,*,#143,.F.);
#177=ORIENTED_EDGE('',*,*,#145,.F.);
#178=ORIENTED_EDGE('',*,*,#146,.T.);
#179=ORIENTED_EDGE('',*,*,#147,.T.);
#180=ORIENTED_EDGE('',*,*,#146,.F.);
#181=ORIENTED_EDGE('',*,*,#148,.F.);
#182=ORIENTED_EDGE('',*,*,#149,.T.);
#183=ORIENTED_EDGE('',*,*,#150,.T.);
#184=ORIENTED_EDGE('',*,*,#149,.F.);
#185=ORIENTED_EDGE('',*,*,#151,.F.);
#186=ORIENTED_EDGE('',*,*,#152,.F.);
#187=ORIENTED_EDGE('',*,*,#153,.F.);
#188=ORIENTED_EDGE('',*,*,#154,.F.);
#189=ORIENTED_EDGE('',*,*,#155,.F.);
#190=ORIENTED_EDGE('',*,*,#156,.F.);
#191=ORIENTED_EDGE('',*,*,#144,.F.);
#192=ORIENTED_EDGE('',*,*,#151,.T.);
#193=ORIENTED_EDGE('',*,*,#157,.F.);
#194=ORIENTED_EDGE('',*,*,#158,.F.);
#195=ORIENTED_EDGE('',*,*,#159,.T.);
#196=ORIENTED_EDGE('',*,*,#156,.T.);
#197=ORIENTED_EDGE('',*,*,#160,.F.);
#198=ORIENTED_EDGE('',*,*,#161,.F.);
#199=ORIENTED_EDGE('',*,*,#157,.T.);
#200=ORIENTED_EDGE('',*,*,#155,.T.);
#201=ORIENTED_EDGE('',*,*,#162,.F.);
#202=ORIENTED_EDGE('',*,*,#163,.F.);
#203=ORIENTED_EDGE('',*,*,#160,.T.);
#204=ORIENTED_EDGE('',*,*,#154,.T.);
#205=ORIENTED_EDGE('',*,*,#164,.F.);
#206=ORIENTED_EDGE('',*,*,#165,.F.);
#207=ORIENTED_EDGE('',*,*,#162,.T.);
#208=ORIENTED_EDGE('',*,*,#153,.T.);
#209=ORIENTED_EDGE('',*,*,#166,.F.);
#210=ORIENTED_EDGE('',*,*,#167,.F.);
#211=ORIENTED_EDGE('',*,*,#164,.T.);
#212=ORIENTED_EDGE('',*,*,#152,.T.);
#213=ORIENTED_EDGE('',*,*,#159,.F.);
#214=ORIENTED_EDGE('',*,*,#168,.F.);
#215=ORIENTED_EDGE('',*,*,#166,.T.);
#216=ORIENTED_EDGE('',*,*,#147,.F.);
#217=ORIENTED_EDGE('',*,*,#148,.T.);
#218=ORIENTED_EDGE('',*,*,#168,.T.);
#219=ORIENTED_EDGE('',*,*,#158,.T.);
#220=ORIENTED_EDGE('',*,*,#161,.T.);
#221=ORIENTED_EDGE('',*,*,#163,.T.);
#222=ORIENTED_EDGE('',*,*,#165,.T.);
#223=ORIENTED_EDGE('',*,*,#167,.T.);
#224=ORIENTED_EDGE('',*,*,#145,.T.);
#225=ORIENTED_EDGE('',*,*,#142,.T.);
#226=ORIENTED_EDGE('',*,*,#141,.F.);
#227=ORIENTED_EDGE('',*,*,#139,.T.);
#228=ORIENTED_EDGE('',*,*,#150,.F.);
#229=CYLINDRICAL_SURFACE('',#269,7.75000000000136);
#230=CYLINDRICAL_SURFACE('',#272,10.5000000000015);
#231=CYLINDRICAL_SURFACE('',#275,9.00000000000165);
#232=CYLINDRICAL_SURFACE('',#278,6.55000000000143);
#233=ADVANCED_FACE('',(#31),#229,.T.);
#234=ADVANCED_FACE('',(#32),#230,.T.);
#235=ADVANCED_FACE('',(#33),#231,.T.);
#236=ADVANCED_FACE('',(#34),#232,.T.);
#237=ADVANCED_FACE('',(#35,#15),#19,.F.);
#238=ADVANCED_FACE('',(#36),#20,.T.);
#239=ADVANCED_FACE('',(#37),#21,.T.);
#240=ADVANCED_FACE('',(#38),#22,.T.);
#241=ADVANCED_FACE('',(#39),#23,.T.);
#242=ADVANCED_FACE('',(#40),#24,.T.);
#243=ADVANCED_FACE('',(#41),#25,.T.);
#244=ADVANCED_FACE('',(#42,#16),#26,.T.);
#245=ADVANCED_FACE('',(#43,#17),#27,.T.);
#246=ADVANCED_FACE('',(#44,#18),#28,.T.);
#247=ADVANCED_FACE('',(#45),#29,.T.);
#248=ADVANCED_FACE('',(#46),#30,.T.);
#249=CLOSED_SHELL('',(#233,#234,#235,#236,#237,#238,#239,#240,#241,#242,
#243,#244,#245,#246,#247,#248));
#250=DERIVED_UNIT_ELEMENT(#252,1.);
#251=DERIVED_UNIT_ELEMENT(#437,3.);
#252=(
MASS_UNIT()
NAMED_UNIT(*)
SI_UNIT($,.GRAM.)
);
#253=DERIVED_UNIT((#250,#251));
#254=MEASURE_REPRESENTATION_ITEM('density measure',
POSITIVE_RATIO_MEASURE(1.),#253);
#255=PROPERTY_DEFINITION_REPRESENTATION(#260,#257);
#256=PROPERTY_DEFINITION_REPRESENTATION(#261,#258);
#257=REPRESENTATION('material name',(#259),#434);
#258=REPRESENTATION('density',(#254),#434);
#259=DESCRIPTIVE_REPRESENTATION_ITEM('Generic','Generic');
#260=PROPERTY_DEFINITION('material property','material name',#444);
#261=PROPERTY_DEFINITION('material property','density of part',#444);
#262=DATE_TIME_ROLE('creation_date');
#263=APPLIED_DATE_AND_TIME_ASSIGNMENT(#264,#262,(#444));
#264=DATE_AND_TIME(#265,#266);
#265=CALENDAR_DATE(1996,29,5);
#266=LOCAL_TIME(12,0,0.,#267);
#267=COORDINATED_UNIVERSAL_TIME_OFFSET(0,0,.BEHIND.);
#268=AXIS2_PLACEMENT_3D('placement',#365,#293,#294);
#269=AXIS2_PLACEMENT_3D('',#366,#295,#296);
#270=AXIS2_PLACEMENT_3D('',#368,#297,#298);
#271=AXIS2_PLACEMENT_3D('',#371,#300,#301);
#272=AXIS2_PLACEMENT_3D('',#372,#302,#303);
#273=AXIS2_PLACEMENT_3D('',#374,#304,#305);
#274=AXIS2_PLACEMENT_3D('',#377,#307,#308);
#275=AXIS2_PLACEMENT_3D('',#378,#309,#310);
#276=AXIS2_PLACEMENT_3D('',#380,#311,#312);
#277=AXIS2_PLACEMENT_3D('',#383,#314,#315);
#278=AXIS2_PLACEMENT_3D('',#384,#316,#317);
#279=AXIS2_PLACEMENT_3D('',#386,#318,#319);
#280=AXIS2_PLACEMENT_3D('',#389,#321,#322);
#281=AXIS2_PLACEMENT_3D('',#390,#323,#324);
#282=AXIS2_PLACEMENT_3D('',#403,#331,#332);
#283=AXIS2_PLACEMENT_3D('',#409,#336,#337);
#284=AXIS2_PLACEMENT_3D('',#413,#340,#341);
#285=AXIS2_PLACEMENT_3D('',#417,#344,#345);
#286=AXIS2_PLACEMENT_3D('',#421,#348,#349);
#287=AXIS2_PLACEMENT_3D('',#425,#352,#353);
#288=AXIS2_PLACEMENT_3D('',#427,#355,#356);
#289=AXIS2_PLACEMENT_3D('',#428,#357,#358);
#290=AXIS2_PLACEMENT_3D('',#429,#359,#360);
#291=AXIS2_PLACEMENT_3D('',#430,#361,#362);
#292=AXIS2_PLACEMENT_3D('',#431,#363,#364);
#293=DIRECTION('axis',(0.,0.,1.));
#294=DIRECTION('refdir',(1.,0.,0.));
#295=DIRECTION('center_axis',(0.,0.,-1.));
#296=DIRECTION('ref_axis',(-1.,0.,0.));
#297=DIRECTION('center_axis',(0.,0.,-1.));
#298=DIRECTION('ref_axis',(-1.,0.,0.));
#299=DIRECTION('',(0.,0.,1.));
#300=DIRECTION('center_axis',(0.,0.,-1.));
#301=DIRECTION('ref_axis',(-1.,0.,0.));
#302=DIRECTION('center_axis',(0.,0.,-1.));
#303=DIRECTION('ref_axis',(-1.,0.,0.));
#304=DIRECTION('center_axis',(0.,0.,-1.));
#305=DIRECTION('ref_axis',(-1.,0.,0.));
#306=DIRECTION('',(0.,0.,1.));
#307=DIRECTION('center_axis',(0.,0.,-1.));
#308=DIRECTION('ref_axis',(-1.,0.,0.));
#309=DIRECTION('center_axis',(0.,0.,-1.));
#310=DIRECTION('ref_axis',(-1.,0.,0.));
#311=DIRECTION('center_axis',(0.,0.,-1.));
#312=DIRECTION('ref_axis',(-1.,0.,0.));
#313=DIRECTION('',(0.,0.,1.));
#314=DIRECTION('center_axis',(0.,0.,-1.));
#315=DIRECTION('ref_axis',(-1.,0.,0.));
#316=DIRECTION('center_axis',(0.,0.,-1.));
#317=DIRECTION('ref_axis',(-1.,0.,0.));
#318=DIRECTION('center_axis',(0.,0.,-1.));
#319=DIRECTION('ref_axis',(-1.,0.,0.));
#320=DIRECTION('',(0.,0.,1.));
#321=DIRECTION('center_axis',(0.,0.,-1.));
#322=DIRECTION('ref_axis',(-1.,0.,0.));
#323=DIRECTION('center_axis',(0.,0.,1.));
#324=DIRECTION('ref_axis',(1.,0.,0.));
#325=DIRECTION('',(1.,0.,0.));
#326=DIRECTION('',(0.5,-0.866025403784439,0.));
#327=DIRECTION('',(-0.500000000000001,-0.866025403784438,0.));
#328=DIRECTION('',(-1.,0.,0.));
#329=DIRECTION('',(-0.5,0.866025403784439,0.));
#330=DIRECTION('',(0.500000000000001,0.866025403784438,0.));
#331=DIRECTION('center_axis',(0.,-1.,0.));
#332=DIRECTION('ref_axis',(0.,0.,-1.));
#333=DIRECTION('',(0.,0.,-1.));
#334=DIRECTION('',(1.,0.,0.));
#335=DIRECTION('',(0.,0.,-1.));
#336=DIRECTION('center_axis',(0.866025403784439,-0.5,0.));
#337=DIRECTION('ref_axis',(0.,0.,-1.));
#338=DIRECTION('',(0.,0.,-1.));
#339=DIRECTION('',(0.500000000000001,0.866025403784438,0.));
#340=DIRECTION('center_axis',(0.866025403784439,0.5,0.));
#341=DIRECTION('ref_axis',(0.,0.,-1.));
#342=DIRECTION('',(0.,0.,-1.));
#343=DIRECTION('',(-0.5,0.866025403784439,0.));
#344=DIRECTION('center_axis',(0.,1.,0.));
#345=DIRECTION('ref_axis',(0.,0.,1.));
#346=DIRECTION('',(0.,0.,-1.));
#347=DIRECTION('',(-1.,0.,0.));
#348=DIRECTION('center_axis',(-0.866025403784439,0.5,0.));
#349=DIRECTION('ref_axis',(0.,0.,1.));
#350=DIRECTION('',(0.,0.,-1.));
#351=DIRECTION('',(-0.500000000000001,-0.866025403784438,0.));
#352=DIRECTION('center_axis',(-0.866025403784439,-0.5,0.));
#353=DIRECTION('ref_axis',(0.,0.,1.));
#354=DIRECTION('',(0.5,-0.866025403784439,0.));
#355=DIRECTION('center_axis',(0.,0.,1.));
#356=DIRECTION('ref_axis',(1.,0.,0.));
#357=DIRECTION('center_axis',(0.,0.,1.));
#358=DIRECTION('ref_axis',(1.,0.,0.));
#359=DIRECTION('center_axis',(0.,0.,-1.));
#360=DIRECTION('ref_axis',(-1.,0.,0.));
#361=DIRECTION('center_axis',(0.,0.,-1.));
#362=DIRECTION('ref_axis',(-1.,0.,0.));
#363=DIRECTION('center_axis',(0.,0.,1.));
#364=DIRECTION('ref_axis',(1.,0.,0.));
#365=CARTESIAN_POINT('',(0.,0.,0.));
#366=CARTESIAN_POINT('Origin',(0.,0.,-32.));
#367=CARTESIAN_POINT('',(7.75000000000136,-9.490699E-16,-39.5));
#368=CARTESIAN_POINT('Origin',(0.,0.,-39.5));
#369=CARTESIAN_POINT('',(7.75000000000136,-9.490699E-16,-24.5));
#370=CARTESIAN_POINT('',(7.75000000000136,-9.49101269339365E-16,-32.));
#371=CARTESIAN_POINT('Origin',(0.,0.,-24.5));
#372=CARTESIAN_POINT('Origin',(0.,0.,0.5));
#373=CARTESIAN_POINT('',(10.5000000000015,-1.285837E-15,-24.5));
#374=CARTESIAN_POINT('Origin',(0.,0.,-24.5));
#375=CARTESIAN_POINT('',(10.5000000000015,-1.285837E-15,15.5));
#376=CARTESIAN_POINT('',(10.5000000000015,-1.2858791391049E-15,0.5));
#377=CARTESIAN_POINT('Origin',(0.,0.,15.5));
#378=CARTESIAN_POINT('Origin',(0.,0.,26.5));
#379=CARTESIAN_POINT('',(9.00000000000165,-1.102146E-15,25.5));
#380=CARTESIAN_POINT('Origin',(0.,0.,25.5));
#381=CARTESIAN_POINT('',(9.00000000000165,-1.102146E-15,27.5));
#382=CARTESIAN_POINT('',(9.00000000000165,-1.10218211923282E-15,26.5));
#383=CARTESIAN_POINT('Origin',(0.,0.,27.5));
#384=CARTESIAN_POINT('Origin',(0.,0.,33.5));
#385=CARTESIAN_POINT('',(6.55000000000143,-8.021172E-16,27.5));
#386=CARTESIAN_POINT('Origin',(0.,0.,27.5));
#387=CARTESIAN_POINT('',(6.55000000000143,-8.021172E-16,39.5));
#388=CARTESIAN_POINT('',(6.55000000000143,-8.02143653441691E-16,33.5));
#389=CARTESIAN_POINT('Origin',(0.,0.,39.5));
#390=CARTESIAN_POINT('Origin',(5.719331E-16,0.,15.5));
#391=CARTESIAN_POINT('',(-6.35085296108589,-11.,15.5));
#392=CARTESIAN_POINT('',(6.35085296108588,-11.,15.5));
#393=CARTESIAN_POINT('',(-6.35085296108589,-11.,15.5));
#394=CARTESIAN_POINT('',(-12.7017059221718,7.993606E-15,15.5));
#395=CARTESIAN_POINT('',(-12.7017059221718,7.993606E-15,15.5));
#396=CARTESIAN_POINT('',(-6.35085296108587,11.,15.5));
#397=CARTESIAN_POINT('',(-6.35085296108587,11.,15.5));
#398=CARTESIAN_POINT('',(6.35085296108589,11.,15.5));
#399=CARTESIAN_POINT('',(6.35085296108589,11.,15.5));
#400=CARTESIAN_POINT('',(12.7017059221718,-8.881784E-15,15.5));
#401=CARTESIAN_POINT('',(12.7017059221718,-8.881784E-15,15.5));
#402=CARTESIAN_POINT('',(6.35085296108588,-11.,15.5));
#403=CARTESIAN_POINT('Origin',(-6.35085296108589,-11.,25.5));
#404=CARTESIAN_POINT('',(6.35085296108588,-11.,25.5));
#405=CARTESIAN_POINT('',(6.35085296108588,-11.,25.5));
#406=CARTESIAN_POINT('',(-6.35085296108589,-11.,25.5));
#407=CARTESIAN_POINT('',(-6.35085296108589,-11.,25.5));
#408=CARTESIAN_POINT('',(-6.35085296108589,-11.,25.5));
#409=CARTESIAN_POINT('Origin',(6.35085296108588,-11.,25.5));
#410=CARTESIAN_POINT('',(12.7017059221718,-8.881784E-15,25.5));
#411=CARTESIAN_POINT('',(12.7017059221718,-8.881784E-15,25.5));
#412=CARTESIAN_POINT('',(6.35085296108588,-11.,25.5));
#413=CARTESIAN_POINT('Origin',(12.7017059221718,-8.881784E-15,25.5));
#414=CARTESIAN_POINT('',(6.35085296108589,11.,25.5));
#415=CARTESIAN_POINT('',(6.35085296108589,11.,25.5));
#416=CARTESIAN_POINT('',(12.7017059221718,-8.881784E-15,25.5));
#417=CARTESIAN_POINT('Origin',(6.35085296108589,11.,25.5));
#418=CARTESIAN_POINT('',(-6.35085296108587,11.,25.5));
#419=CARTESIAN_POINT('',(-6.35085296108587,11.,25.5));
#420=CARTESIAN_POINT('',(6.35085296108589,11.,25.5));
#421=CARTESIAN_POINT('Origin',(-6.35085296108587,11.,25.5));
#422=CARTESIAN_POINT('',(-12.7017059221718,7.993606E-15,25.5));
#423=CARTESIAN_POINT('',(-12.7017059221718,7.993606E-15,25.5));
#424=CARTESIAN_POINT('',(-6.35085296108587,11.,25.5));
#425=CARTESIAN_POINT('Origin',(-12.7017059221718,7.993606E-15,25.5));
#426=CARTESIAN_POINT('',(-12.7017059221718,7.993606E-15,25.5));
#427=CARTESIAN_POINT('Origin',(-7.77500000000151,0.,27.5));
#428=CARTESIAN_POINT('Origin',(-9.75000000000159,0.,25.5));
#429=CARTESIAN_POINT('Origin',(-9.12500000000142,0.,-24.5));
#430=CARTESIAN_POINT('Origin',(-3.87500000000148,0.,-39.5));
#431=CARTESIAN_POINT('Origin',(-3.27500000000146,0.,39.5));
#432=UNCERTAINTY_MEASURE_WITH_UNIT(LENGTH_MEASURE(0.01),#436,
'DISTANCE_ACCURACY_VALUE',
'Maximum model space distance between geometric entities at asserted c
onnectivities');
#433=UNCERTAINTY_MEASURE_WITH_UNIT(LENGTH_MEASURE(0.01),#436,
'DISTANCE_ACCURACY_VALUE',
'Maximum model space distance between geometric entities at asserted c
onnectivities');
#434=(
GEOMETRIC_REPRESENTATION_CONTEXT(3)
GLOBAL_UNCERTAINTY_ASSIGNED_CONTEXT((#432))
GLOBAL_UNIT_ASSIGNED_CONTEXT((#436,#438,#439))
REPRESENTATION_CONTEXT('','3D')
);
#435=(
GEOMETRIC_REPRESENTATION_CONTEXT(3)
GLOBAL_UNCERTAINTY_ASSIGNED_CONTEXT((#433))
GLOBAL_UNIT_ASSIGNED_CONTEXT((#436,#438,#439))
REPRESENTATION_CONTEXT('','3D')
);
#436=(
LENGTH_UNIT()
NAMED_UNIT(*)
SI_UNIT(.MILLI.,.METRE.)
);
#437=(
LENGTH_UNIT()
NAMED_UNIT(*)
SI_UNIT(.CENTI.,.METRE.)
);
#438=(
NAMED_UNIT(*)
PLANE_ANGLE_UNIT()
SI_UNIT($,.RADIAN.)
);
#439=(
NAMED_UNIT(*)
SI_UNIT($,.STERADIAN.)
SOLID_ANGLE_UNIT()
);
#440=SHAPE_DEFINITION_REPRESENTATION(#441,#442);
#441=PRODUCT_DEFINITION_SHAPE('',$,#444);
#442=SHAPE_REPRESENTATION('',(#268),#434);
#443=PRODUCT_DEFINITION_CONTEXT('part definition',#448,'design');
#444=PRODUCT_DEFINITION('DRUCKSENSOR','DRUCKSENSOR',#445,#443);
#445=PRODUCT_DEFINITION_FORMATION('None',$,#450);
#446=PRODUCT_RELATED_PRODUCT_CATEGORY('DRUCKSENSOR','DRUCKSENSOR',(#450));
#447=APPLICATION_PROTOCOL_DEFINITION('international standard',
'automotive_design',2009,#448);
#448=APPLICATION_CONTEXT(
'Core Data for Automotive Mechanical Design Process');
#449=PRODUCT_CONTEXT('part definition',#448,'mechanical');
#450=PRODUCT('DRUCKSENSOR','DRUCKSENSOR',$,(#449));
#451=PRESENTATION_STYLE_ASSIGNMENT((#452));
#452=SURFACE_STYLE_USAGE(.BOTH.,#455);
#453=SURFACE_STYLE_RENDERING_WITH_PROPERTIES($,#459,(#454));
#454=SURFACE_STYLE_TRANSPARENT(0.);
#455=SURFACE_SIDE_STYLE('',(#456,#453));
#456=SURFACE_STYLE_FILL_AREA(#457);
#457=FILL_AREA_STYLE('',(#458));
#458=FILL_AREA_STYLE_COLOUR('',#459);
#459=COLOUR_RGB('',0.749019607843137,0.749019607843137,0.749019607843137);
ENDSEC;
END-ISO-10303-21;
