ISO-10303-21;
HEADER;
/* Generated by software containing ST-Developer
 * from STEP Tools, Inc. (www.steptools.com) 
 */
/* OPTION: using custom schema-name function */

FILE_DESCRIPTION(
/* description */ (''),
/* implementation_level */ '2;1');

FILE_NAME(
/* name */ 'F0013963500-A-P2016.038.026.stp',
/* time_stamp */ '2020-02-10T10:09:06+01:00',
/* author */ ('DR. FRITZ FAULHABER GmbH & Co. KG'),
/* organization */ ('DR. FRITZ FAULHABER GmbH & Co. KG'),
/* preprocessor_version */ 'ST-DEVELOPER v16.7',
/* originating_system */ 'SIEMENS PLM Software NX 12.0',
/* authorisation */ '');

FILE_SCHEMA (('AUTOMOTIVE_DESIGN { 1 0 10303 214 3 1 1 1 }'));
ENDSEC;

DATA;
#10=SHAPE_REPRESENTATION_RELATIONSHIP('None',
'relationship between F0013963500-A-P2016.038.026-None and F0013963500
-A-P2016.038.026-None',#22,#11);
#11=ADVANCED_BREP_SHAPE_REPRESENTATION(
'F0013963500-A-P2016.038.026-None',(#69,#70),#824);
#12=SHAPE_DEFINITION_REPRESENTATION(#13,#22);
#13=PRODUCT_DEFINITION_SHAPE('','',#14);
#14=PRODUCT_DEFINITION(' ','',#16,#15);
#15=PRODUCT_DEFINITION_CONTEXT('part definition',#21,'design');
#16=PRODUCT_DEFINITION_FORMATION_WITH_SPECIFIED_SOURCE(' ',' ',#18,
 .NOT_KNOWN.);
#17=PRODUCT_RELATED_PRODUCT_CATEGORY('part','',(#18));
#18=PRODUCT('F0013963500-A-P2016.038.026','F0013963500-A-P2016.038.026',
' ',(#19));
#19=PRODUCT_CONTEXT(' ',#21,'mechanical');
#20=APPLICATION_PROTOCOL_DEFINITION('international standard',
'automotive_design',2010,#21);
#21=APPLICATION_CONTEXT(
'core data for automotive mechanical design processes');
#22=SHAPE_REPRESENTATION('F0013963500-A-P2016.038.026-None',(#482),#824);
#23=OVER_RIDING_STYLED_ITEM('',(#33),#111,#30);
#24=OVER_RIDING_STYLED_ITEM('',(#35),#122,#31);
#25=OVER_RIDING_STYLED_ITEM('',(#36),#125,#31);
#26=OVER_RIDING_STYLED_ITEM('',(#37),#130,#31);
#27=DRAUGHTING_PRE_DEFINED_COLOUR('red');
#28=DRAUGHTING_PRE_DEFINED_COLOUR('blue');
#29=PRESENTATION_LAYER_ASSIGNMENT('1','Layer 1',(#69,#70));
#30=STYLED_ITEM('',(#32),#69);
#31=STYLED_ITEM('',(#34),#70);
#32=PRESENTATION_STYLE_ASSIGNMENT((#38));
#33=PRESENTATION_STYLE_ASSIGNMENT((#39));
#34=PRESENTATION_STYLE_ASSIGNMENT((#40));
#35=PRESENTATION_STYLE_ASSIGNMENT((#41));
#36=PRESENTATION_STYLE_ASSIGNMENT((#42));
#37=PRESENTATION_STYLE_ASSIGNMENT((#43));
#38=SURFACE_STYLE_USAGE(.BOTH.,#44);
#39=SURFACE_STYLE_USAGE(.BOTH.,#45);
#40=SURFACE_STYLE_USAGE(.BOTH.,#46);
#41=SURFACE_STYLE_USAGE(.BOTH.,#47);
#42=SURFACE_STYLE_USAGE(.BOTH.,#48);
#43=SURFACE_STYLE_USAGE(.BOTH.,#49);
#44=SURFACE_SIDE_STYLE('',(#50));
#45=SURFACE_SIDE_STYLE('',(#51));
#46=SURFACE_SIDE_STYLE('',(#52));
#47=SURFACE_SIDE_STYLE('',(#53));
#48=SURFACE_SIDE_STYLE('',(#54));
#49=SURFACE_SIDE_STYLE('',(#55));
#50=SURFACE_STYLE_FILL_AREA(#56);
#51=SURFACE_STYLE_FILL_AREA(#57);
#52=SURFACE_STYLE_FILL_AREA(#58);
#53=SURFACE_STYLE_FILL_AREA(#59);
#54=SURFACE_STYLE_FILL_AREA(#60);
#55=SURFACE_STYLE_FILL_AREA(#61);
#56=FILL_AREA_STYLE('',(#62));
#57=FILL_AREA_STYLE('',(#63));
#58=FILL_AREA_STYLE('',(#64));
#59=FILL_AREA_STYLE('',(#65));
#60=FILL_AREA_STYLE('',(#66));
#61=FILL_AREA_STYLE('',(#67));
#62=FILL_AREA_STYLE_COLOUR('',#68);
#63=FILL_AREA_STYLE_COLOUR('',#27);
#64=FILL_AREA_STYLE_COLOUR('',#68);
#65=FILL_AREA_STYLE_COLOUR('',#27);
#66=FILL_AREA_STYLE_COLOUR('',#27);
#67=FILL_AREA_STYLE_COLOUR('',#28);
#68=COLOUR_RGB('Light Gray',0.6,0.6,0.6);
#69=MANIFOLD_SOLID_BREP('',#71);
#70=MANIFOLD_SOLID_BREP('',#72);
#71=CLOSED_SHELL('',(#109,#110,#111,#112,#113,#114));
#72=CLOSED_SHELL('',(#115,#116,#117,#118,#119,#120,#121,#122,#123,#124,
#125,#126,#127,#128,#129,#130,#131,#132,#133,#134,#135,#136,#137,#138,#139,
#140,#141,#142,#143,#144,#145));
#73=PLANE('',#489);
#74=PLANE('',#490);
#75=PLANE('',#491);
#76=PLANE('',#492);
#77=PLANE('',#499);
#78=PLANE('',#501);
#79=PLANE('',#504);
#80=PLANE('',#515);
#81=PLANE('',#518);
#82=PLANE('',#521);
#83=PLANE('',#526);
#84=PLANE('',#528);
#85=PLANE('',#531);
#86=PLANE('',#534);
#87=PLANE('',#537);
#88=PLANE('',#540);
#89=PLANE('',#543);
#90=PLANE('',#546);
#91=PLANE('',#549);
#92=PLANE('',#552);
#93=CONICAL_SURFACE('',#488,3.,45.0000000000002);
#94=FACE_OUTER_BOUND('',#227,.T.);
#95=FACE_OUTER_BOUND('',#228,.T.);
#96=FACE_OUTER_BOUND('',#229,.T.);
#97=FACE_OUTER_BOUND('',#230,.T.);
#98=FACE_OUTER_BOUND('',#231,.T.);
#99=FACE_OUTER_BOUND('',#238,.T.);
#100=FACE_OUTER_BOUND('',#257,.T.);
#101=FACE_OUTER_BOUND('',#270,.T.);
#102=FACE_OUTER_BOUND('',#273,.T.);
#103=FACE_OUTER_BOUND('',#276,.T.);
#104=FACE_OUTER_BOUND('',#279,.T.);
#105=FACE_OUTER_BOUND('',#282,.T.);
#106=FACE_OUTER_BOUND('',#285,.T.);
#107=B_SPLINE_CURVE_WITH_KNOTS('',3,(#714,#715,#716,#717),.UNSPECIFIED.,
 .F.,.F.,(4,4),(0.,1.),.UNSPECIFIED.);
#108=B_SPLINE_CURVE_WITH_KNOTS('',3,(#721,#722,#723,#724),.UNSPECIFIED.,
 .F.,.F.,(4,4),(0.,1.),.UNSPECIFIED.);
#109=ADVANCED_FACE('',(#171,#172),#146,.T.);
#110=ADVANCED_FACE('',(#94),#93,.T.);
#111=ADVANCED_FACE('',(#95),#73,.T.);
#112=ADVANCED_FACE('',(#96),#74,.T.);
#113=ADVANCED_FACE('',(#97),#75,.T.);
#114=ADVANCED_FACE('',(#98),#76,.T.);
#115=ADVANCED_FACE('',(#173,#174),#147,.T.);
#116=ADVANCED_FACE('',(#175,#176),#148,.F.);
#117=ADVANCED_FACE('',(#177,#178),#77,.T.);
#118=ADVANCED_FACE('',(#99),#78,.F.);
#119=ADVANCED_FACE('',(#179,#180),#149,.F.);
#120=ADVANCED_FACE('',(#181,#182),#79,.F.);
#121=ADVANCED_FACE('',(#183,#184),#150,.T.);
#122=ADVANCED_FACE('AS_FLANSCH',(#185,#186,#187,#188,#189,#190,#191,#192),
#80,.T.);
#123=ADVANCED_FACE('',(#193,#194),#81,.T.);
#124=ADVANCED_FACE('',(#195,#196),#151,.T.);
#125=ADVANCED_FACE('AS_ROTIEREND',(#100),#82,.T.);
#126=ADVANCED_FACE('',(#197,#198),#152,.T.);
#127=ADVANCED_FACE('',(#199,#200),#153,.T.);
#128=ADVANCED_FACE('',(#201,#202),#83,.T.);
#129=ADVANCED_FACE('',(#203,#204),#84,.F.);
#130=ADVANCED_FACE('BS_FLANSCH',(#205,#206),#85,.T.);
#131=ADVANCED_FACE('',(#207,#208),#154,.T.);
#132=ADVANCED_FACE('',(#101),#86,.F.);
#133=ADVANCED_FACE('',(#209,#210),#155,.F.);
#134=ADVANCED_FACE('',(#102),#87,.F.);
#135=ADVANCED_FACE('',(#211,#212),#156,.F.);
#136=ADVANCED_FACE('',(#103),#88,.F.);
#137=ADVANCED_FACE('',(#213,#214),#157,.F.);
#138=ADVANCED_FACE('',(#104),#89,.F.);
#139=ADVANCED_FACE('',(#215,#216),#158,.F.);
#140=ADVANCED_FACE('',(#105),#90,.F.);
#141=ADVANCED_FACE('',(#217,#218),#159,.F.);
#142=ADVANCED_FACE('',(#106),#91,.F.);
#143=ADVANCED_FACE('',(#219,#220),#160,.F.);
#144=ADVANCED_FACE('',(#221,#222),#92,.F.);
#145=ADVANCED_FACE('',(#223,#224),#161,.F.);
#146=CYLINDRICAL_SURFACE('',#486,3.);
#147=CYLINDRICAL_SURFACE('',#495,10.3999999999995);
#148=CYLINDRICAL_SURFACE('',#498,6.);
#149=CYLINDRICAL_SURFACE('',#503,5.034);
#150=CYLINDRICAL_SURFACE('',#507,11.);
#151=CYLINDRICAL_SURFACE('',#519,7.5);
#152=CYLINDRICAL_SURFACE('',#522,4.);
#153=CYLINDRICAL_SURFACE('',#525,10.9995);
#154=CYLINDRICAL_SURFACE('',#532,11.);
#155=CYLINDRICAL_SURFACE('',#535,0.8);
#156=CYLINDRICAL_SURFACE('',#538,0.8);
#157=CYLINDRICAL_SURFACE('',#541,0.8);
#158=CYLINDRICAL_SURFACE('',#544,0.8);
#159=CYLINDRICAL_SURFACE('',#547,0.8);
#160=CYLINDRICAL_SURFACE('',#550,0.8);
#161=CYLINDRICAL_SURFACE('',#553,10.5);
#162=ELLIPSE('',#485,4.24264068711929,3.);
#163=LINE('',#708,#167);
#164=LINE('',#712,#168);
#165=LINE('',#726,#169);
#166=LINE('',#729,#170);
#167=VECTOR('',#560,1.);
#168=VECTOR('',#563,1.);
#169=VECTOR('',#570,1.);
#170=VECTOR('',#575,1.);
#171=FACE_BOUND('',#225,.T.);
#172=FACE_BOUND('',#226,.T.);
#173=FACE_BOUND('',#232,.T.);
#174=FACE_BOUND('',#233,.T.);
#175=FACE_BOUND('',#234,.T.);
#176=FACE_BOUND('',#235,.T.);
#177=FACE_BOUND('',#236,.T.);
#178=FACE_BOUND('',#237,.T.);
#179=FACE_BOUND('',#239,.T.);
#180=FACE_BOUND('',#240,.T.);
#181=FACE_BOUND('',#241,.T.);
#182=FACE_BOUND('',#242,.T.);
#183=FACE_BOUND('',#243,.T.);
#184=FACE_BOUND('',#244,.T.);
#185=FACE_BOUND('',#245,.T.);
#186=FACE_BOUND('',#246,.T.);
#187=FACE_BOUND('',#247,.T.);
#188=FACE_BOUND('',#248,.T.);
#189=FACE_BOUND('',#249,.T.);
#190=FACE_BOUND('',#250,.T.);
#191=FACE_BOUND('',#251,.T.);
#192=FACE_BOUND('',#252,.T.);
#193=FACE_BOUND('',#253,.T.);
#194=FACE_BOUND('',#254,.T.);
#195=FACE_BOUND('',#255,.T.);
#196=FACE_BOUND('',#256,.T.);
#197=FACE_BOUND('',#258,.T.);
#198=FACE_BOUND('',#259,.T.);
#199=FACE_BOUND('',#260,.T.);
#200=FACE_BOUND('',#261,.T.);
#201=FACE_BOUND('',#262,.T.);
#202=FACE_BOUND('',#263,.T.);
#203=FACE_BOUND('',#264,.T.);
#204=FACE_BOUND('',#265,.T.);
#205=FACE_BOUND('',#266,.T.);
#206=FACE_BOUND('',#267,.T.);
#207=FACE_BOUND('',#268,.T.);
#208=FACE_BOUND('',#269,.T.);
#209=FACE_BOUND('',#271,.T.);
#210=FACE_BOUND('',#272,.T.);
#211=FACE_BOUND('',#274,.T.);
#212=FACE_BOUND('',#275,.T.);
#213=FACE_BOUND('',#277,.T.);
#214=FACE_BOUND('',#278,.T.);
#215=FACE_BOUND('',#280,.T.);
#216=FACE_BOUND('',#281,.T.);
#217=FACE_BOUND('',#283,.T.);
#218=FACE_BOUND('',#284,.T.);
#219=FACE_BOUND('',#286,.T.);
#220=FACE_BOUND('',#287,.T.);
#221=FACE_BOUND('',#288,.T.);
#222=FACE_BOUND('',#289,.T.);
#223=FACE_BOUND('',#290,.T.);
#224=FACE_BOUND('',#291,.T.);
#225=EDGE_LOOP('',(#292));
#226=EDGE_LOOP('',(#293,#294,#295,#296));
#227=EDGE_LOOP('',(#297,#298,#299,#300));
#228=EDGE_LOOP('',(#301,#302));
#229=EDGE_LOOP('',(#303));
#230=EDGE_LOOP('',(#304,#305));
#231=EDGE_LOOP('',(#306,#307,#308,#309,#310,#311));
#232=EDGE_LOOP('',(#312));
#233=EDGE_LOOP('',(#313));
#234=EDGE_LOOP('',(#314));
#235=EDGE_LOOP('',(#315));
#236=EDGE_LOOP('',(#316));
#237=EDGE_LOOP('',(#317));
#238=EDGE_LOOP('',(#318));
#239=EDGE_LOOP('',(#319));
#240=EDGE_LOOP('',(#320));
#241=EDGE_LOOP('',(#321));
#242=EDGE_LOOP('',(#322));
#243=EDGE_LOOP('',(#323));
#244=EDGE_LOOP('',(#324));
#245=EDGE_LOOP('',(#325));
#246=EDGE_LOOP('',(#326));
#247=EDGE_LOOP('',(#327));
#248=EDGE_LOOP('',(#328));
#249=EDGE_LOOP('',(#329));
#250=EDGE_LOOP('',(#330));
#251=EDGE_LOOP('',(#331));
#252=EDGE_LOOP('',(#332));
#253=EDGE_LOOP('',(#333));
#254=EDGE_LOOP('',(#334));
#255=EDGE_LOOP('',(#335));
#256=EDGE_LOOP('',(#336));
#257=EDGE_LOOP('',(#337));
#258=EDGE_LOOP('',(#338));
#259=EDGE_LOOP('',(#339));
#260=EDGE_LOOP('',(#340));
#261=EDGE_LOOP('',(#341));
#262=EDGE_LOOP('',(#342));
#263=EDGE_LOOP('',(#343));
#264=EDGE_LOOP('',(#344));
#265=EDGE_LOOP('',(#345));
#266=EDGE_LOOP('',(#346));
#267=EDGE_LOOP('',(#347));
#268=EDGE_LOOP('',(#348));
#269=EDGE_LOOP('',(#349));
#270=EDGE_LOOP('',(#350));
#271=EDGE_LOOP('',(#351));
#272=EDGE_LOOP('',(#352));
#273=EDGE_LOOP('',(#353));
#274=EDGE_LOOP('',(#354));
#275=EDGE_LOOP('',(#355));
#276=EDGE_LOOP('',(#356));
#277=EDGE_LOOP('',(#357));
#278=EDGE_LOOP('',(#358));
#279=EDGE_LOOP('',(#359));
#280=EDGE_LOOP('',(#360));
#281=EDGE_LOOP('',(#361));
#282=EDGE_LOOP('',(#362));
#283=EDGE_LOOP('',(#363));
#284=EDGE_LOOP('',(#364));
#285=EDGE_LOOP('',(#365));
#286=EDGE_LOOP('',(#366));
#287=EDGE_LOOP('',(#367));
#288=EDGE_LOOP('',(#368));
#289=EDGE_LOOP('',(#369));
#290=EDGE_LOOP('',(#370));
#291=EDGE_LOOP('',(#371));
#292=ORIENTED_EDGE('',*,*,#409,.T.);
#293=ORIENTED_EDGE('',*,*,#410,.T.);
#294=ORIENTED_EDGE('',*,*,#411,.T.);
#295=ORIENTED_EDGE('',*,*,#412,.T.);
#296=ORIENTED_EDGE('',*,*,#413,.T.);
#297=ORIENTED_EDGE('',*,*,#410,.F.);
#298=ORIENTED_EDGE('',*,*,#414,.T.);
#299=ORIENTED_EDGE('',*,*,#415,.F.);
#300=ORIENTED_EDGE('',*,*,#416,.T.);
#301=ORIENTED_EDGE('',*,*,#417,.F.);
#302=ORIENTED_EDGE('',*,*,#415,.T.);
#303=ORIENTED_EDGE('',*,*,#409,.F.);
#304=ORIENTED_EDGE('',*,*,#418,.F.);
#305=ORIENTED_EDGE('',*,*,#412,.F.);
#306=ORIENTED_EDGE('',*,*,#418,.T.);
#307=ORIENTED_EDGE('',*,*,#411,.F.);
#308=ORIENTED_EDGE('',*,*,#416,.F.);
#309=ORIENTED_EDGE('',*,*,#417,.T.);
#310=ORIENTED_EDGE('',*,*,#414,.F.);
#311=ORIENTED_EDGE('',*,*,#413,.F.);
#312=ORIENTED_EDGE('',*,*,#419,.F.);
#313=ORIENTED_EDGE('',*,*,#420,.F.);
#314=ORIENTED_EDGE('',*,*,#421,.T.);
#315=ORIENTED_EDGE('',*,*,#422,.F.);
#316=ORIENTED_EDGE('',*,*,#419,.T.);
#317=ORIENTED_EDGE('',*,*,#421,.F.);
#318=ORIENTED_EDGE('',*,*,#423,.T.);
#319=ORIENTED_EDGE('',*,*,#424,.T.);
#320=ORIENTED_EDGE('',*,*,#423,.F.);
#321=ORIENTED_EDGE('',*,*,#424,.F.);
#322=ORIENTED_EDGE('',*,*,#422,.T.);
#323=ORIENTED_EDGE('',*,*,#425,.T.);
#324=ORIENTED_EDGE('',*,*,#426,.T.);
#325=ORIENTED_EDGE('',*,*,#427,.T.);
#326=ORIENTED_EDGE('',*,*,#428,.T.);
#327=ORIENTED_EDGE('',*,*,#429,.T.);
#328=ORIENTED_EDGE('',*,*,#430,.T.);
#329=ORIENTED_EDGE('',*,*,#431,.T.);
#330=ORIENTED_EDGE('',*,*,#432,.T.);
#331=ORIENTED_EDGE('',*,*,#433,.F.);
#332=ORIENTED_EDGE('',*,*,#425,.F.);
#333=ORIENTED_EDGE('',*,*,#434,.F.);
#334=ORIENTED_EDGE('',*,*,#435,.T.);
#335=ORIENTED_EDGE('',*,*,#435,.F.);
#336=ORIENTED_EDGE('',*,*,#433,.T.);
#337=ORIENTED_EDGE('',*,*,#436,.T.);
#338=ORIENTED_EDGE('',*,*,#436,.F.);
#339=ORIENTED_EDGE('',*,*,#434,.T.);
#340=ORIENTED_EDGE('',*,*,#437,.T.);
#341=ORIENTED_EDGE('',*,*,#438,.F.);
#342=ORIENTED_EDGE('',*,*,#426,.F.);
#343=ORIENTED_EDGE('',*,*,#438,.T.);
#344=ORIENTED_EDGE('',*,*,#439,.T.);
#345=ORIENTED_EDGE('',*,*,#437,.F.);
#346=ORIENTED_EDGE('',*,*,#440,.T.);
#347=ORIENTED_EDGE('',*,*,#441,.T.);
#348=ORIENTED_EDGE('',*,*,#439,.F.);
#349=ORIENTED_EDGE('',*,*,#441,.F.);
#350=ORIENTED_EDGE('',*,*,#442,.T.);
#351=ORIENTED_EDGE('',*,*,#442,.F.);
#352=ORIENTED_EDGE('',*,*,#432,.F.);
#353=ORIENTED_EDGE('',*,*,#443,.F.);
#354=ORIENTED_EDGE('',*,*,#443,.T.);
#355=ORIENTED_EDGE('',*,*,#431,.F.);
#356=ORIENTED_EDGE('',*,*,#444,.F.);
#357=ORIENTED_EDGE('',*,*,#444,.T.);
#358=ORIENTED_EDGE('',*,*,#430,.F.);
#359=ORIENTED_EDGE('',*,*,#445,.F.);
#360=ORIENTED_EDGE('',*,*,#445,.T.);
#361=ORIENTED_EDGE('',*,*,#429,.F.);
#362=ORIENTED_EDGE('',*,*,#446,.F.);
#363=ORIENTED_EDGE('',*,*,#446,.T.);
#364=ORIENTED_EDGE('',*,*,#428,.F.);
#365=ORIENTED_EDGE('',*,*,#447,.F.);
#366=ORIENTED_EDGE('',*,*,#447,.T.);
#367=ORIENTED_EDGE('',*,*,#427,.F.);
#368=ORIENTED_EDGE('',*,*,#420,.T.);
#369=ORIENTED_EDGE('',*,*,#448,.T.);
#370=ORIENTED_EDGE('',*,*,#448,.F.);
#371=ORIENTED_EDGE('',*,*,#440,.F.);
#372=VERTEX_POINT('',#704);
#373=VERTEX_POINT('',#706);
#374=VERTEX_POINT('',#707);
#375=VERTEX_POINT('',#709);
#376=VERTEX_POINT('',#711);
#377=VERTEX_POINT('',#718);
#378=VERTEX_POINT('',#720);
#379=VERTEX_POINT('',#733);
#380=VERTEX_POINT('',#735);
#381=VERTEX_POINT('',#738);
#382=VERTEX_POINT('',#740);
#383=VERTEX_POINT('',#744);
#384=VERTEX_POINT('',#747);
#385=VERTEX_POINT('',#751);
#386=VERTEX_POINT('',#753);
#387=VERTEX_POINT('',#756);
#388=VERTEX_POINT('',#758);
#389=VERTEX_POINT('',#760);
#390=VERTEX_POINT('',#762);
#391=VERTEX_POINT('',#764);
#392=VERTEX_POINT('',#766);
#393=VERTEX_POINT('',#768);
#394=VERTEX_POINT('',#771);
#395=VERTEX_POINT('',#773);
#396=VERTEX_POINT('',#777);
#397=VERTEX_POINT('',#781);
#398=VERTEX_POINT('',#783);
#399=VERTEX_POINT('',#787);
#400=VERTEX_POINT('',#790);
#401=VERTEX_POINT('',#792);
#402=VERTEX_POINT('',#796);
#403=VERTEX_POINT('',#800);
#404=VERTEX_POINT('',#804);
#405=VERTEX_POINT('',#808);
#406=VERTEX_POINT('',#812);
#407=VERTEX_POINT('',#816);
#408=VERTEX_POINT('',#820);
#409=EDGE_CURVE('',#372,#372,#449,.T.);
#410=EDGE_CURVE('',#373,#374,#450,.T.);
#411=EDGE_CURVE('',#374,#375,#163,.T.);
#412=EDGE_CURVE('',#375,#376,#162,.T.);
#413=EDGE_CURVE('',#376,#373,#164,.T.);
#414=EDGE_CURVE('',#373,#377,#107,.T.);
#415=EDGE_CURVE('',#378,#377,#451,.T.);
#416=EDGE_CURVE('',#378,#374,#108,.T.);
#417=EDGE_CURVE('',#378,#377,#165,.T.);
#418=EDGE_CURVE('',#376,#375,#166,.T.);
#419=EDGE_CURVE('',#379,#379,#452,.T.);
#420=EDGE_CURVE('',#380,#380,#453,.T.);
#421=EDGE_CURVE('',#381,#381,#454,.T.);
#422=EDGE_CURVE('',#382,#382,#455,.T.);
#423=EDGE_CURVE('',#383,#383,#456,.T.);
#424=EDGE_CURVE('',#384,#384,#457,.T.);
#425=EDGE_CURVE('',#385,#385,#458,.T.);
#426=EDGE_CURVE('',#386,#386,#459,.T.);
#427=EDGE_CURVE('',#387,#387,#460,.T.);
#428=EDGE_CURVE('',#388,#388,#461,.T.);
#429=EDGE_CURVE('',#389,#389,#462,.T.);
#430=EDGE_CURVE('',#390,#390,#463,.T.);
#431=EDGE_CURVE('',#391,#391,#464,.T.);
#432=EDGE_CURVE('',#392,#392,#465,.T.);
#433=EDGE_CURVE('',#393,#393,#466,.T.);
#434=EDGE_CURVE('',#394,#394,#467,.T.);
#435=EDGE_CURVE('',#395,#395,#468,.T.);
#436=EDGE_CURVE('',#396,#396,#469,.T.);
#437=EDGE_CURVE('',#397,#397,#470,.T.);
#438=EDGE_CURVE('',#398,#398,#471,.T.);
#439=EDGE_CURVE('',#399,#399,#472,.T.);
#440=EDGE_CURVE('',#400,#400,#473,.T.);
#441=EDGE_CURVE('',#401,#401,#474,.T.);
#442=EDGE_CURVE('',#402,#402,#475,.T.);
#443=EDGE_CURVE('',#403,#403,#476,.T.);
#444=EDGE_CURVE('',#404,#404,#477,.T.);
#445=EDGE_CURVE('',#405,#405,#478,.T.);
#446=EDGE_CURVE('',#406,#406,#479,.T.);
#447=EDGE_CURVE('',#407,#407,#480,.T.);
#448=EDGE_CURVE('',#408,#408,#481,.T.);
#449=CIRCLE('',#483,3.);
#450=CIRCLE('',#484,3.);
#451=CIRCLE('',#487,2.8);
#452=CIRCLE('',#493,10.3999999999995);
#453=CIRCLE('',#494,10.3999999999995);
#454=CIRCLE('',#496,6.);
#455=CIRCLE('',#497,6.);
#456=CIRCLE('',#500,5.034);
#457=CIRCLE('',#502,5.034);
#458=CIRCLE('',#505,11.);
#459=CIRCLE('',#506,11.);
#460=CIRCLE('',#508,0.8);
#461=CIRCLE('',#509,0.8);
#462=CIRCLE('',#510,0.8);
#463=CIRCLE('',#511,0.8);
#464=CIRCLE('',#512,0.8);
#465=CIRCLE('',#513,0.8);
#466=CIRCLE('',#514,7.5);
#467=CIRCLE('',#516,4.);
#468=CIRCLE('',#517,7.5);
#469=CIRCLE('',#520,4.);
#470=CIRCLE('',#523,10.9995);
#471=CIRCLE('',#524,10.9995);
#472=CIRCLE('',#527,11.);
#473=CIRCLE('',#529,10.5);
#474=CIRCLE('',#530,11.);
#475=CIRCLE('',#533,0.8);
#476=CIRCLE('',#536,0.8);
#477=CIRCLE('',#539,0.8);
#478=CIRCLE('',#542,0.8);
#479=CIRCLE('',#545,0.8);
#480=CIRCLE('',#548,0.8);
#481=CIRCLE('',#551,10.5);
#482=AXIS2_PLACEMENT_3D('',#702,#554,#555);
#483=AXIS2_PLACEMENT_3D('',#703,#556,#557);
#484=AXIS2_PLACEMENT_3D('',#705,#558,#559);
#485=AXIS2_PLACEMENT_3D('',#710,#561,#562);
#486=AXIS2_PLACEMENT_3D('',#713,#564,#565);
#487=AXIS2_PLACEMENT_3D('',#719,#566,#567);
#488=AXIS2_PLACEMENT_3D('',#725,#568,#569);
#489=AXIS2_PLACEMENT_3D('',#727,#571,#572);
#490=AXIS2_PLACEMENT_3D('',#728,#573,#574);
#491=AXIS2_PLACEMENT_3D('',#730,#576,#577);
#492=AXIS2_PLACEMENT_3D('',#731,#578,#579);
#493=AXIS2_PLACEMENT_3D('',#732,#580,#581);
#494=AXIS2_PLACEMENT_3D('',#734,#582,#583);
#495=AXIS2_PLACEMENT_3D('',#736,#584,#585);
#496=AXIS2_PLACEMENT_3D('',#737,#586,#587);
#497=AXIS2_PLACEMENT_3D('',#739,#588,#589);
#498=AXIS2_PLACEMENT_3D('',#741,#590,#591);
#499=AXIS2_PLACEMENT_3D('',#742,#592,#593);
#500=AXIS2_PLACEMENT_3D('',#743,#594,#595);
#501=AXIS2_PLACEMENT_3D('',#745,#596,#597);
#502=AXIS2_PLACEMENT_3D('',#746,#598,#599);
#503=AXIS2_PLACEMENT_3D('',#748,#600,#601);
#504=AXIS2_PLACEMENT_3D('',#749,#602,#603);
#505=AXIS2_PLACEMENT_3D('',#750,#604,#605);
#506=AXIS2_PLACEMENT_3D('',#752,#606,#607);
#507=AXIS2_PLACEMENT_3D('',#754,#608,#609);
#508=AXIS2_PLACEMENT_3D('',#755,#610,#611);
#509=AXIS2_PLACEMENT_3D('',#757,#612,#613);
#510=AXIS2_PLACEMENT_3D('',#759,#614,#615);
#511=AXIS2_PLACEMENT_3D('',#761,#616,#617);
#512=AXIS2_PLACEMENT_3D('',#763,#618,#619);
#513=AXIS2_PLACEMENT_3D('',#765,#620,#621);
#514=AXIS2_PLACEMENT_3D('',#767,#622,#623);
#515=AXIS2_PLACEMENT_3D('',#769,#624,#625);
#516=AXIS2_PLACEMENT_3D('',#770,#626,#627);
#517=AXIS2_PLACEMENT_3D('',#772,#628,#629);
#518=AXIS2_PLACEMENT_3D('',#774,#630,#631);
#519=AXIS2_PLACEMENT_3D('',#775,#632,#633);
#520=AXIS2_PLACEMENT_3D('',#776,#634,#635);
#521=AXIS2_PLACEMENT_3D('',#778,#636,#637);
#522=AXIS2_PLACEMENT_3D('',#779,#638,#639);
#523=AXIS2_PLACEMENT_3D('',#780,#640,#641);
#524=AXIS2_PLACEMENT_3D('',#782,#642,#643);
#525=AXIS2_PLACEMENT_3D('',#784,#644,#645);
#526=AXIS2_PLACEMENT_3D('',#785,#646,#647);
#527=AXIS2_PLACEMENT_3D('',#786,#648,#649);
#528=AXIS2_PLACEMENT_3D('',#788,#650,#651);
#529=AXIS2_PLACEMENT_3D('',#789,#652,#653);
#530=AXIS2_PLACEMENT_3D('',#791,#654,#655);
#531=AXIS2_PLACEMENT_3D('',#793,#656,#657);
#532=AXIS2_PLACEMENT_3D('',#794,#658,#659);
#533=AXIS2_PLACEMENT_3D('',#795,#660,#661);
#534=AXIS2_PLACEMENT_3D('',#797,#662,#663);
#535=AXIS2_PLACEMENT_3D('',#798,#664,#665);
#536=AXIS2_PLACEMENT_3D('',#799,#666,#667);
#537=AXIS2_PLACEMENT_3D('',#801,#668,#669);
#538=AXIS2_PLACEMENT_3D('',#802,#670,#671);
#539=AXIS2_PLACEMENT_3D('',#803,#672,#673);
#540=AXIS2_PLACEMENT_3D('',#805,#674,#675);
#541=AXIS2_PLACEMENT_3D('',#806,#676,#677);
#542=AXIS2_PLACEMENT_3D('',#807,#678,#679);
#543=AXIS2_PLACEMENT_3D('',#809,#680,#681);
#544=AXIS2_PLACEMENT_3D('',#810,#682,#683);
#545=AXIS2_PLACEMENT_3D('',#811,#684,#685);
#546=AXIS2_PLACEMENT_3D('',#813,#686,#687);
#547=AXIS2_PLACEMENT_3D('',#814,#688,#689);
#548=AXIS2_PLACEMENT_3D('',#815,#690,#691);
#549=AXIS2_PLACEMENT_3D('',#817,#692,#693);
#550=AXIS2_PLACEMENT_3D('',#818,#694,#695);
#551=AXIS2_PLACEMENT_3D('',#819,#696,#697);
#552=AXIS2_PLACEMENT_3D('',#821,#698,#699);
#553=AXIS2_PLACEMENT_3D('',#822,#700,#701);
#554=DIRECTION('',(0.,0.,1.));
#555=DIRECTION('',(1.,0.,0.));
#556=DIRECTION('',(0.,0.,1.));
#557=DIRECTION('',(1.,0.,0.));
#558=DIRECTION('',(0.,0.,-1.));
#559=DIRECTION('',(1.,0.,0.));
#560=DIRECTION('',(0.,0.,-1.));
#561=DIRECTION('',(0.707106781186548,0.,-0.707106781186547));
#562=DIRECTION('',(0.707106781186547,0.,0.707106781186548));
#563=DIRECTION('',(0.,0.,1.));
#564=DIRECTION('',(0.,0.,1.));
#565=DIRECTION('',(1.,0.,0.));
#566=DIRECTION('',(0.,0.,1.));
#567=DIRECTION('',(1.,0.,0.));
#568=DIRECTION('',(0.,0.,-1.));
#569=DIRECTION('',(-1.,0.,3.80497671699796E-17));
#570=DIRECTION('',(0.,1.,0.));
#571=DIRECTION('',(0.,0.,1.));
#572=DIRECTION('',(1.,0.,0.));
#573=DIRECTION('',(0.,0.,-1.));
#574=DIRECTION('',(-1.,0.,0.));
#575=DIRECTION('',(0.,-1.,0.));
#576=DIRECTION('',(-0.707106781186548,0.,0.707106781186547));
#577=DIRECTION('',(0.707106781186547,0.,0.707106781186548));
#578=DIRECTION('',(-1.,0.,-7.2280144832367E-17));
#579=DIRECTION('',(-7.24247051220317E-17,0.,1.));
#580=DIRECTION('',(0.,0.,-1.));
#581=DIRECTION('',(-1.,0.,0.));
#582=DIRECTION('',(0.,0.,1.));
#583=DIRECTION('',(1.,0.,0.));
#584=DIRECTION('',(0.,0.,1.));
#585=DIRECTION('',(1.,0.,0.));
#586=DIRECTION('',(0.,0.,-1.));
#587=DIRECTION('',(-1.,0.,0.));
#588=DIRECTION('',(0.,0.,-1.));
#589=DIRECTION('',(-1.,0.,0.));
#590=DIRECTION('',(0.,0.,1.));
#591=DIRECTION('',(1.,0.,0.));
#592=DIRECTION('',(0.,0.,-1.));
#593=DIRECTION('',(-1.,0.,0.));
#594=DIRECTION('',(0.,0.,-1.));
#595=DIRECTION('',(1.,0.,0.));
#596=DIRECTION('',(0.,0.,1.));
#597=DIRECTION('',(1.,0.,0.));
#598=DIRECTION('',(0.,0.,-1.));
#599=DIRECTION('',(1.,0.,0.));
#600=DIRECTION('',(0.,0.,1.));
#601=DIRECTION('',(1.,0.,0.));
#602=DIRECTION('',(0.,0.,1.));
#603=DIRECTION('',(1.,0.,0.));
#604=DIRECTION('',(0.,0.,-1.));
#605=DIRECTION('',(1.,0.,0.));
#606=DIRECTION('',(0.,0.,1.));
#607=DIRECTION('',(-1.,0.,0.));
#608=DIRECTION('',(0.,0.,-1.));
#609=DIRECTION('',(1.,0.,0.));
#610=DIRECTION('',(0.,0.,-1.));
#611=DIRECTION('',(-0.499999999999997,0.866025403784441,0.));
#612=DIRECTION('',(0.,0.,-1.));
#613=DIRECTION('',(0.500000000000003,0.866025403784437,0.));
#614=DIRECTION('',(0.,0.,-1.));
#615=DIRECTION('',(1.,-2.16840434497101E-15,0.));
#616=DIRECTION('',(0.,0.,-1.));
#617=DIRECTION('',(0.499999999999999,-0.866025403784439,0.));
#618=DIRECTION('',(0.,0.,-1.));
#619=DIRECTION('',(-0.500000000000001,-0.866025403784439,0.));
#620=DIRECTION('',(0.,0.,-1.));
#621=DIRECTION('',(-1.,0.,0.));
#622=DIRECTION('',(0.,0.,1.));
#623=DIRECTION('',(1.,0.,0.));
#624=DIRECTION('',(0.,0.,1.));
#625=DIRECTION('',(1.,0.,0.));
#626=DIRECTION('',(0.,0.,1.));
#627=DIRECTION('',(1.,0.,0.));
#628=DIRECTION('',(0.,0.,1.));
#629=DIRECTION('',(1.,0.,0.));
#630=DIRECTION('',(0.,0.,1.));
#631=DIRECTION('',(1.,0.,0.));
#632=DIRECTION('',(0.,0.,1.));
#633=DIRECTION('',(1.,0.,0.));
#634=DIRECTION('',(0.,0.,1.));
#635=DIRECTION('',(1.,0.,0.));
#636=DIRECTION('',(0.,0.,1.));
#637=DIRECTION('',(1.,0.,0.));
#638=DIRECTION('',(0.,0.,1.));
#639=DIRECTION('',(1.,0.,0.));
#640=DIRECTION('',(0.,0.,1.));
#641=DIRECTION('',(-1.,0.,0.));
#642=DIRECTION('',(0.,0.,1.));
#643=DIRECTION('',(-1.,0.,0.));
#644=DIRECTION('',(0.,0.,-1.));
#645=DIRECTION('',(-1.,0.,0.));
#646=DIRECTION('',(0.,0.,-1.));
#647=DIRECTION('',(-1.,0.,0.));
#648=DIRECTION('',(0.,0.,1.));
#649=DIRECTION('',(-1.,0.,0.));
#650=DIRECTION('',(0.,0.,-1.));
#651=DIRECTION('',(-1.,0.,0.));
#652=DIRECTION('',(0.,0.,1.));
#653=DIRECTION('',(1.,0.,0.));
#654=DIRECTION('',(0.,0.,-1.));
#655=DIRECTION('',(-1.,0.,0.));
#656=DIRECTION('',(0.,0.,-1.));
#657=DIRECTION('',(-1.,0.,0.));
#658=DIRECTION('',(0.,0.,-1.));
#659=DIRECTION('',(1.,0.,0.));
#660=DIRECTION('',(0.,0.,1.));
#661=DIRECTION('',(-1.,0.,0.));
#662=DIRECTION('',(0.,0.,-1.));
#663=DIRECTION('',(-1.,0.,0.));
#664=DIRECTION('',(0.,0.,-1.));
#665=DIRECTION('',(-1.,0.,0.));
#666=DIRECTION('',(0.,0.,-1.));
#667=DIRECTION('',(-0.500000000000001,-0.866025403784439,0.));
#668=DIRECTION('',(0.,0.,-1.));
#669=DIRECTION('',(-0.500000000000001,-0.866025403784438,0.));
#670=DIRECTION('',(0.,0.,-1.));
#671=DIRECTION('',(-0.500000000000001,-0.866025403784439,0.));
#672=DIRECTION('',(0.,0.,-1.));
#673=DIRECTION('',(0.499999999999999,-0.866025403784439,0.));
#674=DIRECTION('',(0.,0.,-1.));
#675=DIRECTION('',(0.499999999999999,-0.866025403784439,0.));
#676=DIRECTION('',(0.,0.,-1.));
#677=DIRECTION('',(0.499999999999999,-0.866025403784439,0.));
#678=DIRECTION('',(0.,0.,-1.));
#679=DIRECTION('',(1.,-2.16840434497101E-15,0.));
#680=DIRECTION('',(0.,0.,-1.));
#681=DIRECTION('',(1.,-2.34361141604467E-15,0.));
#682=DIRECTION('',(0.,0.,-1.));
#683=DIRECTION('',(1.,-2.16840434497101E-15,0.));
#684=DIRECTION('',(0.,0.,-1.));
#685=DIRECTION('',(0.500000000000003,0.866025403784437,0.));
#686=DIRECTION('',(0.,0.,-1.));
#687=DIRECTION('',(0.500000000000003,0.866025403784437,0.));
#688=DIRECTION('',(0.,0.,-1.));
#689=DIRECTION('',(0.500000000000003,0.866025403784437,0.));
#690=DIRECTION('',(0.,0.,-1.));
#691=DIRECTION('',(-0.499999999999997,0.866025403784441,0.));
#692=DIRECTION('',(0.,0.,-1.));
#693=DIRECTION('',(-0.499999999999996,0.866025403784441,0.));
#694=DIRECTION('',(0.,0.,-1.));
#695=DIRECTION('',(-0.499999999999997,0.866025403784441,0.));
#696=DIRECTION('',(0.,0.,-1.));
#697=DIRECTION('',(1.,0.,0.));
#698=DIRECTION('',(0.,0.,1.));
#699=DIRECTION('',(1.,0.,0.));
#700=DIRECTION('',(0.,0.,1.));
#701=DIRECTION('',(1.,0.,0.));
#702=CARTESIAN_POINT('',(0.,0.,0.));
#703=CARTESIAN_POINT('',(0.,0.,0.));
#704=CARTESIAN_POINT('',(3.,0.,0.));
#705=CARTESIAN_POINT('',(0.,0.,20.8));
#706=CARTESIAN_POINT('',(-2.5,1.65831239517971,20.7999999999999));
#707=CARTESIAN_POINT('',(-2.5,-1.6583123951777,20.8));
#708=CARTESIAN_POINT('',(-2.5,-1.6583123951777,-1.80700362080917E-16));
#709=CARTESIAN_POINT('',(-2.5,-1.6583123951777,9.));
#710=CARTESIAN_POINT('',(0.,0.,11.5));
#711=CARTESIAN_POINT('',(-2.5,1.6583123951777,9.));
#712=CARTESIAN_POINT('',(-2.5,1.6583123951777,-1.80700362080917E-16));
#713=CARTESIAN_POINT('',(0.,0.,0.));
#714=CARTESIAN_POINT('',(-2.5,1.65831239517941,20.7999999999993));
#715=CARTESIAN_POINT('',(-2.5,1.52835666937831,20.8718357303061));
#716=CARTESIAN_POINT('',(-2.5,1.39619040514285,20.9390967451882));
#717=CARTESIAN_POINT('',(-2.5,1.26095202129186,21.));
#718=CARTESIAN_POINT('',(-2.5,1.26095202129185,21.));
#719=CARTESIAN_POINT('',(0.,0.,21.));
#720=CARTESIAN_POINT('',(-2.5,-1.26095202129185,21.));
#721=CARTESIAN_POINT('',(-2.5,-1.26095202129188,21.0000000000001));
#722=CARTESIAN_POINT('',(-2.5,-1.39660693327475,20.9389091659061));
#723=CARTESIAN_POINT('',(-2.5,-1.5287135657364,20.871638448421));
#724=CARTESIAN_POINT('',(-2.5,-1.6583123951777,20.8));
#725=CARTESIAN_POINT('',(0.,0.,20.8));
#726=CARTESIAN_POINT('',(-2.5,-3.,21.));
#727=CARTESIAN_POINT('',(0.,0.,21.));
#728=CARTESIAN_POINT('',(0.,0.,0.));
#729=CARTESIAN_POINT('',(-2.5,1.00397121172158E-12,9.));
#730=CARTESIAN_POINT('',(-2.5,1.00397121172158E-12,9.));
#731=CARTESIAN_POINT('',(-2.5,-3.,9.));
#732=CARTESIAN_POINT('',(0.,0.,-35.95));
#733=CARTESIAN_POINT('',(-10.3999999999995,0.,-35.95));
#734=CARTESIAN_POINT('',(0.,0.,-35.9));
#735=CARTESIAN_POINT('',(10.3999999999995,0.,-35.9));
#736=CARTESIAN_POINT('',(0.,0.,-35.95));
#737=CARTESIAN_POINT('',(0.,0.,-35.95));
#738=CARTESIAN_POINT('',(-6.,0.,-35.95));
#739=CARTESIAN_POINT('',(0.,0.,-34.75));
#740=CARTESIAN_POINT('',(-6.,0.,-34.75));
#741=CARTESIAN_POINT('',(0.,0.,-35.95));
#742=CARTESIAN_POINT('',(0.,0.,-35.95));
#743=CARTESIAN_POINT('',(0.,-3.3881317890172E-18,-30.));
#744=CARTESIAN_POINT('',(5.034,-3.3881317890172E-18,-30.));
#745=CARTESIAN_POINT('',(0.,-3.3881317890172E-18,-30.));
#746=CARTESIAN_POINT('',(0.,-3.3881317890172E-18,-34.75));
#747=CARTESIAN_POINT('',(5.034,-3.3881317890172E-18,-34.75));
#748=CARTESIAN_POINT('',(0.,-3.3881317890172E-18,-37.2));
#749=CARTESIAN_POINT('',(0.,-3.3881317890172E-18,-34.75));
#750=CARTESIAN_POINT('',(0.,0.,0.));
#751=CARTESIAN_POINT('',(11.,0.,0.));
#752=CARTESIAN_POINT('',(0.,0.,-4.7999));
#753=CARTESIAN_POINT('',(-11.,0.,-4.7999));
#754=CARTESIAN_POINT('',(0.,0.,0.));
#755=CARTESIAN_POINT('',(8.22724133595219,4.74999999999996,0.));
#756=CARTESIAN_POINT('',(7.82724133595219,5.44282032302752,0.));
#757=CARTESIAN_POINT('',(8.22724133595215,-4.75000000000002,0.));
#758=CARTESIAN_POINT('',(8.62724133595215,-4.05717967697248,0.));
#759=CARTESIAN_POINT('',(-2.2257651927068E-14,-9.5,0.));
#760=CARTESIAN_POINT('',(0.799999999999978,-9.5,0.));
#761=CARTESIAN_POINT('',(-8.22724133595217,-4.74999999999999,0.));
#762=CARTESIAN_POINT('',(-7.82724133595217,-5.44282032302754,0.));
#763=CARTESIAN_POINT('',(-8.22724133595216,4.75000000000001,0.));
#764=CARTESIAN_POINT('',(-8.62724133595216,4.05717967697245,0.));
#765=CARTESIAN_POINT('',(0.,9.5,0.));
#766=CARTESIAN_POINT('',(-0.8,9.5,0.));
#767=CARTESIAN_POINT('',(0.,-8.67361737988404E-16,0.));
#768=CARTESIAN_POINT('',(7.5,-8.67361737988404E-16,0.));
#769=CARTESIAN_POINT('',(0.,0.,0.));
#770=CARTESIAN_POINT('',(4.33680868994202E-16,-1.30104260698261E-15,1.5));
#771=CARTESIAN_POINT('',(4.,-1.30104260698261E-15,1.5));
#772=CARTESIAN_POINT('',(0.,-8.67361737988404E-16,1.5));
#773=CARTESIAN_POINT('',(7.5,-8.67361737988404E-16,1.5));
#774=CARTESIAN_POINT('',(0.,-8.67361737988404E-16,1.5));
#775=CARTESIAN_POINT('',(0.,-8.67361737988404E-16,0.));
#776=CARTESIAN_POINT('',(4.33680868994202E-16,-1.30104260698261E-15,3.1));
#777=CARTESIAN_POINT('',(4.,-1.30104260698261E-15,3.1));
#778=CARTESIAN_POINT('',(4.33680868994202E-16,-1.30104260698261E-15,3.1));
#779=CARTESIAN_POINT('',(4.33680868994202E-16,-1.30104260698261E-15,1.5));
#780=CARTESIAN_POINT('',(0.,0.,-4.8));
#781=CARTESIAN_POINT('',(-10.9995,0.,-4.8));
#782=CARTESIAN_POINT('',(0.,0.,-4.7999));
#783=CARTESIAN_POINT('',(-10.9995,0.,-4.7999));
#784=CARTESIAN_POINT('',(0.,0.,-4.79995));
#785=CARTESIAN_POINT('',(0.,0.,-4.7999));
#786=CARTESIAN_POINT('',(0.,0.,-4.8));
#787=CARTESIAN_POINT('',(-11.,0.,-4.8));
#788=CARTESIAN_POINT('',(0.,0.,-4.8));
#789=CARTESIAN_POINT('',(0.,-3.3881317890172E-18,-37.2));
#790=CARTESIAN_POINT('',(10.5,-3.3881317890172E-18,-37.2));
#791=CARTESIAN_POINT('',(0.,-3.3881317890172E-18,-37.2));
#792=CARTESIAN_POINT('',(-11.,-3.3881317890172E-18,-37.2));
#793=CARTESIAN_POINT('',(0.,-3.3881317890172E-18,-37.2));
#794=CARTESIAN_POINT('',(0.,0.,0.));
#795=CARTESIAN_POINT('',(0.,9.5,-3.));
#796=CARTESIAN_POINT('',(-0.8,9.5,-3.));
#797=CARTESIAN_POINT('',(0.,9.5,-3.));
#798=CARTESIAN_POINT('',(0.,9.5,0.));
#799=CARTESIAN_POINT('',(-8.22724133595216,4.75000000000001,-3.));
#800=CARTESIAN_POINT('',(-8.62724133595216,4.05717967697245,-3.));
#801=CARTESIAN_POINT('',(-8.22724133595216,4.75000000000001,-3.));
#802=CARTESIAN_POINT('',(-8.22724133595216,4.75000000000001,0.));
#803=CARTESIAN_POINT('',(-8.22724133595217,-4.74999999999999,-3.));
#804=CARTESIAN_POINT('',(-7.82724133595217,-5.44282032302754,-3.));
#805=CARTESIAN_POINT('',(-8.22724133595217,-4.74999999999999,-3.));
#806=CARTESIAN_POINT('',(-8.22724133595217,-4.74999999999999,0.));
#807=CARTESIAN_POINT('',(-2.2257651927068E-14,-9.5,-3.));
#808=CARTESIAN_POINT('',(0.799999999999978,-9.5,-3.));
#809=CARTESIAN_POINT('',(-2.2257651927068E-14,-9.5,-3.));
#810=CARTESIAN_POINT('',(-2.2257651927068E-14,-9.5,0.));
#811=CARTESIAN_POINT('',(8.22724133595215,-4.75000000000002,-3.));
#812=CARTESIAN_POINT('',(8.62724133595215,-4.05717967697248,-3.));
#813=CARTESIAN_POINT('',(8.22724133595215,-4.75000000000002,-3.));
#814=CARTESIAN_POINT('',(8.22724133595215,-4.75000000000002,0.));
#815=CARTESIAN_POINT('',(8.22724133595219,4.74999999999996,-3.));
#816=CARTESIAN_POINT('',(7.82724133595219,5.44282032302752,-3.));
#817=CARTESIAN_POINT('',(8.22724133595219,4.74999999999996,-3.));
#818=CARTESIAN_POINT('',(8.22724133595219,4.74999999999996,0.));
#819=CARTESIAN_POINT('',(0.,-3.3881317890172E-18,-35.9));
#820=CARTESIAN_POINT('',(10.5,-3.3881317890172E-18,-35.9));
#821=CARTESIAN_POINT('',(0.,-3.3881317890172E-18,-35.9));
#822=CARTESIAN_POINT('',(0.,-3.3881317890172E-18,-37.2));
#823=MECHANICAL_DESIGN_GEOMETRIC_PRESENTATION_REPRESENTATION('',(#30,#23,
#31,#24,#25,#26),#824);
#824=(
GEOMETRIC_REPRESENTATION_CONTEXT(3)
GLOBAL_UNCERTAINTY_ASSIGNED_CONTEXT((#825))
GLOBAL_UNIT_ASSIGNED_CONTEXT((#831,#827,#826))
REPRESENTATION_CONTEXT('F0013963500-A-P2016.038',
'TOP_LEVEL_ASSEMBLY_PART')
);
#825=UNCERTAINTY_MEASURE_WITH_UNIT(LENGTH_MEASURE(0.0508),#831,
'DISTANCE_ACCURACY_VALUE','Maximum Tolerance applied to model');
#826=(
NAMED_UNIT(*)
SI_UNIT($,.STERADIAN.)
SOLID_ANGLE_UNIT()
);
#827=(
CONVERSION_BASED_UNIT('DEGREE',#829)
NAMED_UNIT(#828)
PLANE_ANGLE_UNIT()
);
#828=DIMENSIONAL_EXPONENTS(0.,0.,0.,0.,0.,0.,0.);
#829=PLANE_ANGLE_MEASURE_WITH_UNIT(PLANE_ANGLE_MEASURE(0.0174532925),#830);
#830=(
NAMED_UNIT(*)
PLANE_ANGLE_UNIT()
SI_UNIT($,.RADIAN.)
);
#831=(
LENGTH_UNIT()
NAMED_UNIT(*)
SI_UNIT(.MILLI.,.METRE.)
);
ENDSEC;
END-ISO-10303-21;
