ISO-10303-21;
HEADER;
/* Generated by software containing ST-Developer
 * from STEP Tools, Inc. (www.steptools.com) 
 */

FILE_DESCRIPTION(
/* description */ (''),
/* implementation_level */ '2;1');

FILE_NAME(
/* name */ 
'C:\\Users\\Kacper\\MATLAB\\Projects\\release_mechanism\\models\\capsu
le\\\\VERBINDUNGSSTUECK_ipt_d8ac42a6.STEP',
/* time_stamp */ '2020-08-13T22:35:46+02:00',
/* author */ ('Kacper'),
/* organization */ (''),
/* preprocessor_version */ 'ST-DEVELOPER v18.1',
/* originating_system */ 'Autodesk Inventor 2021',
/* authorisation */ '');

FILE_SCHEMA (('AUTOMOTIVE_DESIGN { 1 0 10303 214 3 1 1 }'));
ENDSEC;

DATA;
#10=MECHANICAL_DESIGN_GEOMETRIC_PRESENTATION_REPRESENTATION('',(#13),#583);
#11=SHAPE_REPRESENTATION_RELATIONSHIP('SRR','None',#590,#12);
#12=ADVANCED_BREP_SHAPE_REPRESENTATION('',(#14),#582);
#13=STYLED_ITEM('',(#599),#14);
#14=MANIFOLD_SOLID_BREP('Solid1',#200);
#15=PLANE('',#240);
#16=PLANE('',#241);
#17=PLANE('',#244);
#18=B_SPLINE_SURFACE_WITH_KNOTS('',3,3,((#420,#421,#422,#423,#424),(#425,
#426,#427,#428,#429),(#430,#431,#432,#433,#434),(#435,#436,#437,#438,#439),
(#440,#441,#442,#443,#444),(#445,#446,#447,#448,#449),(#450,#451,#452,#453,
#454),(#455,#456,#457,#458,#459),(#460,#461,#462,#463,#464),(#465,#466,
#467,#468,#469),(#470,#471,#472,#473,#474),(#475,#476,#477,#478,#479),(#480,
#481,#482,#483,#484),(#485,#486,#487,#488,#489),(#490,#491,#492,#493,#494),
(#495,#496,#497,#498,#499),(#500,#501,#502,#503,#504),(#505,#506,#507,#508,
#509),(#510,#511,#512,#513,#514),(#515,#516,#517,#518,#519),(#520,#521,
#522,#523,#524),(#525,#526,#527,#528,#529),(#530,#531,#532,#533,#534),(#535,
#536,#537,#538,#539),(#540,#541,#542,#543,#544),(#545,#546,#547,#548,#549),
(#550,#551,#552,#553,#554),(#555,#556,#557,#558,#559),(#560,#561,#562,#563,
#564),(#565,#566,#567,#568,#569)),.UNSPECIFIED.,.T.,.F.,.F.,(4,2,2,2,2,
2,2,2,2,2,2,2,2,2,4),(4,1,4),(0.,4.11093298925325,10.6012374401482,14.6343536873356,
18.667469934523,22.8114143750379,26.7780858340462,31.4421579321587,37.8855357630952,
41.6225225155284,45.3595092679617,49.8691724645727,55.8738142447591,62.6241558690724,
67.9486210952068),(-0.000267845701542515,0.5,1.),.UNSPECIFIED.);
#19=FACE_BOUND('',#52,.T.);
#20=FACE_BOUND('',#56,.T.);
#21=FACE_BOUND('',#58,.T.);
#22=FACE_BOUND('',#61,.T.);
#23=B_SPLINE_CURVE_WITH_KNOTS('',3,(#343,#344,#345,#346,#347,#348,#349,
#350,#351,#352,#353,#354,#355,#356,#357,#358,#359,#360,#361,#362,#363,#364,
#365,#366,#367,#368,#369,#370,#371,#372),.UNSPECIFIED.,.T.,.F.,(4,2,2,2,
2,2,2,2,2,2,2,2,2,2,4),(0.,5.32446522613445,12.0748068504478,18.0794486306341,
22.5891118272451,26.3260985796784,30.0630853321116,36.5064631630481,41.1705352611606,
45.1372067201689,49.2811511606838,53.3142674078712,57.3473836550586,63.8376881059536,
67.9486210952068),.UNSPECIFIED.);
#24=B_SPLINE_CURVE_WITH_KNOTS('',3,(#379,#380,#381,#382,#383,#384,#385,
#386,#387,#388,#389,#390,#391,#392,#393,#394,#395,#396,#397,#398),
 .UNSPECIFIED.,.F.,.F.,(4,2,2,2,2,2,2,2,2,4),(18.6550184714378,18.667469934523,
22.8114143750379,26.7780858340462,31.4421579321587,37.8855357630952,41.6225225155284,
45.3595092679617,49.8691724645727,52.6163296255264),.UNSPECIFIED.);
#25=B_SPLINE_CURVE_WITH_KNOTS('',3,(#400,#401,#402,#403,#404,#405,#406,
#407,#408,#409),.UNSPECIFIED.,.F.,.F.,(4,2,2,2,4),(0.,4.11093298925325,
10.6012374401482,14.6343536873356,18.6550184714378),.UNSPECIFIED.);
#26=B_SPLINE_CURVE_WITH_KNOTS('',3,(#410,#411,#412,#413,#414,#415,#416,
#417,#418,#419),.UNSPECIFIED.,.F.,.F.,(4,2,2,2,4),(52.6163296255264,55.8738142447591,
61.0129554254787,62.6241558690724,67.9486210952068),.UNSPECIFIED.);
#27=B_SPLINE_CURVE_WITH_KNOTS('',3,(#570,#571,#572,#573,#574),
 .UNSPECIFIED.,.F.,.F.,(4,1,4),(-1.,-0.5,-1.12214382751163E-14),
 .UNSPECIFIED.);
#28=ELLIPSE('',#234,35.1465437551745,13.45);
#29=ELLIPSE('',#235,19.0211724139181,13.45);
#30=ELLIPSE('',#236,35.1465437551745,13.45);
#31=ELLIPSE('',#237,14.5581750939327,13.45);
#32=CONICAL_SURFACE('',#226,4.775,1.02974425867665);
#33=CONICAL_SURFACE('',#230,12.5,1.0471975511966);
#34=FACE_OUTER_BOUND('',#46,.T.);
#35=FACE_OUTER_BOUND('',#47,.T.);
#36=FACE_OUTER_BOUND('',#48,.T.);
#37=FACE_OUTER_BOUND('',#49,.T.);
#38=FACE_OUTER_BOUND('',#50,.T.);
#39=FACE_OUTER_BOUND('',#51,.T.);
#40=FACE_OUTER_BOUND('',#53,.T.);
#41=FACE_OUTER_BOUND('',#54,.T.);
#42=FACE_OUTER_BOUND('',#55,.T.);
#43=FACE_OUTER_BOUND('',#57,.T.);
#44=FACE_OUTER_BOUND('',#59,.T.);
#45=FACE_OUTER_BOUND('',#60,.T.);
#46=EDGE_LOOP('',(#130,#131,#132,#133));
#47=EDGE_LOOP('',(#134,#135,#136,#137));
#48=EDGE_LOOP('',(#138,#139,#140));
#49=EDGE_LOOP('',(#141,#142,#143,#144));
#50=EDGE_LOOP('',(#145,#146,#147,#148,#149));
#51=EDGE_LOOP('',(#150,#151,#152,#153,#154,#155,#156,#157));
#52=EDGE_LOOP('',(#158));
#53=EDGE_LOOP('',(#159,#160,#161,#162,#163,#164));
#54=EDGE_LOOP('',(#165,#166,#167,#168,#169,#170));
#55=EDGE_LOOP('',(#171));
#56=EDGE_LOOP('',(#172));
#57=EDGE_LOOP('',(#173,#174));
#58=EDGE_LOOP('',(#175));
#59=EDGE_LOOP('',(#176,#177,#178,#179));
#60=EDGE_LOOP('',(#180));
#61=EDGE_LOOP('',(#181));
#62=LINE('',#309,#69);
#63=LINE('',#315,#70);
#64=LINE('',#319,#71);
#65=LINE('',#324,#72);
#66=LINE('',#331,#73);
#67=LINE('',#341,#74);
#68=LINE('',#377,#75);
#69=VECTOR('',#251,5.25);
#70=VECTOR('',#258,9.55);
#71=VECTOR('',#263,4.775);
#72=VECTOR('',#268,10.55);
#73=VECTOR('',#277,12.5);
#74=VECTOR('',#288,13.45);
#75=VECTOR('',#293,9.);
#76=CIRCLE('',#221,5.25);
#77=CIRCLE('',#222,5.25);
#78=CIRCLE('',#224,9.55);
#79=CIRCLE('',#225,9.55);
#80=CIRCLE('',#228,10.55);
#81=CIRCLE('',#229,10.55);
#82=CIRCLE('',#231,13.45);
#83=CIRCLE('',#232,13.45);
#84=CIRCLE('',#239,9.);
#85=CIRCLE('',#242,13.45);
#86=VERTEX_POINT('',#306);
#87=VERTEX_POINT('',#308);
#88=VERTEX_POINT('',#312);
#89=VERTEX_POINT('',#314);
#90=VERTEX_POINT('',#318);
#91=VERTEX_POINT('',#321);
#92=VERTEX_POINT('',#323);
#93=VERTEX_POINT('',#327);
#94=VERTEX_POINT('',#328);
#95=VERTEX_POINT('',#333);
#96=VERTEX_POINT('',#334);
#97=VERTEX_POINT('',#336);
#98=VERTEX_POINT('',#338);
#99=VERTEX_POINT('',#342);
#100=VERTEX_POINT('',#374);
#101=VERTEX_POINT('',#376);
#102=VERTEX_POINT('',#378);
#103=VERTEX_POINT('',#399);
#104=EDGE_CURVE('',#86,#86,#76,.T.);
#105=EDGE_CURVE('',#86,#87,#62,.T.);
#106=EDGE_CURVE('',#87,#87,#77,.T.);
#107=EDGE_CURVE('',#88,#88,#78,.T.);
#108=EDGE_CURVE('',#88,#89,#63,.T.);
#109=EDGE_CURVE('',#89,#89,#79,.T.);
#110=EDGE_CURVE('',#90,#89,#64,.T.);
#111=EDGE_CURVE('',#91,#91,#80,.T.);
#112=EDGE_CURVE('',#91,#92,#65,.T.);
#113=EDGE_CURVE('',#92,#92,#81,.T.);
#114=EDGE_CURVE('',#93,#94,#82,.T.);
#115=EDGE_CURVE('',#94,#93,#83,.T.);
#116=EDGE_CURVE('',#94,#92,#66,.T.);
#117=EDGE_CURVE('',#95,#96,#28,.T.);
#118=EDGE_CURVE('',#96,#97,#29,.T.);
#119=EDGE_CURVE('',#97,#98,#30,.T.);
#120=EDGE_CURVE('',#98,#95,#31,.T.);
#121=EDGE_CURVE('',#95,#93,#67,.T.);
#122=EDGE_CURVE('',#99,#99,#23,.T.);
#123=EDGE_CURVE('',#100,#100,#84,.T.);
#124=EDGE_CURVE('',#100,#101,#68,.T.);
#125=EDGE_CURVE('',#102,#101,#24,.T.);
#126=EDGE_CURVE('',#103,#102,#25,.T.);
#127=EDGE_CURVE('',#101,#103,#26,.T.);
#128=EDGE_CURVE('',#99,#103,#27,.T.);
#129=EDGE_CURVE('',#97,#96,#85,.T.);
#130=ORIENTED_EDGE('',*,*,#104,.T.);
#131=ORIENTED_EDGE('',*,*,#105,.T.);
#132=ORIENTED_EDGE('',*,*,#106,.T.);
#133=ORIENTED_EDGE('',*,*,#105,.F.);
#134=ORIENTED_EDGE('',*,*,#107,.F.);
#135=ORIENTED_EDGE('',*,*,#108,.T.);
#136=ORIENTED_EDGE('',*,*,#109,.T.);
#137=ORIENTED_EDGE('',*,*,#108,.F.);
#138=ORIENTED_EDGE('',*,*,#110,.T.);
#139=ORIENTED_EDGE('',*,*,#109,.F.);
#140=ORIENTED_EDGE('',*,*,#110,.F.);
#141=ORIENTED_EDGE('',*,*,#111,.F.);
#142=ORIENTED_EDGE('',*,*,#112,.T.);
#143=ORIENTED_EDGE('',*,*,#113,.T.);
#144=ORIENTED_EDGE('',*,*,#112,.F.);
#145=ORIENTED_EDGE('',*,*,#114,.F.);
#146=ORIENTED_EDGE('',*,*,#115,.F.);
#147=ORIENTED_EDGE('',*,*,#116,.T.);
#148=ORIENTED_EDGE('',*,*,#113,.F.);
#149=ORIENTED_EDGE('',*,*,#116,.F.);
#150=ORIENTED_EDGE('',*,*,#117,.T.);
#151=ORIENTED_EDGE('',*,*,#118,.T.);
#152=ORIENTED_EDGE('',*,*,#119,.T.);
#153=ORIENTED_EDGE('',*,*,#120,.T.);
#154=ORIENTED_EDGE('',*,*,#121,.T.);
#155=ORIENTED_EDGE('',*,*,#114,.T.);
#156=ORIENTED_EDGE('',*,*,#115,.T.);
#157=ORIENTED_EDGE('',*,*,#121,.F.);
#158=ORIENTED_EDGE('',*,*,#122,.F.);
#159=ORIENTED_EDGE('',*,*,#123,.F.);
#160=ORIENTED_EDGE('',*,*,#124,.T.);
#161=ORIENTED_EDGE('',*,*,#125,.F.);
#162=ORIENTED_EDGE('',*,*,#126,.F.);
#163=ORIENTED_EDGE('',*,*,#127,.F.);
#164=ORIENTED_EDGE('',*,*,#124,.F.);
#165=ORIENTED_EDGE('',*,*,#128,.T.);
#166=ORIENTED_EDGE('',*,*,#126,.T.);
#167=ORIENTED_EDGE('',*,*,#125,.T.);
#168=ORIENTED_EDGE('',*,*,#127,.T.);
#169=ORIENTED_EDGE('',*,*,#128,.F.);
#170=ORIENTED_EDGE('',*,*,#122,.T.);
#171=ORIENTED_EDGE('',*,*,#123,.T.);
#172=ORIENTED_EDGE('',*,*,#104,.F.);
#173=ORIENTED_EDGE('',*,*,#118,.F.);
#174=ORIENTED_EDGE('',*,*,#129,.F.);
#175=ORIENTED_EDGE('',*,*,#106,.F.);
#176=ORIENTED_EDGE('',*,*,#119,.F.);
#177=ORIENTED_EDGE('',*,*,#129,.T.);
#178=ORIENTED_EDGE('',*,*,#117,.F.);
#179=ORIENTED_EDGE('',*,*,#120,.F.);
#180=ORIENTED_EDGE('',*,*,#111,.T.);
#181=ORIENTED_EDGE('',*,*,#107,.T.);
#182=CYLINDRICAL_SURFACE('',#220,5.25);
#183=CYLINDRICAL_SURFACE('',#223,9.55);
#184=CYLINDRICAL_SURFACE('',#227,10.55);
#185=CYLINDRICAL_SURFACE('',#233,13.45);
#186=CYLINDRICAL_SURFACE('',#238,9.);
#187=CYLINDRICAL_SURFACE('',#243,13.45);
#188=ADVANCED_FACE('',(#34),#182,.F.);
#189=ADVANCED_FACE('',(#35),#183,.F.);
#190=ADVANCED_FACE('',(#36),#32,.F.);
#191=ADVANCED_FACE('',(#37),#184,.T.);
#192=ADVANCED_FACE('',(#38),#33,.T.);
#193=ADVANCED_FACE('',(#39,#19),#185,.T.);
#194=ADVANCED_FACE('',(#40),#186,.F.);
#195=ADVANCED_FACE('',(#41),#18,.T.);
#196=ADVANCED_FACE('',(#42,#20),#15,.T.);
#197=ADVANCED_FACE('',(#43,#21),#16,.F.);
#198=ADVANCED_FACE('',(#44),#187,.T.);
#199=ADVANCED_FACE('',(#45,#22),#17,.T.);
#200=CLOSED_SHELL('',(#188,#189,#190,#191,#192,#193,#194,#195,#196,#197,
#198,#199));
#201=DERIVED_UNIT_ELEMENT(#203,1.);
#202=DERIVED_UNIT_ELEMENT(#585,3.);
#203=(
MASS_UNIT()
NAMED_UNIT(*)
SI_UNIT($,.GRAM.)
);
#204=DERIVED_UNIT((#201,#202));
#205=MEASURE_REPRESENTATION_ITEM('density measure',
POSITIVE_RATIO_MEASURE(1.),#204);
#206=PROPERTY_DEFINITION_REPRESENTATION(#211,#208);
#207=PROPERTY_DEFINITION_REPRESENTATION(#212,#209);
#208=REPRESENTATION('material name',(#210),#582);
#209=REPRESENTATION('density',(#205),#582);
#210=DESCRIPTIVE_REPRESENTATION_ITEM('Generic','Generic');
#211=PROPERTY_DEFINITION('material property','material name',#592);
#212=PROPERTY_DEFINITION('material property','density of part',#592);
#213=DATE_TIME_ROLE('creation_date');
#214=APPLIED_DATE_AND_TIME_ASSIGNMENT(#215,#213,(#592));
#215=DATE_AND_TIME(#216,#217);
#216=CALENDAR_DATE(1996,29,5);
#217=LOCAL_TIME(12,0,0.,#218);
#218=COORDINATED_UNIVERSAL_TIME_OFFSET(0,0,.BEHIND.);
#219=AXIS2_PLACEMENT_3D('placement',#304,#245,#246);
#220=AXIS2_PLACEMENT_3D('',#305,#247,#248);
#221=AXIS2_PLACEMENT_3D('',#307,#249,#250);
#222=AXIS2_PLACEMENT_3D('',#310,#252,#253);
#223=AXIS2_PLACEMENT_3D('',#311,#254,#255);
#224=AXIS2_PLACEMENT_3D('',#313,#256,#257);
#225=AXIS2_PLACEMENT_3D('',#316,#259,#260);
#226=AXIS2_PLACEMENT_3D('',#317,#261,#262);
#227=AXIS2_PLACEMENT_3D('',#320,#264,#265);
#228=AXIS2_PLACEMENT_3D('',#322,#266,#267);
#229=AXIS2_PLACEMENT_3D('',#325,#269,#270);
#230=AXIS2_PLACEMENT_3D('',#326,#271,#272);
#231=AXIS2_PLACEMENT_3D('',#329,#273,#274);
#232=AXIS2_PLACEMENT_3D('',#330,#275,#276);
#233=AXIS2_PLACEMENT_3D('',#332,#278,#279);
#234=AXIS2_PLACEMENT_3D('',#335,#280,#281);
#235=AXIS2_PLACEMENT_3D('',#337,#282,#283);
#236=AXIS2_PLACEMENT_3D('',#339,#284,#285);
#237=AXIS2_PLACEMENT_3D('',#340,#286,#287);
#238=AXIS2_PLACEMENT_3D('',#373,#289,#290);
#239=AXIS2_PLACEMENT_3D('',#375,#291,#292);
#240=AXIS2_PLACEMENT_3D('',#575,#294,#295);
#241=AXIS2_PLACEMENT_3D('',#576,#296,#297);
#242=AXIS2_PLACEMENT_3D('',#577,#298,#299);
#243=AXIS2_PLACEMENT_3D('',#578,#300,#301);
#244=AXIS2_PLACEMENT_3D('',#579,#302,#303);
#245=DIRECTION('axis',(0.,0.,1.));
#246=DIRECTION('refdir',(1.,0.,0.));
#247=DIRECTION('center_axis',(-0.707106781186547,-8.601668E-17,-0.707106781186548));
#248=DIRECTION('ref_axis',(0.707106781186548,0.,-0.707106781186547));
#249=DIRECTION('center_axis',(0.707106781186547,8.659275E-17,0.707106781186548));
#250=DIRECTION('ref_axis',(0.707106781186548,0.,-0.707106781186547));
#251=DIRECTION('',(-0.707106781186547,-8.601668E-17,-0.707106781186548));
#252=DIRECTION('center_axis',(-0.707106781186547,-8.036493E-17,-0.707106781186548));
#253=DIRECTION('ref_axis',(0.707106781186548,6.16297582203915E-33,-0.707106781186547));
#254=DIRECTION('center_axis',(-1.,-1.224606E-16,0.));
#255=DIRECTION('ref_axis',(0.,0.,-1.));
#256=DIRECTION('center_axis',(-1.,0.,0.));
#257=DIRECTION('ref_axis',(0.,0.,-1.));
#258=DIRECTION('',(-1.,-1.224606E-16,0.));
#259=DIRECTION('center_axis',(-1.,0.,0.));
#260=DIRECTION('ref_axis',(0.,0.,-1.));
#261=DIRECTION('center_axis',(1.,1.224606E-16,0.));
#262=DIRECTION('ref_axis',(0.,0.,-1.));
#263=DIRECTION('',(0.515038074910054,-4.19008474375317E-17,0.857167300702112));
#264=DIRECTION('center_axis',(1.,0.,0.));
#265=DIRECTION('ref_axis',(0.,0.,1.));
#266=DIRECTION('center_axis',(1.,0.,0.));
#267=DIRECTION('ref_axis',(0.,0.,1.));
#268=DIRECTION('',(-1.,0.,0.));
#269=DIRECTION('center_axis',(1.,0.,0.));
#270=DIRECTION('ref_axis',(0.,0.,1.));
#271=DIRECTION('center_axis',(-1.,0.,0.));
#272=DIRECTION('ref_axis',(0.,0.,1.));
#273=DIRECTION('center_axis',(-1.,0.,0.));
#274=DIRECTION('ref_axis',(0.,1.,0.));
#275=DIRECTION('center_axis',(-1.,0.,0.));
#276=DIRECTION('ref_axis',(0.,1.,0.));
#277=DIRECTION('',(0.5,1.06057523872491E-16,0.866025403784439));
#278=DIRECTION('center_axis',(-1.,-1.214405E-16,0.));
#279=DIRECTION('ref_axis',(-1.214405E-16,1.,0.));
#280=DIRECTION('center_axis',(0.38268343236509,-6.162976E-33,-0.923879532511287));
#281=DIRECTION('ref_axis',(-0.923879532511287,-1.121964E-16,-0.38268343236509));
#282=DIRECTION('center_axis',(0.707106781186547,8.036493E-17,0.707106781186548));
#283=DIRECTION('ref_axis',(0.707106781186548,8.587142E-17,-0.707106781186547));
#284=DIRECTION('center_axis',(0.38268343236509,-6.162976E-33,-0.923879532511287));
#285=DIRECTION('ref_axis',(-0.923879532511287,-1.121964E-16,-0.38268343236509));
#286=DIRECTION('center_axis',(0.923879532511286,-3.081488E-33,0.382683432365091));
#287=DIRECTION('ref_axis',(0.382683432365091,4.647328E-17,-0.923879532511286));
#288=DIRECTION('',(1.,1.214405E-16,0.));
#289=DIRECTION('center_axis',(0.707106781186547,8.572251E-17,0.707106781186548));
#290=DIRECTION('ref_axis',(0.707106781186548,-8.659275E-17,-0.707106781186547));
#291=DIRECTION('center_axis',(0.707106781186548,8.659275E-17,0.707106781186548));
#292=DIRECTION('ref_axis',(0.707106781186548,-8.65927500000001E-17,-0.707106781186548));
#293=DIRECTION('',(0.707106781186547,8.572251E-17,0.707106781186548));
#294=DIRECTION('center_axis',(0.707106781186548,8.65927499999998E-17,0.707106781186548));
#295=DIRECTION('ref_axis',(0.707106781186548,0.,-0.707106781186548));
#296=DIRECTION('center_axis',(0.707106781186547,8.036493E-17,0.707106781186548));
#297=DIRECTION('ref_axis',(0.707106781186548,6.16297582203915E-33,-0.707106781186547));
#298=DIRECTION('center_axis',(0.707106781186548,8.036493E-17,0.707106781186547));
#299=DIRECTION('ref_axis',(0.707106781186547,-1.84889274661175E-32,-0.707106781186548));
#300=DIRECTION('center_axis',(-0.707106781186548,-8.65845799999998E-17,
-0.707106781186548));
#301=DIRECTION('ref_axis',(-0.707106781186548,1.22464679914735E-16,0.707106781186548));
#302=DIRECTION('center_axis',(1.,0.,0.));
#303=DIRECTION('ref_axis',(0.,0.,-1.));
#304=CARTESIAN_POINT('',(0.,0.,0.));
#305=CARTESIAN_POINT('Origin',(13.,-3.45,28.9));
#306=CARTESIAN_POINT('',(-11.2980970388563,-3.45,12.0265241636025));
#307=CARTESIAN_POINT('Origin',(-7.5857864376269,-3.45,8.31421356237309));
#308=CARTESIAN_POINT('',(-18.3691648507218,-3.45,4.95545635173699));
#309=CARTESIAN_POINT('',(9.28768939877062,-3.45,32.6123106012294));
#310=CARTESIAN_POINT('Origin',(-14.6568542494924,-3.45,1.24314575050762));
#311=CARTESIAN_POINT('Origin',(22.,-3.45,3.45));
#312=CARTESIAN_POINT('',(25.,-3.45,13.));
#313=CARTESIAN_POINT('Origin',(25.,-3.45,3.45));
#314=CARTESIAN_POINT('',(19.,-3.45,13.));
#315=CARTESIAN_POINT('',(22.,-3.45,13.));
#316=CARTESIAN_POINT('Origin',(19.,-3.45,3.45));
#317=CARTESIAN_POINT('Origin',(16.1308905441434,-3.45,3.45));
#318=CARTESIAN_POINT('',(13.2617810882868,-3.45,3.45));
#319=CARTESIAN_POINT('',(16.1308905441434,-3.45,8.225));
#320=CARTESIAN_POINT('Origin',(24.5,-3.45,3.45));
#321=CARTESIAN_POINT('',(25.,-3.45,-7.1));
#322=CARTESIAN_POINT('Origin',(25.,-3.45,3.45));
#323=CARTESIAN_POINT('',(24.,-3.45,-7.1));
#324=CARTESIAN_POINT('',(24.5,-3.45,-7.1));
#325=CARTESIAN_POINT('Origin',(24.,-3.45,3.45));
#326=CARTESIAN_POINT('Origin',(22.8741669750802,-3.45,3.45));
#327=CARTESIAN_POINT('',(22.3256842193501,-16.9,3.45000000000001));
#328=CARTESIAN_POINT('',(22.3256842193501,-3.45,-9.99999999999998));
#329=CARTESIAN_POINT('Origin',(22.3256842193501,-3.45,3.45));
#330=CARTESIAN_POINT('Origin',(22.3256842193501,-3.45,3.45));
#331=CARTESIAN_POINT('',(22.8741669750802,-3.45,-9.05));
#332=CARTESIAN_POINT('Origin',(25.,-3.45,3.45));
#333=CARTESIAN_POINT('',(-12.45,-16.9,3.45));
#334=CARTESIAN_POINT('',(-15.5709632098128,-16.8377298156679,2.15725471082808));
#335=CARTESIAN_POINT('Origin',(-12.45,-3.45,3.45));
#336=CARTESIAN_POINT('',(-15.5709632098128,9.93772981566791,2.15725471082808));
#337=CARTESIAN_POINT('Origin',(-16.8637084989848,-3.45,3.45));
#338=CARTESIAN_POINT('',(-12.45,10.,3.45));
#339=CARTESIAN_POINT('Origin',(-12.45,-3.45,3.45));
#340=CARTESIAN_POINT('Origin',(-12.45,-3.45,3.45));
#341=CARTESIAN_POINT('',(25.,-16.9,3.45));
#342=CARTESIAN_POINT('',(-2.45522307585072,6.38019184044705,12.6298599324831));
#343=CARTESIAN_POINT('Ctrl Pts',(-2.45522307585072,6.38019184044705,12.6298599324831));
#344=CARTESIAN_POINT('Ctrl Pts',(-4.41958160197303,6.49715334717798,12.504612482351));
#345=CARTESIAN_POINT('Ctrl Pts',(-6.47494031370951,6.36677010276919,12.7010790437103));
#346=CARTESIAN_POINT('Ctrl Pts',(-10.3872777083513,4.65010691667158,14.2655784461918));
#347=CARTESIAN_POINT('Ctrl Pts',(-11.8023515023673,2.63653204418408,15.7028193692164));
#348=CARTESIAN_POINT('Ctrl Pts',(-13.0461113864656,-1.91640909144407,16.9967988686562));
#349=CARTESIAN_POINT('Ctrl Pts',(-13.0915368100938,-4.37622535883596,17.0569547326723));
#350=CARTESIAN_POINT('Ctrl Pts',(-12.2274220386408,-8.22421529462208,16.1381283113182));
#351=CARTESIAN_POINT('Ctrl Pts',(-11.5529098788084,-9.72612909496593,15.4246512828706));
#352=CARTESIAN_POINT('Ctrl Pts',(-9.63639278963572,-11.8172048235521,14.0416499138928));
#353=CARTESIAN_POINT('Ctrl Pts',(-8.50100361012549,-12.4914328125862,13.4218078555019));
#354=CARTESIAN_POINT('Ctrl Pts',(-5.90341882570318,-13.2494295224752,12.6779813743637));
#355=CARTESIAN_POINT('Ctrl Pts',(-4.49421599895371,-13.3484295047078,12.5564241518982));
#356=CARTESIAN_POINT('Ctrl Pts',(-0.71161564603233,-13.2408957867151,12.672302912156));
#357=CARTESIAN_POINT('Ctrl Pts',(1.63163563298068,-12.7941687784653,13.1648139478));
#358=CARTESIAN_POINT('Ctrl Pts',(5.50834121761504,-11.6233434073219,14.1510353440901));
#359=CARTESIAN_POINT('Ctrl Pts',(7.07573943919783,-11.00405362639,14.6174214628955));
#360=CARTESIAN_POINT('Ctrl Pts',(9.81811418801682,-9.50867470374904,15.4843701802688));
#361=CARTESIAN_POINT('Ctrl Pts',(11.0196996533475,-8.69006148018149,15.8873403635457));
#362=CARTESIAN_POINT('Ctrl Pts',(13.0819573854211,-6.52318112892315,16.59590572181));
#363=CARTESIAN_POINT('Ctrl Pts',(13.9302023691853,-5.05907580586763,16.8982878515399));
#364=CARTESIAN_POINT('Ctrl Pts',(13.9396834988837,-1.91232538462738,16.9016511978993));
#365=CARTESIAN_POINT('Ctrl Pts',(13.1337687726382,-0.464476031549955,16.6143670461327));
#366=CARTESIAN_POINT('Ctrl Pts',(11.1169169655205,1.71811573299325,15.9201440593877));
#367=CARTESIAN_POINT('Ctrl Pts',(9.88927654875365,2.5643645055987,15.507562112956));
#368=CARTESIAN_POINT('Ctrl Pts',(6.55994135565099,4.39386668910861,14.4532816320322));
#369=CARTESIAN_POINT('Ctrl Pts',(4.33291576155689,5.17320530491209,13.7979949573684));
#370=CARTESIAN_POINT('Ctrl Pts',(0.562150134940811,6.05059546831639,12.9818987716622));
#371=CARTESIAN_POINT('Ctrl Pts',(-0.938573811597789,6.2898877636859,12.7265614513587));
#372=CARTESIAN_POINT('Ctrl Pts',(-2.45522307585072,6.38019184044705,12.6298599324831));
#373=CARTESIAN_POINT('Origin',(-7.5857864376269,-3.45,8.31421356237309));
#374=CARTESIAN_POINT('',(-13.9497474683058,-3.45,14.678174593052));
#375=CARTESIAN_POINT('Origin',(-7.5857864376269,-3.45,8.31421356237309));
#376=CARTESIAN_POINT('',(-12.5814754519511,-3.45,16.0464466094067));
#377=CARTESIAN_POINT('',(-13.9497474683058,-3.45,14.678174593052));
#378=CARTESIAN_POINT('',(13.5814754519511,-3.45,16.7535533905933));
#379=CARTESIAN_POINT('Ctrl Pts',(13.5814754519511,-3.45,16.7535533905933));
#380=CARTESIAN_POINT('Ctrl Pts',(13.5814754519511,-3.45436889007105,16.7535533905933));
#381=CARTESIAN_POINT('Ctrl Pts',(13.5814683572305,-3.45874216030242,16.7535507995334));
#382=CARTESIAN_POINT('Ctrl Pts',(13.5767326094747,-4.91771892133729,16.7518212598922));
#383=CARTESIAN_POINT('Ctrl Pts',(12.7431482526946,-6.25320297848557,16.4460194745435));
#384=CARTESIAN_POINT('Ctrl Pts',(10.7172071809749,-8.22972346323735,15.7274781755634));
#385=CARTESIAN_POINT('Ctrl Pts',(9.53703212580914,-8.97642173133986,15.3180778863327));
#386=CARTESIAN_POINT('Ctrl Pts',(6.84485881405067,-10.3404320106104,14.4331563087529));
#387=CARTESIAN_POINT('Ctrl Pts',(5.30689085238132,-10.9053173478643,13.9546777039673));
#388=CARTESIAN_POINT('Ctrl Pts',(1.50721544389913,-11.9732860194102,12.9280886369633));
#389=CARTESIAN_POINT('Ctrl Pts',(-0.786850329750674,-12.380768177982,12.404701056389));
#390=CARTESIAN_POINT('Ctrl Pts',(-4.47284464705973,-12.4788550872526,12.1965240211233));
#391=CARTESIAN_POINT('Ctrl Pts',(-5.84188323187865,-12.3885522273096,12.2733981458044));
#392=CARTESIAN_POINT('Ctrl Pts',(-8.35226381305068,-11.69714532817,12.9023688816427));
#393=CARTESIAN_POINT('Ctrl Pts',(-9.44206907723989,-11.0821480898845,13.4535845690103));
#394=CARTESIAN_POINT('Ctrl Pts',(-11.2731096988375,-9.17477281172592,14.6996967801163));
#395=CARTESIAN_POINT('Ctrl Pts',(-11.9117938092311,-7.8048017420325,15.3508224495175));
#396=CARTESIAN_POINT('Ctrl Pts',(-12.4764304834652,-5.38228873240289,15.9296455640465));
#397=CARTESIAN_POINT('Ctrl Pts',(-12.5814754519511,-4.416666670184,16.0464466094067));
#398=CARTESIAN_POINT('Ctrl Pts',(-12.5814754519511,-3.45,16.0464466094067));
#399=CARTESIAN_POINT('',(-2.48564875283008,5.51661208377307,12.3190268759129));
#400=CARTESIAN_POINT('Ctrl Pts',(-2.48564875283008,5.51661208377307,12.3190268759129));
#401=CARTESIAN_POINT('Ctrl Pts',(-1.00646113587663,5.43424119630281,12.4495951900852));
#402=CARTESIAN_POINT('Ctrl Pts',(0.461239686453376,5.21597066587577,12.7284635409057));
#403=CARTESIAN_POINT('Ctrl Pts',(4.15345248177794,4.41565899657605,13.5927744097358));
#404=CARTESIAN_POINT('Ctrl Pts',(6.33847547011257,3.70478507231938,14.2657035907293));
#405=CARTESIAN_POINT('Ctrl Pts',(9.60690941860699,2.0360041723931,15.3416927333274));
#406=CARTESIAN_POINT('Ctrl Pts',(10.8126973067117,1.26409813093613,15.7607895895947));
#407=CARTESIAN_POINT('Ctrl Pts',(12.7910054039585,-0.72368033968733,16.4636036196927));
#408=CARTESIAN_POINT('Ctrl Pts',(13.5814754519511,-2.03925474587301,16.7535533905933));
#409=CARTESIAN_POINT('Ctrl Pts',(13.5814754519511,-3.45,16.7535533905933));
#410=CARTESIAN_POINT('Ctrl Pts',(-12.5814754519511,-3.45,16.0464466094067));
#411=CARTESIAN_POINT('Ctrl Pts',(-12.5814754519511,-2.30375985953568,16.0464466094067));
#412=CARTESIAN_POINT('Ctrl Pts',(-12.4334131515925,-1.15667236682503,15.8800463585239));
#413=CARTESIAN_POINT('Ctrl Pts',(-11.6577738204655,1.57723203853342,15.1030138715029));
#414=CARTESIAN_POINT('Ctrl Pts',(-10.7791895182498,3.06827520035853,14.2423454971429));
#415=CARTESIAN_POINT('Ctrl Pts',(-9.02480325192323,4.3474495846475,13.2788542803833));
#416=CARTESIAN_POINT('Ctrl Pts',(-8.56308618583857,4.60495586429481,13.0633340834486));
#417=CARTESIAN_POINT('Ctrl Pts',(-6.39777944336038,5.50436944220504,12.2800118892083));
#418=CARTESIAN_POINT('Ctrl Pts',(-4.4014870917148,5.62329855303145,12.1499152775816));
#419=CARTESIAN_POINT('Ctrl Pts',(-2.48564875283008,5.51661208377307,12.3190268759129));
#420=CARTESIAN_POINT('Ctrl Pts',(-2.4856308309019,5.51659212941567,12.3187163046871));
#421=CARTESIAN_POINT('Ctrl Pts',(-2.49679296629346,5.52894793970706,12.5120788883006));
#422=CARTESIAN_POINT('Ctrl Pts',(-2.50319133760454,5.80544810583134,12.8745122076221));
#423=CARTESIAN_POINT('Ctrl Pts',(-2.47145846510673,6.24826882666919,12.7711288127432));
#424=CARTESIAN_POINT('Ctrl Pts',(-2.45522307585072,6.38019184044705,12.6298599324831));
#425=CARTESIAN_POINT('Ctrl Pts',(-1.00642504218984,5.43419613214691,12.4492992910266));
#426=CARTESIAN_POINT('Ctrl Pts',(-1.02890543392782,5.46219139269324,12.6335314505032));
#427=CARTESIAN_POINT('Ctrl Pts',(-1.03984437946833,5.74554334782798,12.9619991768889));
#428=CARTESIAN_POINT('Ctrl Pts',(-0.97280595892848,6.16270610763427,12.8599671879741));
#429=CARTESIAN_POINT('Ctrl Pts',(-0.938573811597789,6.2898877636859,12.7265614513587));
#430=CARTESIAN_POINT('Ctrl Pts',(0.461278035248989,5.2159039100228,12.7281873518024));
#431=CARTESIAN_POINT('Ctrl Pts',(0.437390940108865,5.25741167127033,12.9001507535882));
#432=CARTESIAN_POINT('Ctrl Pts',(0.433771625627502,5.53925599537951,13.1954616632413));
#433=CARTESIAN_POINT('Ctrl Pts',(0.518912844403568,5.92783515743126,13.1037014949083));
#434=CARTESIAN_POINT('Ctrl Pts',(0.562150134940811,6.05059546831639,12.9818987716622));
#435=CARTESIAN_POINT('Ctrl Pts',(4.15348206329498,4.4155521200763,13.592549735874));
#436=CARTESIAN_POINT('Ctrl Pts',(4.13504953832141,4.48205665617255,13.7324437152974));
#437=CARTESIAN_POINT('Ctrl Pts',(4.15645787764782,4.74524509393212,13.9522439338109));
#438=CARTESIAN_POINT('Ctrl Pts',(4.27377623505472,5.06212361226943,13.8892887189507));
#439=CARTESIAN_POINT('Ctrl Pts',(4.33291576155689,5.17320530491209,13.7979949573684));
#440=CARTESIAN_POINT('Ctrl Pts',(6.33848551485801,3.70466725802343,14.2655123086796));
#441=CARTESIAN_POINT('Ctrl Pts',(6.33221697270986,3.77799166920663,14.3846162285002));
#442=CARTESIAN_POINT('Ctrl Pts',(6.37519211185394,4.01672452263258,14.5662557848901));
#443=CARTESIAN_POINT('Ctrl Pts',(6.49817440961283,4.29053455668114,14.5244446946841));
#444=CARTESIAN_POINT('Ctrl Pts',(6.55994135565099,4.39386668910861,14.4532816320322));
#445=CARTESIAN_POINT('Ctrl Pts',(9.60688517729971,2.03589432528066,15.3415529710795));
#446=CARTESIAN_POINT('Ctrl Pts',(9.62196566810113,2.10427112745336,15.4285782559774));
#447=CARTESIAN_POINT('Ctrl Pts',(9.6958674419939,2.28598632515233,15.5584963879064));
#448=CARTESIAN_POINT('Ctrl Pts',(9.82473987165218,2.48254590141806,15.5474930162174));
#449=CARTESIAN_POINT('Ctrl Pts',(9.88927654875365,2.5643645055987,15.507562112956));
#450=CARTESIAN_POINT('Ctrl Pts',(10.8126586285136,1.26399762596516,15.7606693585273));
#451=CARTESIAN_POINT('Ctrl Pts',(10.8367290203502,1.32656214049947,15.8355330929017));
#452=CARTESIAN_POINT('Ctrl Pts',(10.9220675483657,1.48185486712296,15.9478051079593));
#453=CARTESIAN_POINT('Ctrl Pts',(11.0519295383048,1.64673404290866,15.9481777965639));
#454=CARTESIAN_POINT('Ctrl Pts',(11.1169169655205,1.71811573299325,15.9201440593877));
#455=CARTESIAN_POINT('Ctrl Pts',(12.7940002766342,-0.726817362671413,16.4646025626095));
#456=CARTESIAN_POINT('Ctrl Pts',(12.8336332922731,-0.687074799112461,16.5191693206441));
#457=CARTESIAN_POINT('Ctrl Pts',(12.9374419945036,-0.59825129384611,16.6036570133776));
#458=CARTESIAN_POINT('Ctrl Pts',(13.0683231113899,-0.506775185241539,16.6224920887081));
#459=CARTESIAN_POINT('Ctrl Pts',(13.1337687726382,-0.464476031549955,16.6143670461327));
#460=CARTESIAN_POINT('Ctrl Pts',(13.5859750255131,-2.04744308962315,16.7551495527842));
#461=CARTESIAN_POINT('Ctrl Pts',(13.6323083083483,-2.02665230331618,16.801416446306));
#462=CARTESIAN_POINT('Ctrl Pts',(13.7433259245341,-1.98102770783635,16.8755180703928));
#463=CARTESIAN_POINT('Ctrl Pts',(13.8742334612875,-1.93423280905677,16.9016041482528));
#464=CARTESIAN_POINT('Ctrl Pts',(13.9396834988837,-1.91232538462738,16.9016511978993));
#465=CARTESIAN_POINT('Ctrl Pts',(13.5766583057533,-4.91768397440919,16.7517467969093));
#466=CARTESIAN_POINT('Ctrl Pts',(13.622913536009,-4.93944017166905,16.7981110681658));
#467=CARTESIAN_POINT('Ctrl Pts',(13.7338462042882,-4.98718332336957,16.8723359593232));
#468=CARTESIAN_POINT('Ctrl Pts',(13.8647527199192,-5.03615112036949,16.8983366379269));
#469=CARTESIAN_POINT('Ctrl Pts',(13.9302023691853,-5.05907580586763,16.8982878515399));
#470=CARTESIAN_POINT('Ctrl Pts',(12.7430852736019,-6.25313736371195,16.4459309836458));
#471=CARTESIAN_POINT('Ctrl Pts',(12.7822882489374,-6.2939853309829,16.5010305335965));
#472=CARTESIAN_POINT('Ctrl Pts',(12.8856313542732,-6.38543980896914,16.5861879564386));
#473=CARTESIAN_POINT('Ctrl Pts',(13.0165115755089,-6.47966295861605,16.6045552276319));
#474=CARTESIAN_POINT('Ctrl Pts',(13.0819573854211,-6.52318112892315,16.59590572181));
#475=CARTESIAN_POINT('Ctrl Pts',(10.7171696563688,-8.22962206867634,15.7273563924876));
#476=CARTESIAN_POINT('Ctrl Pts',(10.74052169875,-8.29274012491151,15.8031865259709));
#477=CARTESIAN_POINT('Ctrl Pts',(10.8249605671154,-8.45026451080245,15.9168441156824));
#478=CARTESIAN_POINT('Ctrl Pts',(10.9547468473665,-8.61777482431891,15.9163200526264));
#479=CARTESIAN_POINT('Ctrl Pts',(11.0196996533475,-8.69006148018149,15.8873403635457));
#480=CARTESIAN_POINT('Ctrl Pts',(9.53700866689253,-8.97631153061199,15.3179370086893));
#481=CARTESIAN_POINT('Ctrl Pts',(9.55160197211793,-9.04490823490964,15.4056568050145));
#482=CARTESIAN_POINT('Ctrl Pts',(9.62484005673484,-9.22800631099839,15.5366421869757));
#483=CARTESIAN_POINT('Ctrl Pts',(9.75362035003324,-9.42632160003568,15.524978766049));
#484=CARTESIAN_POINT('Ctrl Pts',(9.81811418801682,-9.50867470374904,15.4843701802688));
#485=CARTESIAN_POINT('Ctrl Pts',(6.84486348633291,-10.3403156551921,14.4329730258063));
#486=CARTESIAN_POINT('Ctrl Pts',(6.84194025103172,-10.4127337289027,14.5470963132323));
#487=CARTESIAN_POINT('Ctrl Pts',(6.88970995416625,-10.6424320144907,14.7207697793731));
#488=CARTESIAN_POINT('Ctrl Pts',(7.01356343178748,-10.904145943543,14.6837334854279));
#489=CARTESIAN_POINT('Ctrl Pts',(7.07573943919783,-11.00405362639,14.6174214628955));
#490=CARTESIAN_POINT('Ctrl Pts',(5.30690947675097,-10.905205954457,13.954470824301));
#491=CARTESIAN_POINT('Ctrl Pts',(5.29529919616047,-10.9745279496552,14.0832858530245));
#492=CARTESIAN_POINT('Ctrl Pts',(5.32840627058309,-11.2235053952738,14.2831817749841));
#493=CARTESIAN_POINT('Ctrl Pts',(5.44811955156533,-11.5168392751869,14.231582011727));
#494=CARTESIAN_POINT('Ctrl Pts',(5.50834121761504,-11.6233434073219,14.1510353440901));
#495=CARTESIAN_POINT('Ctrl Pts',(1.50725530989885,-11.9732037007564,12.9278262153441));
#496=CARTESIAN_POINT('Ctrl Pts',(1.4824217065906,-12.0244060434316,13.0912198717066));
#497=CARTESIAN_POINT('Ctrl Pts',(1.48409565122827,-12.3052431713199,13.3632518725008));
#498=CARTESIAN_POINT('Ctrl Pts',(1.58203114697322,-12.6741578683278,13.2785640669809));
#499=CARTESIAN_POINT('Ctrl Pts',(1.63163563298068,-12.7941687784653,13.1648139478));
#500=CARTESIAN_POINT('Ctrl Pts',(-0.786804750723673,-12.3807187271773,12.4044046708413));
#501=CARTESIAN_POINT('Ctrl Pts',(-0.815192115186347,-12.4114453858,12.5889410970513));
#502=CARTESIAN_POINT('Ctrl Pts',(-0.832081663008863,-12.6989559535027,12.9128352418774));
#503=CARTESIAN_POINT('Ctrl Pts',(-0.752402260209595,-13.1143376053804,12.8065289380507));
#504=CARTESIAN_POINT('Ctrl Pts',(-0.71161564603233,-13.2408957867151,12.672302912156));
#505=CARTESIAN_POINT('Ctrl Pts',(-4.47285672589885,-12.4788694390985,12.196195915333));
#506=CARTESIAN_POINT('Ctrl Pts',(-4.46533370986739,-12.4698585428292,12.4004689266338));
#507=CARTESIAN_POINT('Ctrl Pts',(-4.46129539165452,-12.7345496593526,12.8081740047622));
#508=CARTESIAN_POINT('Ctrl Pts',(-4.48308036950341,-13.2101961806433,12.7066339429891));
#509=CARTESIAN_POINT('Ctrl Pts',(-4.49421599895371,-13.3484295047078,12.5564241518982));
#510=CARTESIAN_POINT('Ctrl Pts',(-5.84193636380361,-12.3885921057949,12.2730653601035));
#511=CARTESIAN_POINT('Ctrl Pts',(-5.80884715929028,-12.3636846243032,12.4802456581658));
#512=CARTESIAN_POINT('Ctrl Pts',(-5.78083985996575,-12.6121099547441,12.9174535248482));
#513=CARTESIAN_POINT('Ctrl Pts',(-5.86170970224144,-13.1064314634317,12.8291580309975));
#514=CARTESIAN_POINT('Ctrl Pts',(-5.90341882570318,-13.2494295224752,12.6779813743637));
#515=CARTESIAN_POINT('Ctrl Pts',(-8.35241398620746,-11.6972017404261,12.902062399746));
#516=CARTESIAN_POINT('Ctrl Pts',(-8.25889245446516,-11.6620032314587,13.0928514372292));
#517=CARTESIAN_POINT('Ctrl Pts',(-8.17050743901522,-11.8801288969042,13.5532404691767));
#518=CARTESIAN_POINT('Ctrl Pts',(-8.38825561762474,-12.3543707901858,13.5454557491202));
#519=CARTESIAN_POINT('Ctrl Pts',(-8.50100361012549,-12.4914328125862,13.4218078555019));
#520=CARTESIAN_POINT('Ctrl Pts',(-9.44226244371641,-11.0821916823949,13.4533070917958));
#521=CARTESIAN_POINT('Ctrl Pts',(-9.32184161565126,-11.0549818074513,13.6260304312328));
#522=CARTESIAN_POINT('Ctrl Pts',(-9.20919895074124,-11.2618565279618,14.0798031835579));
#523=CARTESIAN_POINT('Ctrl Pts',(-9.49069802646527,-11.6927074493337,14.1371307357855));
#524=CARTESIAN_POINT('Ctrl Pts',(-9.63639278963572,-11.8172048235521,14.0416499138928));
#525=CARTESIAN_POINT('Ctrl Pts',(-11.2733422511125,-9.1747858843456,14.6994603781163));
#526=CARTESIAN_POINT('Ctrl Pts',(-11.1285137066051,-9.16659834935339,14.8465990012387));
#527=CARTESIAN_POINT('Ctrl Pts',(-11.009411890525,-9.33232490614177,15.2941078709541));
#528=CARTESIAN_POINT('Ctrl Pts',(-11.3680798997277,-9.63753493525869,15.4673885499579));
#529=CARTESIAN_POINT('Ctrl Pts',(-11.5529098788084,-9.72612909496593,15.4246512828706));
#530=CARTESIAN_POINT('Ctrl Pts',(-11.9120221701429,-7.8048029158633,15.3505940224834));
#531=CARTESIAN_POINT('Ctrl Pts',(-11.7698003143394,-7.80403691509523,15.4927642558877));
#532=CARTESIAN_POINT('Ctrl Pts',(-11.6662913082902,-7.93395465114184,15.942730023679));
#533=CARTESIAN_POINT('Ctrl Pts',(-12.0369835498381,-8.15841814723049,16.1595382066319));
#534=CARTESIAN_POINT('Ctrl Pts',(-12.2274220386408,-8.22421529462208,16.1381283113182));
#535=CARTESIAN_POINT('Ctrl Pts',(-12.7301108626642,-4.29485260089479,16.1892498924798));
#536=CARTESIAN_POINT('Ctrl Pts',(-12.5912758691712,-4.29740231597664,16.3269347082408));
#537=CARTESIAN_POINT('Ctrl Pts',(-12.5068814966481,-4.32442718767724,16.782491276668));
#538=CARTESIAN_POINT('Ctrl Pts',(-12.8935488464656,-4.36419737422121,17.0522388085363));
#539=CARTESIAN_POINT('Ctrl Pts',(-13.0915368100938,-4.37622535883596,17.0569547326723));
#540=CARTESIAN_POINT('Ctrl Pts',(-12.6874062148824,-2.05113988417834,16.1340501615263));
#541=CARTESIAN_POINT('Ctrl Pts',(-12.5478426894859,-2.04788981395135,16.2715794163011));
#542=CARTESIAN_POINT('Ctrl Pts',(-12.4616717083676,-2.00375172272922,16.7263718448373));
#543=CARTESIAN_POINT('Ctrl Pts',(-12.8481665661902,-1.9365600981216,16.9934808728777));
#544=CARTESIAN_POINT('Ctrl Pts',(-13.0461113864656,-1.91640909144407,16.9967988686562));
#545=CARTESIAN_POINT('Ctrl Pts',(-11.5091687797872,2.10183759015973,14.953678853368));
#546=CARTESIAN_POINT('Ctrl Pts',(-11.3660548576284,2.09819427417171,15.0986065627779));
#547=CARTESIAN_POINT('Ctrl Pts',(-11.254227558018,2.26195890601459,15.5464840728948));
#548=CARTESIAN_POINT('Ctrl Pts',(-11.6161237225645,2.55187928119257,15.7370466514879));
#549=CARTESIAN_POINT('Ctrl Pts',(-11.8023515023673,2.63653204418408,15.7028193692164));
#550=CARTESIAN_POINT('Ctrl Pts',(-10.1677421275736,3.93856390747421,13.643484365718));
#551=CARTESIAN_POINT('Ctrl Pts',(-10.0294575686994,3.90783658588511,13.811756494034));
#552=CARTESIAN_POINT('Ctrl Pts',(-9.89866963740921,4.1039121767775,14.272786618898));
#553=CARTESIAN_POINT('Ctrl Pts',(-10.2205862295043,4.52760758613486,14.3531989823762));
#554=CARTESIAN_POINT('Ctrl Pts',(-10.3872777083513,4.65010691667158,14.2655784461918));
#555=CARTESIAN_POINT('Ctrl Pts',(-6.39785381876401,5.50442187734902,12.279677202175));
#556=CARTESIAN_POINT('Ctrl Pts',(-6.3515355977719,5.47169442781993,12.4880385314168));
#557=CARTESIAN_POINT('Ctrl Pts',(-6.30904913694709,5.71350879386458,12.9377099066194));
#558=CARTESIAN_POINT('Ctrl Pts',(-6.41838984328201,6.22025947950669,12.8535497481997));
#559=CARTESIAN_POINT('Ctrl Pts',(-6.47494031370951,6.36677010276919,12.7010790437103));
#560=CARTESIAN_POINT('Ctrl Pts',(-4.40149270578126,5.62331112079232,12.1495857030191));
#561=CARTESIAN_POINT('Ctrl Pts',(-4.39799547735089,5.61541077286953,12.3547739782562));
#562=CARTESIAN_POINT('Ctrl Pts',(-4.39851291368823,5.88303652717092,12.7611994081142));
#563=CARTESIAN_POINT('Ctrl Pts',(-4.41250765663217,6.35908934438277,12.6560656772213));
#564=CARTESIAN_POINT('Ctrl Pts',(-4.41958160197303,6.49715334717798,12.504612482351));
#565=CARTESIAN_POINT('Ctrl Pts',(-2.4856308309019,5.51659212941567,12.3187163046871));
#566=CARTESIAN_POINT('Ctrl Pts',(-2.49679296629346,5.52894793970706,12.5120788883006));
#567=CARTESIAN_POINT('Ctrl Pts',(-2.50319133760454,5.80544810583134,12.8745122076221));
#568=CARTESIAN_POINT('Ctrl Pts',(-2.47145846510673,6.24826882666919,12.7711288127432));
#569=CARTESIAN_POINT('Ctrl Pts',(-2.45522307585072,6.38019184044705,12.6298599324831));
#570=CARTESIAN_POINT('Ctrl Pts',(-2.45522307585072,6.38019184044705,12.6298599324831));
#571=CARTESIAN_POINT('Ctrl Pts',(-2.47145846510673,6.24826882666919,12.7711288127432));
#572=CARTESIAN_POINT('Ctrl Pts',(-2.50318284036699,5.80556668169794,12.874484524239));
#573=CARTESIAN_POINT('Ctrl Pts',(-2.49679639019403,5.52909603073233,12.5122729553246));
#574=CARTESIAN_POINT('Ctrl Pts',(-2.48564875283008,5.51661208377307,12.3190268759129));
#575=CARTESIAN_POINT('Origin',(-7.5857864376269,-3.45,8.31421356237309));
#576=CARTESIAN_POINT('Origin',(-6.17449493661166,-3.45,-7.23921356237309));
#577=CARTESIAN_POINT('Origin',(-14.6568542494924,-3.45,1.24314575050762));
#578=CARTESIAN_POINT('Origin',(13.,-3.45,28.9));
#579=CARTESIAN_POINT('Origin',(25.,10.,-10.));
#580=UNCERTAINTY_MEASURE_WITH_UNIT(LENGTH_MEASURE(0.01),#584,
'DISTANCE_ACCURACY_VALUE',
'Maximum model space distance between geometric entities at asserted c
onnectivities');
#581=UNCERTAINTY_MEASURE_WITH_UNIT(LENGTH_MEASURE(0.01),#584,
'DISTANCE_ACCURACY_VALUE',
'Maximum model space distance between geometric entities at asserted c
onnectivities');
#582=(
GEOMETRIC_REPRESENTATION_CONTEXT(3)
GLOBAL_UNCERTAINTY_ASSIGNED_CONTEXT((#580))
GLOBAL_UNIT_ASSIGNED_CONTEXT((#584,#586,#587))
REPRESENTATION_CONTEXT('','3D')
);
#583=(
GEOMETRIC_REPRESENTATION_CONTEXT(3)
GLOBAL_UNCERTAINTY_ASSIGNED_CONTEXT((#581))
GLOBAL_UNIT_ASSIGNED_CONTEXT((#584,#586,#587))
REPRESENTATION_CONTEXT('','3D')
);
#584=(
LENGTH_UNIT()
NAMED_UNIT(*)
SI_UNIT(.MILLI.,.METRE.)
);
#585=(
LENGTH_UNIT()
NAMED_UNIT(*)
SI_UNIT(.CENTI.,.METRE.)
);
#586=(
NAMED_UNIT(*)
PLANE_ANGLE_UNIT()
SI_UNIT($,.RADIAN.)
);
#587=(
NAMED_UNIT(*)
SI_UNIT($,.STERADIAN.)
SOLID_ANGLE_UNIT()
);
#588=SHAPE_DEFINITION_REPRESENTATION(#589,#590);
#589=PRODUCT_DEFINITION_SHAPE('',$,#592);
#590=SHAPE_REPRESENTATION('',(#219),#582);
#591=PRODUCT_DEFINITION_CONTEXT('part definition',#596,'design');
#592=PRODUCT_DEFINITION('VERBINDUNGSSTUECK','VERBINDUNGSSTUECK',#593,#591);
#593=PRODUCT_DEFINITION_FORMATION('None',$,#598);
#594=PRODUCT_RELATED_PRODUCT_CATEGORY('VERBINDUNGSSTUECK',
'VERBINDUNGSSTUECK',(#598));
#595=APPLICATION_PROTOCOL_DEFINITION('international standard',
'automotive_design',2009,#596);
#596=APPLICATION_CONTEXT(
'Core Data for Automotive Mechanical Design Process');
#597=PRODUCT_CONTEXT('part definition',#596,'mechanical');
#598=PRODUCT('VERBINDUNGSSTUECK','VERBINDUNGSSTUECK',$,(#597));
#599=PRESENTATION_STYLE_ASSIGNMENT((#600));
#600=SURFACE_STYLE_USAGE(.BOTH.,#603);
#601=SURFACE_STYLE_RENDERING_WITH_PROPERTIES($,#607,(#602));
#602=SURFACE_STYLE_TRANSPARENT(0.);
#603=SURFACE_SIDE_STYLE('',(#604,#601));
#604=SURFACE_STYLE_FILL_AREA(#605);
#605=FILL_AREA_STYLE('',(#606));
#606=FILL_AREA_STYLE_COLOUR('',#607);
#607=COLOUR_RGB('',0.749019607843137,0.749019607843137,0.749019607843137);
ENDSEC;
END-ISO-10303-21;
