ISO-10303-21;
HEADER;
/* Generated by software containing ST-Developer
 * from STEP Tools, Inc. (www.steptools.com) 
 */

FILE_DESCRIPTION(
/* description */ (''),
/* implementation_level */ '2;1');

FILE_NAME(
/* name */ 
'C:\\Users\\Kacper\\MATLAB\\Projects\\release_mechanism\\models\\capsu
le\\\\STECKER_1_ipt_ae620b41.STEP',
/* time_stamp */ '2020-08-13T22:35:45+02:00',
/* author */ ('Kacper'),
/* organization */ (''),
/* preprocessor_version */ 'ST-DEVELOPER v18.1',
/* originating_system */ 'Autodesk Inventor 2021',
/* authorisation */ '');

FILE_SCHEMA (('AUTOMOTIVE_DESIGN { 1 0 10303 214 3 1 1 }'));
ENDSEC;

DATA;
#10=MECHANICAL_DESIGN_GEOMETRIC_PRESENTATION_REPRESENTATION('',(#13),#637);
#11=SHAPE_REPRESENTATION_RELATIONSHIP('SRR','None',#644,#12);
#12=ADVANCED_BREP_SHAPE_REPRESENTATION('',(#14),#636);
#13=STYLED_ITEM('',(#653),#14);
#14=MANIFOLD_SOLID_BREP('Solid1',#357);
#15=FACE_BOUND('',#66,.T.);
#16=FACE_BOUND('',#69,.T.);
#17=FACE_BOUND('',#70,.T.);
#18=FACE_BOUND('',#71,.T.);
#19=FACE_BOUND('',#73,.T.);
#20=FACE_BOUND('',#74,.T.);
#21=FACE_BOUND('',#75,.T.);
#22=FACE_BOUND('',#85,.T.);
#23=PLANE('',#399);
#24=PLANE('',#400);
#25=PLANE('',#401);
#26=PLANE('',#406);
#27=PLANE('',#411);
#28=PLANE('',#413);
#29=PLANE('',#415);
#30=PLANE('',#417);
#31=PLANE('',#419);
#32=PLANE('',#420);
#33=CONICAL_SURFACE('',#386,2.45,0.785398163397448);
#34=CONICAL_SURFACE('',#391,2.45,0.785398163397448);
#35=FACE_OUTER_BOUND('',#57,.T.);
#36=FACE_OUTER_BOUND('',#58,.T.);
#37=FACE_OUTER_BOUND('',#59,.T.);
#38=FACE_OUTER_BOUND('',#60,.T.);
#39=FACE_OUTER_BOUND('',#61,.T.);
#40=FACE_OUTER_BOUND('',#62,.T.);
#41=FACE_OUTER_BOUND('',#63,.T.);
#42=FACE_OUTER_BOUND('',#64,.T.);
#43=FACE_OUTER_BOUND('',#65,.T.);
#44=FACE_OUTER_BOUND('',#67,.T.);
#45=FACE_OUTER_BOUND('',#68,.T.);
#46=FACE_OUTER_BOUND('',#72,.T.);
#47=FACE_OUTER_BOUND('',#76,.T.);
#48=FACE_OUTER_BOUND('',#77,.T.);
#49=FACE_OUTER_BOUND('',#78,.T.);
#50=FACE_OUTER_BOUND('',#79,.T.);
#51=FACE_OUTER_BOUND('',#80,.T.);
#52=FACE_OUTER_BOUND('',#81,.T.);
#53=FACE_OUTER_BOUND('',#82,.T.);
#54=FACE_OUTER_BOUND('',#83,.T.);
#55=FACE_OUTER_BOUND('',#84,.T.);
#56=FACE_OUTER_BOUND('',#86,.T.);
#57=EDGE_LOOP('',(#233,#234,#235,#236));
#58=EDGE_LOOP('',(#237,#238,#239,#240));
#59=EDGE_LOOP('',(#241,#242,#243,#244));
#60=EDGE_LOOP('',(#245,#246,#247,#248));
#61=EDGE_LOOP('',(#249,#250,#251,#252));
#62=EDGE_LOOP('',(#253,#254,#255,#256));
#63=EDGE_LOOP('',(#257,#258,#259,#260));
#64=EDGE_LOOP('',(#261,#262,#263,#264));
#65=EDGE_LOOP('',(#265));
#66=EDGE_LOOP('',(#266));
#67=EDGE_LOOP('',(#267));
#68=EDGE_LOOP('',(#268,#269,#270,#271,#272,#273,#274,#275));
#69=EDGE_LOOP('',(#276));
#70=EDGE_LOOP('',(#277));
#71=EDGE_LOOP('',(#278));
#72=EDGE_LOOP('',(#279,#280,#281,#282,#283,#284,#285,#286));
#73=EDGE_LOOP('',(#287));
#74=EDGE_LOOP('',(#288));
#75=EDGE_LOOP('',(#289));
#76=EDGE_LOOP('',(#290,#291,#292,#293));
#77=EDGE_LOOP('',(#294,#295,#296,#297));
#78=EDGE_LOOP('',(#298,#299,#300,#301));
#79=EDGE_LOOP('',(#302,#303,#304,#305));
#80=EDGE_LOOP('',(#306,#307,#308,#309));
#81=EDGE_LOOP('',(#310,#311,#312,#313));
#82=EDGE_LOOP('',(#314,#315,#316,#317));
#83=EDGE_LOOP('',(#318,#319,#320,#321));
#84=EDGE_LOOP('',(#322));
#85=EDGE_LOOP('',(#323));
#86=EDGE_LOOP('',(#324));
#87=LINE('',#540,#111);
#88=LINE('',#546,#112);
#89=LINE('',#552,#113);
#90=LINE('',#556,#114);
#91=LINE('',#562,#115);
#92=LINE('',#566,#116);
#93=LINE('',#572,#117);
#94=LINE('',#578,#118);
#95=LINE('',#585,#119);
#96=LINE('',#589,#120);
#97=LINE('',#593,#121);
#98=LINE('',#597,#122);
#99=LINE('',#604,#123);
#100=LINE('',#608,#124);
#101=LINE('',#612,#125);
#102=LINE('',#615,#126);
#103=LINE('',#617,#127);
#104=LINE('',#618,#128);
#105=LINE('',#620,#129);
#106=LINE('',#622,#130);
#107=LINE('',#624,#131);
#108=LINE('',#626,#132);
#109=LINE('',#628,#133);
#110=LINE('',#630,#134);
#111=VECTOR('',#427,11.75);
#112=VECTOR('',#434,11.75);
#113=VECTOR('',#441,1.8);
#114=VECTOR('',#446,2.45);
#115=VECTOR('',#453,1.8);
#116=VECTOR('',#458,2.45);
#117=VECTOR('',#465,6.);
#118=VECTOR('',#472,9.);
#119=VECTOR('',#481,25.);
#120=VECTOR('',#484,20.);
#121=VECTOR('',#487,25.);
#122=VECTOR('',#490,20.);
#123=VECTOR('',#497,25.);
#124=VECTOR('',#500,20.);
#125=VECTOR('',#503,25.);
#126=VECTOR('',#506,20.);
#127=VECTOR('',#509,4.5);
#128=VECTOR('',#510,4.5);
#129=VECTOR('',#513,4.5);
#130=VECTOR('',#516,4.5);
#131=VECTOR('',#519,4.5);
#132=VECTOR('',#522,4.5);
#133=VECTOR('',#525,4.5);
#134=VECTOR('',#528,4.5);
#135=CIRCLE('',#378,11.75);
#136=CIRCLE('',#379,11.75);
#137=CIRCLE('',#381,11.75);
#138=CIRCLE('',#382,11.75);
#139=CIRCLE('',#384,1.8);
#140=CIRCLE('',#385,1.8);
#141=CIRCLE('',#387,3.1);
#142=CIRCLE('',#389,1.8);
#143=CIRCLE('',#390,1.8);
#144=CIRCLE('',#392,3.1);
#145=CIRCLE('',#394,6.);
#146=CIRCLE('',#395,6.);
#147=CIRCLE('',#397,9.);
#148=CIRCLE('',#398,9.);
#149=CIRCLE('',#402,3.);
#150=CIRCLE('',#403,3.);
#151=CIRCLE('',#404,3.);
#152=CIRCLE('',#405,3.);
#153=CIRCLE('',#407,3.);
#154=CIRCLE('',#408,3.);
#155=CIRCLE('',#409,3.);
#156=CIRCLE('',#410,3.);
#157=VERTEX_POINT('',#537);
#158=VERTEX_POINT('',#539);
#159=VERTEX_POINT('',#543);
#160=VERTEX_POINT('',#545);
#161=VERTEX_POINT('',#549);
#162=VERTEX_POINT('',#551);
#163=VERTEX_POINT('',#555);
#164=VERTEX_POINT('',#559);
#165=VERTEX_POINT('',#561);
#166=VERTEX_POINT('',#565);
#167=VERTEX_POINT('',#569);
#168=VERTEX_POINT('',#571);
#169=VERTEX_POINT('',#575);
#170=VERTEX_POINT('',#577);
#171=VERTEX_POINT('',#583);
#172=VERTEX_POINT('',#584);
#173=VERTEX_POINT('',#586);
#174=VERTEX_POINT('',#588);
#175=VERTEX_POINT('',#590);
#176=VERTEX_POINT('',#592);
#177=VERTEX_POINT('',#594);
#178=VERTEX_POINT('',#596);
#179=VERTEX_POINT('',#600);
#180=VERTEX_POINT('',#601);
#181=VERTEX_POINT('',#603);
#182=VERTEX_POINT('',#605);
#183=VERTEX_POINT('',#607);
#184=VERTEX_POINT('',#609);
#185=VERTEX_POINT('',#611);
#186=VERTEX_POINT('',#613);
#187=EDGE_CURVE('',#157,#157,#135,.T.);
#188=EDGE_CURVE('',#157,#158,#87,.T.);
#189=EDGE_CURVE('',#158,#158,#136,.T.);
#190=EDGE_CURVE('',#159,#159,#137,.T.);
#191=EDGE_CURVE('',#159,#160,#88,.T.);
#192=EDGE_CURVE('',#160,#160,#138,.T.);
#193=EDGE_CURVE('',#161,#161,#139,.T.);
#194=EDGE_CURVE('',#161,#162,#89,.T.);
#195=EDGE_CURVE('',#162,#162,#140,.T.);
#196=EDGE_CURVE('',#161,#163,#90,.T.);
#197=EDGE_CURVE('',#163,#163,#141,.T.);
#198=EDGE_CURVE('',#164,#164,#142,.T.);
#199=EDGE_CURVE('',#164,#165,#91,.T.);
#200=EDGE_CURVE('',#165,#165,#143,.T.);
#201=EDGE_CURVE('',#164,#166,#92,.T.);
#202=EDGE_CURVE('',#166,#166,#144,.T.);
#203=EDGE_CURVE('',#167,#167,#145,.T.);
#204=EDGE_CURVE('',#167,#168,#93,.T.);
#205=EDGE_CURVE('',#168,#168,#146,.T.);
#206=EDGE_CURVE('',#169,#169,#147,.T.);
#207=EDGE_CURVE('',#169,#170,#94,.T.);
#208=EDGE_CURVE('',#170,#170,#148,.T.);
#209=EDGE_CURVE('',#171,#172,#95,.T.);
#210=EDGE_CURVE('',#173,#171,#149,.T.);
#211=EDGE_CURVE('',#174,#173,#96,.T.);
#212=EDGE_CURVE('',#175,#174,#150,.T.);
#213=EDGE_CURVE('',#176,#175,#97,.T.);
#214=EDGE_CURVE('',#177,#176,#151,.T.);
#215=EDGE_CURVE('',#178,#177,#98,.T.);
#216=EDGE_CURVE('',#172,#178,#152,.T.);
#217=EDGE_CURVE('',#179,#180,#153,.T.);
#218=EDGE_CURVE('',#180,#181,#99,.T.);
#219=EDGE_CURVE('',#181,#182,#154,.T.);
#220=EDGE_CURVE('',#182,#183,#100,.T.);
#221=EDGE_CURVE('',#183,#184,#155,.T.);
#222=EDGE_CURVE('',#184,#185,#101,.T.);
#223=EDGE_CURVE('',#185,#186,#156,.T.);
#224=EDGE_CURVE('',#186,#179,#102,.T.);
#225=EDGE_CURVE('',#181,#172,#103,.T.);
#226=EDGE_CURVE('',#180,#171,#104,.T.);
#227=EDGE_CURVE('',#182,#178,#105,.T.);
#228=EDGE_CURVE('',#183,#177,#106,.T.);
#229=EDGE_CURVE('',#184,#176,#107,.T.);
#230=EDGE_CURVE('',#185,#175,#108,.T.);
#231=EDGE_CURVE('',#186,#174,#109,.T.);
#232=EDGE_CURVE('',#179,#173,#110,.T.);
#233=ORIENTED_EDGE('',*,*,#187,.T.);
#234=ORIENTED_EDGE('',*,*,#188,.T.);
#235=ORIENTED_EDGE('',*,*,#189,.T.);
#236=ORIENTED_EDGE('',*,*,#188,.F.);
#237=ORIENTED_EDGE('',*,*,#190,.T.);
#238=ORIENTED_EDGE('',*,*,#191,.T.);
#239=ORIENTED_EDGE('',*,*,#192,.T.);
#240=ORIENTED_EDGE('',*,*,#191,.F.);
#241=ORIENTED_EDGE('',*,*,#193,.F.);
#242=ORIENTED_EDGE('',*,*,#194,.T.);
#243=ORIENTED_EDGE('',*,*,#195,.F.);
#244=ORIENTED_EDGE('',*,*,#194,.F.);
#245=ORIENTED_EDGE('',*,*,#193,.T.);
#246=ORIENTED_EDGE('',*,*,#196,.T.);
#247=ORIENTED_EDGE('',*,*,#197,.F.);
#248=ORIENTED_EDGE('',*,*,#196,.F.);
#249=ORIENTED_EDGE('',*,*,#198,.F.);
#250=ORIENTED_EDGE('',*,*,#199,.T.);
#251=ORIENTED_EDGE('',*,*,#200,.F.);
#252=ORIENTED_EDGE('',*,*,#199,.F.);
#253=ORIENTED_EDGE('',*,*,#198,.T.);
#254=ORIENTED_EDGE('',*,*,#201,.T.);
#255=ORIENTED_EDGE('',*,*,#202,.F.);
#256=ORIENTED_EDGE('',*,*,#201,.F.);
#257=ORIENTED_EDGE('',*,*,#203,.F.);
#258=ORIENTED_EDGE('',*,*,#204,.T.);
#259=ORIENTED_EDGE('',*,*,#205,.F.);
#260=ORIENTED_EDGE('',*,*,#204,.F.);
#261=ORIENTED_EDGE('',*,*,#206,.F.);
#262=ORIENTED_EDGE('',*,*,#207,.T.);
#263=ORIENTED_EDGE('',*,*,#208,.F.);
#264=ORIENTED_EDGE('',*,*,#207,.F.);
#265=ORIENTED_EDGE('',*,*,#208,.T.);
#266=ORIENTED_EDGE('',*,*,#203,.T.);
#267=ORIENTED_EDGE('',*,*,#205,.T.);
#268=ORIENTED_EDGE('',*,*,#209,.F.);
#269=ORIENTED_EDGE('',*,*,#210,.F.);
#270=ORIENTED_EDGE('',*,*,#211,.F.);
#271=ORIENTED_EDGE('',*,*,#212,.F.);
#272=ORIENTED_EDGE('',*,*,#213,.F.);
#273=ORIENTED_EDGE('',*,*,#214,.F.);
#274=ORIENTED_EDGE('',*,*,#215,.F.);
#275=ORIENTED_EDGE('',*,*,#216,.F.);
#276=ORIENTED_EDGE('',*,*,#200,.T.);
#277=ORIENTED_EDGE('',*,*,#195,.T.);
#278=ORIENTED_EDGE('',*,*,#187,.F.);
#279=ORIENTED_EDGE('',*,*,#217,.T.);
#280=ORIENTED_EDGE('',*,*,#218,.T.);
#281=ORIENTED_EDGE('',*,*,#219,.T.);
#282=ORIENTED_EDGE('',*,*,#220,.T.);
#283=ORIENTED_EDGE('',*,*,#221,.T.);
#284=ORIENTED_EDGE('',*,*,#222,.T.);
#285=ORIENTED_EDGE('',*,*,#223,.T.);
#286=ORIENTED_EDGE('',*,*,#224,.T.);
#287=ORIENTED_EDGE('',*,*,#202,.T.);
#288=ORIENTED_EDGE('',*,*,#197,.T.);
#289=ORIENTED_EDGE('',*,*,#192,.F.);
#290=ORIENTED_EDGE('',*,*,#209,.T.);
#291=ORIENTED_EDGE('',*,*,#225,.F.);
#292=ORIENTED_EDGE('',*,*,#218,.F.);
#293=ORIENTED_EDGE('',*,*,#226,.T.);
#294=ORIENTED_EDGE('',*,*,#216,.T.);
#295=ORIENTED_EDGE('',*,*,#227,.F.);
#296=ORIENTED_EDGE('',*,*,#219,.F.);
#297=ORIENTED_EDGE('',*,*,#225,.T.);
#298=ORIENTED_EDGE('',*,*,#215,.T.);
#299=ORIENTED_EDGE('',*,*,#228,.F.);
#300=ORIENTED_EDGE('',*,*,#220,.F.);
#301=ORIENTED_EDGE('',*,*,#227,.T.);
#302=ORIENTED_EDGE('',*,*,#214,.T.);
#303=ORIENTED_EDGE('',*,*,#229,.F.);
#304=ORIENTED_EDGE('',*,*,#221,.F.);
#305=ORIENTED_EDGE('',*,*,#228,.T.);
#306=ORIENTED_EDGE('',*,*,#213,.T.);
#307=ORIENTED_EDGE('',*,*,#230,.F.);
#308=ORIENTED_EDGE('',*,*,#222,.F.);
#309=ORIENTED_EDGE('',*,*,#229,.T.);
#310=ORIENTED_EDGE('',*,*,#212,.T.);
#311=ORIENTED_EDGE('',*,*,#231,.F.);
#312=ORIENTED_EDGE('',*,*,#223,.F.);
#313=ORIENTED_EDGE('',*,*,#230,.T.);
#314=ORIENTED_EDGE('',*,*,#211,.T.);
#315=ORIENTED_EDGE('',*,*,#232,.F.);
#316=ORIENTED_EDGE('',*,*,#224,.F.);
#317=ORIENTED_EDGE('',*,*,#231,.T.);
#318=ORIENTED_EDGE('',*,*,#210,.T.);
#319=ORIENTED_EDGE('',*,*,#226,.F.);
#320=ORIENTED_EDGE('',*,*,#217,.F.);
#321=ORIENTED_EDGE('',*,*,#232,.T.);
#322=ORIENTED_EDGE('',*,*,#190,.F.);
#323=ORIENTED_EDGE('',*,*,#206,.T.);
#324=ORIENTED_EDGE('',*,*,#189,.F.);
#325=CYLINDRICAL_SURFACE('',#377,11.75);
#326=CYLINDRICAL_SURFACE('',#380,11.75);
#327=CYLINDRICAL_SURFACE('',#383,1.8);
#328=CYLINDRICAL_SURFACE('',#388,1.8);
#329=CYLINDRICAL_SURFACE('',#393,6.);
#330=CYLINDRICAL_SURFACE('',#396,9.);
#331=CYLINDRICAL_SURFACE('',#412,3.);
#332=CYLINDRICAL_SURFACE('',#414,3.);
#333=CYLINDRICAL_SURFACE('',#416,3.);
#334=CYLINDRICAL_SURFACE('',#418,3.);
#335=ADVANCED_FACE('',(#35),#325,.T.);
#336=ADVANCED_FACE('',(#36),#326,.T.);
#337=ADVANCED_FACE('',(#37),#327,.F.);
#338=ADVANCED_FACE('',(#38),#33,.F.);
#339=ADVANCED_FACE('',(#39),#328,.F.);
#340=ADVANCED_FACE('',(#40),#34,.F.);
#341=ADVANCED_FACE('',(#41),#329,.T.);
#342=ADVANCED_FACE('',(#42),#330,.F.);
#343=ADVANCED_FACE('',(#43,#15),#23,.T.);
#344=ADVANCED_FACE('',(#44),#24,.T.);
#345=ADVANCED_FACE('',(#45,#16,#17,#18),#25,.F.);
#346=ADVANCED_FACE('',(#46,#19,#20,#21),#26,.T.);
#347=ADVANCED_FACE('',(#47),#27,.T.);
#348=ADVANCED_FACE('',(#48),#331,.T.);
#349=ADVANCED_FACE('',(#49),#28,.T.);
#350=ADVANCED_FACE('',(#50),#332,.T.);
#351=ADVANCED_FACE('',(#51),#29,.T.);
#352=ADVANCED_FACE('',(#52),#333,.T.);
#353=ADVANCED_FACE('',(#53),#30,.T.);
#354=ADVANCED_FACE('',(#54),#334,.T.);
#355=ADVANCED_FACE('',(#55,#22),#31,.T.);
#356=ADVANCED_FACE('',(#56),#32,.F.);
#357=CLOSED_SHELL('',(#335,#336,#337,#338,#339,#340,#341,#342,#343,#344,
#345,#346,#347,#348,#349,#350,#351,#352,#353,#354,#355,#356));
#358=DERIVED_UNIT_ELEMENT(#360,1.);
#359=DERIVED_UNIT_ELEMENT(#639,3.);
#360=(
MASS_UNIT()
NAMED_UNIT(*)
SI_UNIT($,.GRAM.)
);
#361=DERIVED_UNIT((#358,#359));
#362=MEASURE_REPRESENTATION_ITEM('density measure',
POSITIVE_RATIO_MEASURE(1.),#361);
#363=PROPERTY_DEFINITION_REPRESENTATION(#368,#365);
#364=PROPERTY_DEFINITION_REPRESENTATION(#369,#366);
#365=REPRESENTATION('material name',(#367),#636);
#366=REPRESENTATION('density',(#362),#636);
#367=DESCRIPTIVE_REPRESENTATION_ITEM('Generic','Generic');
#368=PROPERTY_DEFINITION('material property','material name',#646);
#369=PROPERTY_DEFINITION('material property','density of part',#646);
#370=DATE_TIME_ROLE('creation_date');
#371=APPLIED_DATE_AND_TIME_ASSIGNMENT(#372,#370,(#646));
#372=DATE_AND_TIME(#373,#374);
#373=CALENDAR_DATE(1996,29,5);
#374=LOCAL_TIME(12,0,0.,#375);
#375=COORDINATED_UNIVERSAL_TIME_OFFSET(0,0,.BEHIND.);
#376=AXIS2_PLACEMENT_3D('placement',#535,#421,#422);
#377=AXIS2_PLACEMENT_3D('',#536,#423,#424);
#378=AXIS2_PLACEMENT_3D('',#538,#425,#426);
#379=AXIS2_PLACEMENT_3D('',#541,#428,#429);
#380=AXIS2_PLACEMENT_3D('',#542,#430,#431);
#381=AXIS2_PLACEMENT_3D('',#544,#432,#433);
#382=AXIS2_PLACEMENT_3D('',#547,#435,#436);
#383=AXIS2_PLACEMENT_3D('',#548,#437,#438);
#384=AXIS2_PLACEMENT_3D('',#550,#439,#440);
#385=AXIS2_PLACEMENT_3D('',#553,#442,#443);
#386=AXIS2_PLACEMENT_3D('',#554,#444,#445);
#387=AXIS2_PLACEMENT_3D('',#557,#447,#448);
#388=AXIS2_PLACEMENT_3D('',#558,#449,#450);
#389=AXIS2_PLACEMENT_3D('',#560,#451,#452);
#390=AXIS2_PLACEMENT_3D('',#563,#454,#455);
#391=AXIS2_PLACEMENT_3D('',#564,#456,#457);
#392=AXIS2_PLACEMENT_3D('',#567,#459,#460);
#393=AXIS2_PLACEMENT_3D('',#568,#461,#462);
#394=AXIS2_PLACEMENT_3D('',#570,#463,#464);
#395=AXIS2_PLACEMENT_3D('',#573,#466,#467);
#396=AXIS2_PLACEMENT_3D('',#574,#468,#469);
#397=AXIS2_PLACEMENT_3D('',#576,#470,#471);
#398=AXIS2_PLACEMENT_3D('',#579,#473,#474);
#399=AXIS2_PLACEMENT_3D('',#580,#475,#476);
#400=AXIS2_PLACEMENT_3D('',#581,#477,#478);
#401=AXIS2_PLACEMENT_3D('',#582,#479,#480);
#402=AXIS2_PLACEMENT_3D('',#587,#482,#483);
#403=AXIS2_PLACEMENT_3D('',#591,#485,#486);
#404=AXIS2_PLACEMENT_3D('',#595,#488,#489);
#405=AXIS2_PLACEMENT_3D('',#598,#491,#492);
#406=AXIS2_PLACEMENT_3D('',#599,#493,#494);
#407=AXIS2_PLACEMENT_3D('',#602,#495,#496);
#408=AXIS2_PLACEMENT_3D('',#606,#498,#499);
#409=AXIS2_PLACEMENT_3D('',#610,#501,#502);
#410=AXIS2_PLACEMENT_3D('',#614,#504,#505);
#411=AXIS2_PLACEMENT_3D('',#616,#507,#508);
#412=AXIS2_PLACEMENT_3D('',#619,#511,#512);
#413=AXIS2_PLACEMENT_3D('',#621,#514,#515);
#414=AXIS2_PLACEMENT_3D('',#623,#517,#518);
#415=AXIS2_PLACEMENT_3D('',#625,#520,#521);
#416=AXIS2_PLACEMENT_3D('',#627,#523,#524);
#417=AXIS2_PLACEMENT_3D('',#629,#526,#527);
#418=AXIS2_PLACEMENT_3D('',#631,#529,#530);
#419=AXIS2_PLACEMENT_3D('',#632,#531,#532);
#420=AXIS2_PLACEMENT_3D('',#633,#533,#534);
#421=DIRECTION('axis',(0.,0.,1.));
#422=DIRECTION('refdir',(1.,0.,0.));
#423=DIRECTION('center_axis',(1.,0.,0.));
#424=DIRECTION('ref_axis',(0.,0.,-1.));
#425=DIRECTION('center_axis',(-1.,0.,0.));
#426=DIRECTION('ref_axis',(0.,0.,-1.));
#427=DIRECTION('',(-1.,0.,0.));
#428=DIRECTION('center_axis',(1.,0.,0.));
#429=DIRECTION('ref_axis',(0.,0.,-1.));
#430=DIRECTION('center_axis',(1.,0.,0.));
#431=DIRECTION('ref_axis',(0.,0.,-1.));
#432=DIRECTION('center_axis',(-1.,0.,0.));
#433=DIRECTION('ref_axis',(0.,0.,-1.));
#434=DIRECTION('',(-1.,0.,0.));
#435=DIRECTION('center_axis',(1.,0.,0.));
#436=DIRECTION('ref_axis',(0.,0.,-1.));
#437=DIRECTION('center_axis',(-1.,0.,0.));
#438=DIRECTION('ref_axis',(0.,0.,-1.));
#439=DIRECTION('center_axis',(-1.,0.,0.));
#440=DIRECTION('ref_axis',(0.,0.,-1.));
#441=DIRECTION('',(-1.,0.,0.));
#442=DIRECTION('center_axis',(1.,0.,0.));
#443=DIRECTION('ref_axis',(0.,0.,-1.));
#444=DIRECTION('center_axis',(1.,0.,0.));
#445=DIRECTION('ref_axis',(0.,0.,-1.));
#446=DIRECTION('',(0.707106781186548,-8.65956056235493E-17,0.707106781186548));
#447=DIRECTION('center_axis',(-1.,0.,0.));
#448=DIRECTION('ref_axis',(0.,0.,-1.));
#449=DIRECTION('center_axis',(-1.,0.,0.));
#450=DIRECTION('ref_axis',(0.,0.,-1.));
#451=DIRECTION('center_axis',(-1.,0.,0.));
#452=DIRECTION('ref_axis',(0.,0.,-1.));
#453=DIRECTION('',(-1.,0.,0.));
#454=DIRECTION('center_axis',(1.,0.,0.));
#455=DIRECTION('ref_axis',(0.,0.,-1.));
#456=DIRECTION('center_axis',(1.,0.,0.));
#457=DIRECTION('ref_axis',(0.,0.,-1.));
#458=DIRECTION('',(0.707106781186548,-8.65956056235493E-17,0.707106781186548));
#459=DIRECTION('center_axis',(-1.,0.,0.));
#460=DIRECTION('ref_axis',(0.,0.,-1.));
#461=DIRECTION('center_axis',(-1.,0.,0.));
#462=DIRECTION('ref_axis',(0.,1.,0.));
#463=DIRECTION('center_axis',(-1.,0.,0.));
#464=DIRECTION('ref_axis',(0.,1.,0.));
#465=DIRECTION('',(1.,0.,0.));
#466=DIRECTION('center_axis',(1.,0.,0.));
#467=DIRECTION('ref_axis',(0.,1.,0.));
#468=DIRECTION('center_axis',(-1.,0.,0.));
#469=DIRECTION('ref_axis',(0.,1.,0.));
#470=DIRECTION('center_axis',(-1.,0.,0.));
#471=DIRECTION('ref_axis',(0.,1.,0.));
#472=DIRECTION('',(-1.,0.,0.));
#473=DIRECTION('center_axis',(1.,0.,0.));
#474=DIRECTION('ref_axis',(0.,1.,0.));
#475=DIRECTION('center_axis',(1.,0.,0.));
#476=DIRECTION('ref_axis',(0.,0.,-1.));
#477=DIRECTION('center_axis',(1.,0.,0.));
#478=DIRECTION('ref_axis',(0.,0.,-1.));
#479=DIRECTION('center_axis',(1.,0.,0.));
#480=DIRECTION('ref_axis',(0.,0.,-1.));
#481=DIRECTION('',(0.,-1.,0.));
#482=DIRECTION('center_axis',(1.,0.,0.));
#483=DIRECTION('ref_axis',(0.,0.,-1.));
#484=DIRECTION('',(0.,0.,1.));
#485=DIRECTION('center_axis',(1.,0.,0.));
#486=DIRECTION('ref_axis',(0.,0.,-1.));
#487=DIRECTION('',(0.,1.,0.));
#488=DIRECTION('center_axis',(1.,0.,0.));
#489=DIRECTION('ref_axis',(0.,0.,-1.));
#490=DIRECTION('',(0.,0.,-1.));
#491=DIRECTION('center_axis',(1.,0.,0.));
#492=DIRECTION('ref_axis',(0.,0.,-1.));
#493=DIRECTION('center_axis',(1.,0.,0.));
#494=DIRECTION('ref_axis',(0.,0.,-1.));
#495=DIRECTION('center_axis',(1.,0.,0.));
#496=DIRECTION('ref_axis',(0.,0.,-1.));
#497=DIRECTION('',(0.,-1.,0.));
#498=DIRECTION('center_axis',(1.,0.,0.));
#499=DIRECTION('ref_axis',(0.,0.,-1.));
#500=DIRECTION('',(0.,0.,-1.));
#501=DIRECTION('center_axis',(1.,0.,0.));
#502=DIRECTION('ref_axis',(0.,0.,-1.));
#503=DIRECTION('',(0.,1.,0.));
#504=DIRECTION('center_axis',(1.,0.,0.));
#505=DIRECTION('ref_axis',(0.,0.,-1.));
#506=DIRECTION('',(0.,0.,1.));
#507=DIRECTION('center_axis',(0.,0.,1.));
#508=DIRECTION('ref_axis',(1.,0.,0.));
#509=DIRECTION('',(-1.,0.,0.));
#510=DIRECTION('',(-1.,0.,0.));
#511=DIRECTION('center_axis',(-1.,0.,0.));
#512=DIRECTION('ref_axis',(0.,0.,-1.));
#513=DIRECTION('',(-1.,0.,0.));
#514=DIRECTION('center_axis',(0.,-1.,0.));
#515=DIRECTION('ref_axis',(0.,0.,-1.));
#516=DIRECTION('',(-1.,0.,0.));
#517=DIRECTION('center_axis',(-1.,0.,0.));
#518=DIRECTION('ref_axis',(0.,0.,-1.));
#519=DIRECTION('',(-1.,0.,0.));
#520=DIRECTION('center_axis',(0.,0.,-1.));
#521=DIRECTION('ref_axis',(-1.,0.,0.));
#522=DIRECTION('',(-1.,0.,0.));
#523=DIRECTION('center_axis',(-1.,0.,0.));
#524=DIRECTION('ref_axis',(0.,0.,-1.));
#525=DIRECTION('',(-1.,0.,0.));
#526=DIRECTION('center_axis',(0.,1.,0.));
#527=DIRECTION('ref_axis',(0.,0.,1.));
#528=DIRECTION('',(-1.,0.,0.));
#529=DIRECTION('center_axis',(-1.,0.,0.));
#530=DIRECTION('ref_axis',(0.,0.,-1.));
#531=DIRECTION('center_axis',(1.,0.,0.));
#532=DIRECTION('ref_axis',(0.,0.,-1.));
#533=DIRECTION('center_axis',(1.,0.,0.));
#534=DIRECTION('ref_axis',(0.,0.,-1.));
#535=CARTESIAN_POINT('',(0.,0.,0.));
#536=CARTESIAN_POINT('Origin',(-13.,0.,0.));
#537=CARTESIAN_POINT('',(6.,1.438912E-15,11.75));
#538=CARTESIAN_POINT('Origin',(6.,0.,0.));
#539=CARTESIAN_POINT('',(-13.,-1.438912E-15,11.75));
#540=CARTESIAN_POINT('',(-13.,-1.43895998899814E-15,11.75));
#541=CARTESIAN_POINT('Origin',(-13.,0.,0.));
#542=CARTESIAN_POINT('Origin',(-13.,0.,0.));
#543=CARTESIAN_POINT('',(13.,-1.438912E-15,11.75));
#544=CARTESIAN_POINT('Origin',(13.,0.,0.));
#545=CARTESIAN_POINT('',(10.5,-1.438912E-15,11.75));
#546=CARTESIAN_POINT('',(-13.,-1.43895998899814E-15,11.75));
#547=CARTESIAN_POINT('Origin',(10.5,0.,0.));
#548=CARTESIAN_POINT('Origin',(-37.5936586256442,12.,9.5));
#549=CARTESIAN_POINT('',(9.2,12.,11.3));
#550=CARTESIAN_POINT('Origin',(9.2,12.,9.5));
#551=CARTESIAN_POINT('',(6.,12.,11.3));
#552=CARTESIAN_POINT('',(-37.5936586256442,12.,11.3));
#553=CARTESIAN_POINT('Origin',(6.,12.,9.5));
#554=CARTESIAN_POINT('Origin',(9.85,12.,9.5));
#555=CARTESIAN_POINT('',(10.5,12.,12.6));
#556=CARTESIAN_POINT('',(9.85,12.,11.95));
#557=CARTESIAN_POINT('Origin',(10.5,12.,9.5));
#558=CARTESIAN_POINT('Origin',(-37.5936586256442,-12.,-9.5));
#559=CARTESIAN_POINT('',(9.2,-12.,-7.7));
#560=CARTESIAN_POINT('Origin',(9.2,-12.,-9.5));
#561=CARTESIAN_POINT('',(6.,-12.,-7.7));
#562=CARTESIAN_POINT('',(-37.5936586256442,-12.,-7.7));
#563=CARTESIAN_POINT('Origin',(6.,-12.,-9.5));
#564=CARTESIAN_POINT('Origin',(9.85,-12.,-9.5));
#565=CARTESIAN_POINT('',(10.5,-12.,-6.4));
#566=CARTESIAN_POINT('',(9.85,-12.,-7.05));
#567=CARTESIAN_POINT('Origin',(10.5,-12.,-9.5));
#568=CARTESIAN_POINT('Origin',(13.,0.,0.));
#569=CARTESIAN_POINT('',(-5.,-6.,7.347638E-16));
#570=CARTESIAN_POINT('Origin',(-5.,0.,0.));
#571=CARTESIAN_POINT('',(13.,-6.,7.347638E-16));
#572=CARTESIAN_POINT('',(13.,-6.,7.34788079488412E-16));
#573=CARTESIAN_POINT('Origin',(13.,0.,0.));
#574=CARTESIAN_POINT('Origin',(13.,0.,0.));
#575=CARTESIAN_POINT('',(13.,-9.,1.102146E-15));
#576=CARTESIAN_POINT('Origin',(13.,0.,0.));
#577=CARTESIAN_POINT('',(-5.,-9.,1.102146E-15));
#578=CARTESIAN_POINT('',(13.,-9.,1.10218211923262E-15));
#579=CARTESIAN_POINT('Origin',(-5.,0.,0.));
#580=CARTESIAN_POINT('Origin',(-5.,0.709090909090909,3.009548E-17));
#581=CARTESIAN_POINT('Origin',(13.,0.,0.));
#582=CARTESIAN_POINT('Origin',(6.,-1.147313E-15,0.));
#583=CARTESIAN_POINT('',(6.,12.5,13.));
#584=CARTESIAN_POINT('',(6.,-12.5,13.));
#585=CARTESIAN_POINT('',(6.,12.5,13.));
#586=CARTESIAN_POINT('',(6.,15.5,10.));
#587=CARTESIAN_POINT('Origin',(6.,12.5,10.));
#588=CARTESIAN_POINT('',(6.,15.5,-10.));
#589=CARTESIAN_POINT('',(6.,15.5,-10.));
#590=CARTESIAN_POINT('',(6.,12.5,-13.));
#591=CARTESIAN_POINT('Origin',(6.,12.5,-10.));
#592=CARTESIAN_POINT('',(6.,-12.5,-13.));
#593=CARTESIAN_POINT('',(6.,-12.5,-13.));
#594=CARTESIAN_POINT('',(6.,-15.5,-10.));
#595=CARTESIAN_POINT('Origin',(6.,-12.5,-10.));
#596=CARTESIAN_POINT('',(6.,-15.5,10.));
#597=CARTESIAN_POINT('',(6.,-15.5,10.));
#598=CARTESIAN_POINT('Origin',(6.,-12.5,10.));
#599=CARTESIAN_POINT('Origin',(10.5,-1.147313E-15,0.));
#600=CARTESIAN_POINT('',(10.5,15.5,10.));
#601=CARTESIAN_POINT('',(10.5,12.5,13.));
#602=CARTESIAN_POINT('Origin',(10.5,12.5,10.));
#603=CARTESIAN_POINT('',(10.5,-12.5,13.));
#604=CARTESIAN_POINT('',(10.5,12.5,13.));
#605=CARTESIAN_POINT('',(10.5,-15.5,10.));
#606=CARTESIAN_POINT('Origin',(10.5,-12.5,10.));
#607=CARTESIAN_POINT('',(10.5,-15.5,-10.));
#608=CARTESIAN_POINT('',(10.5,-15.5,10.));
#609=CARTESIAN_POINT('',(10.5,-12.5,-13.));
#610=CARTESIAN_POINT('Origin',(10.5,-12.5,-10.));
#611=CARTESIAN_POINT('',(10.5,12.5,-13.));
#612=CARTESIAN_POINT('',(10.5,-12.5,-13.));
#613=CARTESIAN_POINT('',(10.5,15.5,-10.));
#614=CARTESIAN_POINT('Origin',(10.5,12.5,-10.));
#615=CARTESIAN_POINT('',(10.5,15.5,-10.));
#616=CARTESIAN_POINT('Origin',(10.5,12.5,13.));
#617=CARTESIAN_POINT('',(10.5,-12.5,13.));
#618=CARTESIAN_POINT('',(10.5,12.5,13.));
#619=CARTESIAN_POINT('Origin',(10.5,-12.5,10.));
#620=CARTESIAN_POINT('',(10.5,-15.5,10.));
#621=CARTESIAN_POINT('Origin',(10.5,-15.5,10.));
#622=CARTESIAN_POINT('',(10.5,-15.5,-10.));
#623=CARTESIAN_POINT('Origin',(10.5,-12.5,-10.));
#624=CARTESIAN_POINT('',(10.5,-12.5,-13.));
#625=CARTESIAN_POINT('Origin',(10.5,-12.5,-13.));
#626=CARTESIAN_POINT('',(10.5,12.5,-13.));
#627=CARTESIAN_POINT('Origin',(10.5,12.5,-10.));
#628=CARTESIAN_POINT('',(10.5,15.5,-10.));
#629=CARTESIAN_POINT('Origin',(10.5,15.5,-10.));
#630=CARTESIAN_POINT('',(10.5,15.5,10.));
#631=CARTESIAN_POINT('Origin',(10.5,12.5,10.));
#632=CARTESIAN_POINT('Origin',(13.,0.,0.));
#633=CARTESIAN_POINT('Origin',(-13.,0.,0.));
#634=UNCERTAINTY_MEASURE_WITH_UNIT(LENGTH_MEASURE(0.01),#638,
'DISTANCE_ACCURACY_VALUE',
'Maximum model space distance between geometric entities at asserted c
onnectivities');
#635=UNCERTAINTY_MEASURE_WITH_UNIT(LENGTH_MEASURE(0.01),#638,
'DISTANCE_ACCURACY_VALUE',
'Maximum model space distance between geometric entities at asserted c
onnectivities');
#636=(
GEOMETRIC_REPRESENTATION_CONTEXT(3)
GLOBAL_UNCERTAINTY_ASSIGNED_CONTEXT((#634))
GLOBAL_UNIT_ASSIGNED_CONTEXT((#638,#640,#641))
REPRESENTATION_CONTEXT('','3D')
);
#637=(
GEOMETRIC_REPRESENTATION_CONTEXT(3)
GLOBAL_UNCERTAINTY_ASSIGNED_CONTEXT((#635))
GLOBAL_UNIT_ASSIGNED_CONTEXT((#638,#640,#641))
REPRESENTATION_CONTEXT('','3D')
);
#638=(
LENGTH_UNIT()
NAMED_UNIT(*)
SI_UNIT(.MILLI.,.METRE.)
);
#639=(
LENGTH_UNIT()
NAMED_UNIT(*)
SI_UNIT(.CENTI.,.METRE.)
);
#640=(
NAMED_UNIT(*)
PLANE_ANGLE_UNIT()
SI_UNIT($,.RADIAN.)
);
#641=(
NAMED_UNIT(*)
SI_UNIT($,.STERADIAN.)
SOLID_ANGLE_UNIT()
);
#642=SHAPE_DEFINITION_REPRESENTATION(#643,#644);
#643=PRODUCT_DEFINITION_SHAPE('',$,#646);
#644=SHAPE_REPRESENTATION('',(#376),#636);
#645=PRODUCT_DEFINITION_CONTEXT('part definition',#650,'design');
#646=PRODUCT_DEFINITION('STECKER_1','STECKER_1',#647,#645);
#647=PRODUCT_DEFINITION_FORMATION('None',$,#652);
#648=PRODUCT_RELATED_PRODUCT_CATEGORY('STECKER_1','STECKER_1',(#652));
#649=APPLICATION_PROTOCOL_DEFINITION('international standard',
'automotive_design',2009,#650);
#650=APPLICATION_CONTEXT(
'Core Data for Automotive Mechanical Design Process');
#651=PRODUCT_CONTEXT('part definition',#650,'mechanical');
#652=PRODUCT('STECKER_1','STECKER_1',$,(#651));
#653=PRESENTATION_STYLE_ASSIGNMENT((#654));
#654=SURFACE_STYLE_USAGE(.BOTH.,#657);
#655=SURFACE_STYLE_RENDERING_WITH_PROPERTIES($,#661,(#656));
#656=SURFACE_STYLE_TRANSPARENT(0.);
#657=SURFACE_SIDE_STYLE('',(#658,#655));
#658=SURFACE_STYLE_FILL_AREA(#659);
#659=FILL_AREA_STYLE('',(#660));
#660=FILL_AREA_STYLE_COLOUR('',#661);
#661=COLOUR_RGB('',0.749019607843137,0.749019607843137,0.749019607843137);
ENDSEC;
END-ISO-10303-21;
