ISO-10303-21;
HEADER;
/* Generated by software containing ST-Developer
 * from STEP Tools, Inc. (www.steptools.com) 
 */
/* OPTION: using custom schema-name function */

FILE_DESCRIPTION(
/* description */ (''),
/* implementation_level */ '2;1');

FILE_NAME(
/* name */ 'F0013963500-A-P2016.038.026.stp',
/* time_stamp */ '2020-02-10T09:43:30+01:00',
/* author */ ('DR. FRITZ FAULHABER GmbH & Co. KG'),
/* organization */ ('DR. FRITZ FAULHABER GmbH & Co. KG'),
/* preprocessor_version */ 'ST-DEVELOPER v16.7',
/* originating_system */ 'SIEMENS PLM Software NX 12.0',
/* authorisation */ '');

FILE_SCHEMA (('AUTOMOTIVE_DESIGN { 1 0 10303 214 3 1 1 1 }'));
ENDSEC;

DATA;
#10=SHAPE_REPRESENTATION_RELATIONSHIP('None',
'relationship between F0013963500-A-P2016.038.026-None and F0013963500
-A-P2016.038.026-None',#22,#11);
#11=ADVANCED_BREP_SHAPE_REPRESENTATION(
'F0013963500-A-P2016.038.026-None',(#69,#70),#928);
#12=SHAPE_DEFINITION_REPRESENTATION(#13,#22);
#13=PRODUCT_DEFINITION_SHAPE('','',#14);
#14=PRODUCT_DEFINITION(' ','',#16,#15);
#15=PRODUCT_DEFINITION_CONTEXT('part definition',#21,'design');
#16=PRODUCT_DEFINITION_FORMATION_WITH_SPECIFIED_SOURCE(' ',' ',#18,
 .NOT_KNOWN.);
#17=PRODUCT_RELATED_PRODUCT_CATEGORY('part','',(#18));
#18=PRODUCT('F0013963500-A-P2016.038.026','F0013963500-A-P2016.038.026',
' ',(#19));
#19=PRODUCT_CONTEXT(' ',#21,'mechanical');
#20=APPLICATION_PROTOCOL_DEFINITION('international standard',
'automotive_design',2010,#21);
#21=APPLICATION_CONTEXT(
'core data for automotive mechanical design processes');
#22=SHAPE_REPRESENTATION('F0013963500-A-P2016.038.026-None',(#540),#928);
#23=OVER_RIDING_STYLED_ITEM('',(#33),#151,#30);
#24=OVER_RIDING_STYLED_ITEM('',(#35),#167,#31);
#25=OVER_RIDING_STYLED_ITEM('',(#36),#170,#31);
#26=OVER_RIDING_STYLED_ITEM('',(#37),#175,#31);
#27=DRAUGHTING_PRE_DEFINED_COLOUR('red');
#28=DRAUGHTING_PRE_DEFINED_COLOUR('blue');
#29=PRESENTATION_LAYER_ASSIGNMENT('1','Layer 1',(#69,#70));
#30=STYLED_ITEM('',(#32),#69);
#31=STYLED_ITEM('',(#34),#70);
#32=PRESENTATION_STYLE_ASSIGNMENT((#38));
#33=PRESENTATION_STYLE_ASSIGNMENT((#39));
#34=PRESENTATION_STYLE_ASSIGNMENT((#40));
#35=PRESENTATION_STYLE_ASSIGNMENT((#41));
#36=PRESENTATION_STYLE_ASSIGNMENT((#42));
#37=PRESENTATION_STYLE_ASSIGNMENT((#43));
#38=SURFACE_STYLE_USAGE(.BOTH.,#44);
#39=SURFACE_STYLE_USAGE(.BOTH.,#45);
#40=SURFACE_STYLE_USAGE(.BOTH.,#46);
#41=SURFACE_STYLE_USAGE(.BOTH.,#47);
#42=SURFACE_STYLE_USAGE(.BOTH.,#48);
#43=SURFACE_STYLE_USAGE(.BOTH.,#49);
#44=SURFACE_SIDE_STYLE('',(#50));
#45=SURFACE_SIDE_STYLE('',(#51));
#46=SURFACE_SIDE_STYLE('',(#52));
#47=SURFACE_SIDE_STYLE('',(#53));
#48=SURFACE_SIDE_STYLE('',(#54));
#49=SURFACE_SIDE_STYLE('',(#55));
#50=SURFACE_STYLE_FILL_AREA(#56);
#51=SURFACE_STYLE_FILL_AREA(#57);
#52=SURFACE_STYLE_FILL_AREA(#58);
#53=SURFACE_STYLE_FILL_AREA(#59);
#54=SURFACE_STYLE_FILL_AREA(#60);
#55=SURFACE_STYLE_FILL_AREA(#61);
#56=FILL_AREA_STYLE('',(#62));
#57=FILL_AREA_STYLE('',(#63));
#58=FILL_AREA_STYLE('',(#64));
#59=FILL_AREA_STYLE('',(#65));
#60=FILL_AREA_STYLE('',(#66));
#61=FILL_AREA_STYLE('',(#67));
#62=FILL_AREA_STYLE_COLOUR('',#68);
#63=FILL_AREA_STYLE_COLOUR('',#27);
#64=FILL_AREA_STYLE_COLOUR('',#68);
#65=FILL_AREA_STYLE_COLOUR('',#27);
#66=FILL_AREA_STYLE_COLOUR('',#27);
#67=FILL_AREA_STYLE_COLOUR('',#28);
#68=COLOUR_RGB('Light Gray',0.6,0.6,0.6);
#69=MANIFOLD_SOLID_BREP('',#71);
#70=MANIFOLD_SOLID_BREP('',#72);
#71=CLOSED_SHELL('',(#151,#152,#153,#154,#155,#156,#157,#158,#159));
#72=CLOSED_SHELL('',(#160,#161,#162,#163,#164,#165,#166,#167,#168,#169,
#170,#171,#172,#173,#174,#175,#176,#177,#178,#179,#180,#181,#182,#183,#184,
#185,#186,#187,#188,#189,#190));
#73=CONICAL_SURFACE('',#550,3.,45.0000000000002);
#74=CONICAL_SURFACE('',#551,3.,45.0000000000002);
#75=B_SPLINE_CURVE_WITH_KNOTS('',3,(#811,#812,#813,#814),.UNSPECIFIED.,
 .F.,.F.,(4,4),(0.,1.),.UNSPECIFIED.);
#76=B_SPLINE_CURVE_WITH_KNOTS('',3,(#815,#816,#817,#818),.UNSPECIFIED.,
 .F.,.F.,(4,4),(0.,1.),.UNSPECIFIED.);
#77=B_SPLINE_CURVE_WITH_KNOTS('',3,(#820,#821,#822,#823),.UNSPECIFIED.,
 .F.,.F.,(4,4),(0.,1.),.UNSPECIFIED.);
#78=B_SPLINE_CURVE_WITH_KNOTS('',3,(#824,#825,#826,#827),.UNSPECIFIED.,
 .F.,.F.,(4,4),(0.,1.),.UNSPECIFIED.);
#79=CYLINDRICAL_SURFACE('',#549,3.);
#80=CYLINDRICAL_SURFACE('',#559,10.3999999999995);
#81=CYLINDRICAL_SURFACE('',#562,6.);
#82=CYLINDRICAL_SURFACE('',#567,5.034);
#83=CYLINDRICAL_SURFACE('',#571,11.);
#84=CYLINDRICAL_SURFACE('',#583,7.5);
#85=CYLINDRICAL_SURFACE('',#586,4.);
#86=CYLINDRICAL_SURFACE('',#589,10.9995);
#87=CYLINDRICAL_SURFACE('',#596,11.);
#88=CYLINDRICAL_SURFACE('',#599,0.8);
#89=CYLINDRICAL_SURFACE('',#602,0.8);
#90=CYLINDRICAL_SURFACE('',#605,0.8);
#91=CYLINDRICAL_SURFACE('',#608,0.8);
#92=CYLINDRICAL_SURFACE('',#611,0.8);
#93=CYLINDRICAL_SURFACE('',#614,0.8);
#94=CYLINDRICAL_SURFACE('',#617,10.5);
#95=ELLIPSE('',#545,4.24264068711929,3.);
#96=ELLIPSE('',#547,4.24264068711929,3.);
#97=FACE_BOUND('',#230,.T.);
#98=FACE_BOUND('',#231,.T.);
#99=FACE_BOUND('',#239,.T.);
#100=FACE_BOUND('',#240,.T.);
#101=FACE_BOUND('',#241,.T.);
#102=FACE_BOUND('',#242,.T.);
#103=FACE_BOUND('',#243,.T.);
#104=FACE_BOUND('',#244,.T.);
#105=FACE_BOUND('',#246,.T.);
#106=FACE_BOUND('',#247,.T.);
#107=FACE_BOUND('',#248,.T.);
#108=FACE_BOUND('',#249,.T.);
#109=FACE_BOUND('',#250,.T.);
#110=FACE_BOUND('',#251,.T.);
#111=FACE_BOUND('',#252,.T.);
#112=FACE_BOUND('',#253,.T.);
#113=FACE_BOUND('',#254,.T.);
#114=FACE_BOUND('',#255,.T.);
#115=FACE_BOUND('',#256,.T.);
#116=FACE_BOUND('',#257,.T.);
#117=FACE_BOUND('',#258,.T.);
#118=FACE_BOUND('',#259,.T.);
#119=FACE_BOUND('',#260,.T.);
#120=FACE_BOUND('',#261,.T.);
#121=FACE_BOUND('',#262,.T.);
#122=FACE_BOUND('',#263,.T.);
#123=FACE_BOUND('',#265,.T.);
#124=FACE_BOUND('',#266,.T.);
#125=FACE_BOUND('',#267,.T.);
#126=FACE_BOUND('',#268,.T.);
#127=FACE_BOUND('',#269,.T.);
#128=FACE_BOUND('',#270,.T.);
#129=FACE_BOUND('',#271,.T.);
#130=FACE_BOUND('',#272,.T.);
#131=FACE_BOUND('',#273,.T.);
#132=FACE_BOUND('',#274,.T.);
#133=FACE_BOUND('',#275,.T.);
#134=FACE_BOUND('',#276,.T.);
#135=FACE_BOUND('',#278,.T.);
#136=FACE_BOUND('',#279,.T.);
#137=FACE_BOUND('',#281,.T.);
#138=FACE_BOUND('',#282,.T.);
#139=FACE_BOUND('',#284,.T.);
#140=FACE_BOUND('',#285,.T.);
#141=FACE_BOUND('',#287,.T.);
#142=FACE_BOUND('',#288,.T.);
#143=FACE_BOUND('',#290,.T.);
#144=FACE_BOUND('',#291,.T.);
#145=FACE_BOUND('',#293,.T.);
#146=FACE_BOUND('',#294,.T.);
#147=FACE_BOUND('',#295,.T.);
#148=FACE_BOUND('',#296,.T.);
#149=FACE_BOUND('',#297,.T.);
#150=FACE_BOUND('',#298,.T.);
#151=ADVANCED_FACE('',(#213),#191,.T.);
#152=ADVANCED_FACE('',(#97,#98),#79,.T.);
#153=ADVANCED_FACE('',(#214),#73,.T.);
#154=ADVANCED_FACE('',(#215),#74,.T.);
#155=ADVANCED_FACE('',(#216),#192,.T.);
#156=ADVANCED_FACE('',(#217),#193,.F.);
#157=ADVANCED_FACE('',(#218),#194,.T.);
#158=ADVANCED_FACE('',(#219),#195,.T.);
#159=ADVANCED_FACE('',(#220),#196,.T.);
#160=ADVANCED_FACE('',(#99,#100),#80,.T.);
#161=ADVANCED_FACE('',(#101,#102),#81,.F.);
#162=ADVANCED_FACE('',(#103,#104),#197,.T.);
#163=ADVANCED_FACE('',(#221),#198,.F.);
#164=ADVANCED_FACE('',(#105,#106),#82,.F.);
#165=ADVANCED_FACE('',(#107,#108),#199,.F.);
#166=ADVANCED_FACE('',(#109,#110),#83,.T.);
#167=ADVANCED_FACE('AS_FLANSCH',(#111,#112,#113,#114,#115,#116,#117,#118),
#200,.T.);
#168=ADVANCED_FACE('',(#119,#120),#201,.T.);
#169=ADVANCED_FACE('',(#121,#122),#84,.T.);
#170=ADVANCED_FACE('AS_ROTIEREND',(#222),#202,.T.);
#171=ADVANCED_FACE('',(#123,#124),#85,.T.);
#172=ADVANCED_FACE('',(#125,#126),#86,.T.);
#173=ADVANCED_FACE('',(#127,#128),#203,.T.);
#174=ADVANCED_FACE('',(#129,#130),#204,.F.);
#175=ADVANCED_FACE('BS_FLANSCH',(#131,#132),#205,.T.);
#176=ADVANCED_FACE('',(#133,#134),#87,.T.);
#177=ADVANCED_FACE('',(#223),#206,.F.);
#178=ADVANCED_FACE('',(#135,#136),#88,.F.);
#179=ADVANCED_FACE('',(#224),#207,.F.);
#180=ADVANCED_FACE('',(#137,#138),#89,.F.);
#181=ADVANCED_FACE('',(#225),#208,.F.);
#182=ADVANCED_FACE('',(#139,#140),#90,.F.);
#183=ADVANCED_FACE('',(#226),#209,.F.);
#184=ADVANCED_FACE('',(#141,#142),#91,.F.);
#185=ADVANCED_FACE('',(#227),#210,.F.);
#186=ADVANCED_FACE('',(#143,#144),#92,.F.);
#187=ADVANCED_FACE('',(#228),#211,.F.);
#188=ADVANCED_FACE('',(#145,#146),#93,.F.);
#189=ADVANCED_FACE('',(#147,#148),#212,.F.);
#190=ADVANCED_FACE('',(#149,#150),#94,.F.);
#191=PLANE('',#543);
#192=PLANE('',#552);
#193=PLANE('',#553);
#194=PLANE('',#554);
#195=PLANE('',#555);
#196=PLANE('',#556);
#197=PLANE('',#563);
#198=PLANE('',#565);
#199=PLANE('',#568);
#200=PLANE('',#579);
#201=PLANE('',#582);
#202=PLANE('',#585);
#203=PLANE('',#590);
#204=PLANE('',#592);
#205=PLANE('',#595);
#206=PLANE('',#598);
#207=PLANE('',#601);
#208=PLANE('',#604);
#209=PLANE('',#607);
#210=PLANE('',#610);
#211=PLANE('',#613);
#212=PLANE('',#616);
#213=FACE_OUTER_BOUND('',#229,.T.);
#214=FACE_OUTER_BOUND('',#232,.T.);
#215=FACE_OUTER_BOUND('',#233,.T.);
#216=FACE_OUTER_BOUND('',#234,.T.);
#217=FACE_OUTER_BOUND('',#235,.T.);
#218=FACE_OUTER_BOUND('',#236,.T.);
#219=FACE_OUTER_BOUND('',#237,.T.);
#220=FACE_OUTER_BOUND('',#238,.T.);
#221=FACE_OUTER_BOUND('',#245,.T.);
#222=FACE_OUTER_BOUND('',#264,.T.);
#223=FACE_OUTER_BOUND('',#277,.T.);
#224=FACE_OUTER_BOUND('',#280,.T.);
#225=FACE_OUTER_BOUND('',#283,.T.);
#226=FACE_OUTER_BOUND('',#286,.T.);
#227=FACE_OUTER_BOUND('',#289,.T.);
#228=FACE_OUTER_BOUND('',#292,.T.);
#229=EDGE_LOOP('',(#334,#335,#336,#337));
#230=EDGE_LOOP('',(#338));
#231=EDGE_LOOP('',(#339,#340,#341,#342,#343,#344,#345,#346));
#232=EDGE_LOOP('',(#347,#348,#349,#350));
#233=EDGE_LOOP('',(#351,#352,#353,#354));
#234=EDGE_LOOP('',(#355));
#235=EDGE_LOOP('',(#356,#357,#358,#359,#360,#361));
#236=EDGE_LOOP('',(#362,#363));
#237=EDGE_LOOP('',(#364,#365));
#238=EDGE_LOOP('',(#366,#367,#368,#369,#370,#371));
#239=EDGE_LOOP('',(#372));
#240=EDGE_LOOP('',(#373));
#241=EDGE_LOOP('',(#374));
#242=EDGE_LOOP('',(#375));
#243=EDGE_LOOP('',(#376));
#244=EDGE_LOOP('',(#377));
#245=EDGE_LOOP('',(#378));
#246=EDGE_LOOP('',(#379));
#247=EDGE_LOOP('',(#380));
#248=EDGE_LOOP('',(#381));
#249=EDGE_LOOP('',(#382));
#250=EDGE_LOOP('',(#383));
#251=EDGE_LOOP('',(#384));
#252=EDGE_LOOP('',(#385));
#253=EDGE_LOOP('',(#386));
#254=EDGE_LOOP('',(#387));
#255=EDGE_LOOP('',(#388));
#256=EDGE_LOOP('',(#389));
#257=EDGE_LOOP('',(#390));
#258=EDGE_LOOP('',(#391));
#259=EDGE_LOOP('',(#392));
#260=EDGE_LOOP('',(#393));
#261=EDGE_LOOP('',(#394));
#262=EDGE_LOOP('',(#395));
#263=EDGE_LOOP('',(#396));
#264=EDGE_LOOP('',(#397));
#265=EDGE_LOOP('',(#398));
#266=EDGE_LOOP('',(#399));
#267=EDGE_LOOP('',(#400));
#268=EDGE_LOOP('',(#401));
#269=EDGE_LOOP('',(#402));
#270=EDGE_LOOP('',(#403));
#271=EDGE_LOOP('',(#404));
#272=EDGE_LOOP('',(#405));
#273=EDGE_LOOP('',(#406));
#274=EDGE_LOOP('',(#407));
#275=EDGE_LOOP('',(#408));
#276=EDGE_LOOP('',(#409));
#277=EDGE_LOOP('',(#410));
#278=EDGE_LOOP('',(#411));
#279=EDGE_LOOP('',(#412));
#280=EDGE_LOOP('',(#413));
#281=EDGE_LOOP('',(#414));
#282=EDGE_LOOP('',(#415));
#283=EDGE_LOOP('',(#416));
#284=EDGE_LOOP('',(#417));
#285=EDGE_LOOP('',(#418));
#286=EDGE_LOOP('',(#419));
#287=EDGE_LOOP('',(#420));
#288=EDGE_LOOP('',(#421));
#289=EDGE_LOOP('',(#422));
#290=EDGE_LOOP('',(#423));
#291=EDGE_LOOP('',(#424));
#292=EDGE_LOOP('',(#425));
#293=EDGE_LOOP('',(#426));
#294=EDGE_LOOP('',(#427));
#295=EDGE_LOOP('',(#428));
#296=EDGE_LOOP('',(#429));
#297=EDGE_LOOP('',(#430));
#298=EDGE_LOOP('',(#431));
#299=CIRCLE('',#541,2.8);
#300=CIRCLE('',#542,2.8);
#301=CIRCLE('',#544,3.);
#302=CIRCLE('',#546,3.);
#303=CIRCLE('',#548,3.);
#304=CIRCLE('',#557,10.3999999999995);
#305=CIRCLE('',#558,10.3999999999995);
#306=CIRCLE('',#560,6.);
#307=CIRCLE('',#561,6.);
#308=CIRCLE('',#564,5.034);
#309=CIRCLE('',#566,5.034);
#310=CIRCLE('',#569,11.);
#311=CIRCLE('',#570,11.);
#312=CIRCLE('',#572,0.8);
#313=CIRCLE('',#573,0.8);
#314=CIRCLE('',#574,0.8);
#315=CIRCLE('',#575,0.8);
#316=CIRCLE('',#576,0.8);
#317=CIRCLE('',#577,0.8);
#318=CIRCLE('',#578,7.5);
#319=CIRCLE('',#580,4.);
#320=CIRCLE('',#581,7.5);
#321=CIRCLE('',#584,4.);
#322=CIRCLE('',#587,10.9995);
#323=CIRCLE('',#588,10.9995);
#324=CIRCLE('',#591,11.);
#325=CIRCLE('',#593,10.5);
#326=CIRCLE('',#594,11.);
#327=CIRCLE('',#597,0.8);
#328=CIRCLE('',#600,0.8);
#329=CIRCLE('',#603,0.8);
#330=CIRCLE('',#606,0.8);
#331=CIRCLE('',#609,0.8);
#332=CIRCLE('',#612,0.8);
#333=CIRCLE('',#615,10.5);
#334=ORIENTED_EDGE('',*,*,#475,.F.);
#335=ORIENTED_EDGE('',*,*,#476,.T.);
#336=ORIENTED_EDGE('',*,*,#477,.T.);
#337=ORIENTED_EDGE('',*,*,#478,.T.);
#338=ORIENTED_EDGE('',*,*,#479,.T.);
#339=ORIENTED_EDGE('',*,*,#480,.T.);
#340=ORIENTED_EDGE('',*,*,#481,.T.);
#341=ORIENTED_EDGE('',*,*,#482,.T.);
#342=ORIENTED_EDGE('',*,*,#483,.T.);
#343=ORIENTED_EDGE('',*,*,#484,.F.);
#344=ORIENTED_EDGE('',*,*,#485,.F.);
#345=ORIENTED_EDGE('',*,*,#486,.F.);
#346=ORIENTED_EDGE('',*,*,#487,.T.);
#347=ORIENTED_EDGE('',*,*,#483,.F.);
#348=ORIENTED_EDGE('',*,*,#488,.T.);
#349=ORIENTED_EDGE('',*,*,#478,.F.);
#350=ORIENTED_EDGE('',*,*,#489,.F.);
#351=ORIENTED_EDGE('',*,*,#476,.F.);
#352=ORIENTED_EDGE('',*,*,#490,.T.);
#353=ORIENTED_EDGE('',*,*,#487,.F.);
#354=ORIENTED_EDGE('',*,*,#491,.F.);
#355=ORIENTED_EDGE('',*,*,#479,.F.);
#356=ORIENTED_EDGE('',*,*,#484,.T.);
#357=ORIENTED_EDGE('',*,*,#489,.T.);
#358=ORIENTED_EDGE('',*,*,#477,.F.);
#359=ORIENTED_EDGE('',*,*,#491,.T.);
#360=ORIENTED_EDGE('',*,*,#486,.T.);
#361=ORIENTED_EDGE('',*,*,#492,.F.);
#362=ORIENTED_EDGE('',*,*,#485,.T.);
#363=ORIENTED_EDGE('',*,*,#492,.T.);
#364=ORIENTED_EDGE('',*,*,#481,.F.);
#365=ORIENTED_EDGE('',*,*,#493,.F.);
#366=ORIENTED_EDGE('',*,*,#493,.T.);
#367=ORIENTED_EDGE('',*,*,#480,.F.);
#368=ORIENTED_EDGE('',*,*,#490,.F.);
#369=ORIENTED_EDGE('',*,*,#475,.T.);
#370=ORIENTED_EDGE('',*,*,#488,.F.);
#371=ORIENTED_EDGE('',*,*,#482,.F.);
#372=ORIENTED_EDGE('',*,*,#494,.F.);
#373=ORIENTED_EDGE('',*,*,#495,.F.);
#374=ORIENTED_EDGE('',*,*,#496,.T.);
#375=ORIENTED_EDGE('',*,*,#497,.F.);
#376=ORIENTED_EDGE('',*,*,#494,.T.);
#377=ORIENTED_EDGE('',*,*,#496,.F.);
#378=ORIENTED_EDGE('',*,*,#498,.T.);
#379=ORIENTED_EDGE('',*,*,#499,.T.);
#380=ORIENTED_EDGE('',*,*,#498,.F.);
#381=ORIENTED_EDGE('',*,*,#499,.F.);
#382=ORIENTED_EDGE('',*,*,#497,.T.);
#383=ORIENTED_EDGE('',*,*,#500,.T.);
#384=ORIENTED_EDGE('',*,*,#501,.T.);
#385=ORIENTED_EDGE('',*,*,#502,.T.);
#386=ORIENTED_EDGE('',*,*,#503,.T.);
#387=ORIENTED_EDGE('',*,*,#504,.T.);
#388=ORIENTED_EDGE('',*,*,#505,.T.);
#389=ORIENTED_EDGE('',*,*,#506,.T.);
#390=ORIENTED_EDGE('',*,*,#507,.T.);
#391=ORIENTED_EDGE('',*,*,#508,.F.);
#392=ORIENTED_EDGE('',*,*,#500,.F.);
#393=ORIENTED_EDGE('',*,*,#509,.F.);
#394=ORIENTED_EDGE('',*,*,#510,.T.);
#395=ORIENTED_EDGE('',*,*,#510,.F.);
#396=ORIENTED_EDGE('',*,*,#508,.T.);
#397=ORIENTED_EDGE('',*,*,#511,.T.);
#398=ORIENTED_EDGE('',*,*,#511,.F.);
#399=ORIENTED_EDGE('',*,*,#509,.T.);
#400=ORIENTED_EDGE('',*,*,#512,.T.);
#401=ORIENTED_EDGE('',*,*,#513,.F.);
#402=ORIENTED_EDGE('',*,*,#501,.F.);
#403=ORIENTED_EDGE('',*,*,#513,.T.);
#404=ORIENTED_EDGE('',*,*,#514,.T.);
#405=ORIENTED_EDGE('',*,*,#512,.F.);
#406=ORIENTED_EDGE('',*,*,#515,.T.);
#407=ORIENTED_EDGE('',*,*,#516,.T.);
#408=ORIENTED_EDGE('',*,*,#514,.F.);
#409=ORIENTED_EDGE('',*,*,#516,.F.);
#410=ORIENTED_EDGE('',*,*,#517,.T.);
#411=ORIENTED_EDGE('',*,*,#517,.F.);
#412=ORIENTED_EDGE('',*,*,#507,.F.);
#413=ORIENTED_EDGE('',*,*,#518,.F.);
#414=ORIENTED_EDGE('',*,*,#518,.T.);
#415=ORIENTED_EDGE('',*,*,#506,.F.);
#416=ORIENTED_EDGE('',*,*,#519,.F.);
#417=ORIENTED_EDGE('',*,*,#519,.T.);
#418=ORIENTED_EDGE('',*,*,#505,.F.);
#419=ORIENTED_EDGE('',*,*,#520,.F.);
#420=ORIENTED_EDGE('',*,*,#520,.T.);
#421=ORIENTED_EDGE('',*,*,#504,.F.);
#422=ORIENTED_EDGE('',*,*,#521,.F.);
#423=ORIENTED_EDGE('',*,*,#521,.T.);
#424=ORIENTED_EDGE('',*,*,#503,.F.);
#425=ORIENTED_EDGE('',*,*,#522,.F.);
#426=ORIENTED_EDGE('',*,*,#522,.T.);
#427=ORIENTED_EDGE('',*,*,#502,.F.);
#428=ORIENTED_EDGE('',*,*,#495,.T.);
#429=ORIENTED_EDGE('',*,*,#523,.T.);
#430=ORIENTED_EDGE('',*,*,#523,.F.);
#431=ORIENTED_EDGE('',*,*,#515,.F.);
#432=VERTEX_POINT('',#784);
#433=VERTEX_POINT('',#785);
#434=VERTEX_POINT('',#787);
#435=VERTEX_POINT('',#789);
#436=VERTEX_POINT('',#793);
#437=VERTEX_POINT('',#795);
#438=VERTEX_POINT('',#796);
#439=VERTEX_POINT('',#798);
#440=VERTEX_POINT('',#800);
#441=VERTEX_POINT('',#802);
#442=VERTEX_POINT('',#804);
#443=VERTEX_POINT('',#806);
#444=VERTEX_POINT('',#808);
#445=VERTEX_POINT('',#837);
#446=VERTEX_POINT('',#839);
#447=VERTEX_POINT('',#842);
#448=VERTEX_POINT('',#844);
#449=VERTEX_POINT('',#848);
#450=VERTEX_POINT('',#851);
#451=VERTEX_POINT('',#855);
#452=VERTEX_POINT('',#857);
#453=VERTEX_POINT('',#860);
#454=VERTEX_POINT('',#862);
#455=VERTEX_POINT('',#864);
#456=VERTEX_POINT('',#866);
#457=VERTEX_POINT('',#868);
#458=VERTEX_POINT('',#870);
#459=VERTEX_POINT('',#872);
#460=VERTEX_POINT('',#875);
#461=VERTEX_POINT('',#877);
#462=VERTEX_POINT('',#881);
#463=VERTEX_POINT('',#885);
#464=VERTEX_POINT('',#887);
#465=VERTEX_POINT('',#891);
#466=VERTEX_POINT('',#894);
#467=VERTEX_POINT('',#896);
#468=VERTEX_POINT('',#900);
#469=VERTEX_POINT('',#904);
#470=VERTEX_POINT('',#908);
#471=VERTEX_POINT('',#912);
#472=VERTEX_POINT('',#916);
#473=VERTEX_POINT('',#920);
#474=VERTEX_POINT('',#924);
#475=EDGE_CURVE('',#432,#433,#524,.T.);
#476=EDGE_CURVE('',#432,#434,#299,.T.);
#477=EDGE_CURVE('',#434,#435,#525,.T.);
#478=EDGE_CURVE('',#435,#433,#300,.T.);
#479=EDGE_CURVE('',#436,#436,#301,.T.);
#480=EDGE_CURVE('',#437,#438,#526,.T.);
#481=EDGE_CURVE('',#438,#439,#95,.T.);
#482=EDGE_CURVE('',#439,#440,#527,.T.);
#483=EDGE_CURVE('',#440,#441,#302,.T.);
#484=EDGE_CURVE('',#442,#441,#528,.T.);
#485=EDGE_CURVE('',#443,#442,#96,.T.);
#486=EDGE_CURVE('',#444,#443,#529,.T.);
#487=EDGE_CURVE('',#444,#437,#303,.T.);
#488=EDGE_CURVE('',#440,#433,#75,.T.);
#489=EDGE_CURVE('',#441,#435,#76,.T.);
#490=EDGE_CURVE('',#432,#437,#77,.T.);
#491=EDGE_CURVE('',#434,#444,#78,.T.);
#492=EDGE_CURVE('',#442,#443,#530,.T.);
#493=EDGE_CURVE('',#439,#438,#531,.T.);
#494=EDGE_CURVE('',#445,#445,#304,.T.);
#495=EDGE_CURVE('',#446,#446,#305,.T.);
#496=EDGE_CURVE('',#447,#447,#306,.T.);
#497=EDGE_CURVE('',#448,#448,#307,.T.);
#498=EDGE_CURVE('',#449,#449,#308,.T.);
#499=EDGE_CURVE('',#450,#450,#309,.T.);
#500=EDGE_CURVE('',#451,#451,#310,.T.);
#501=EDGE_CURVE('',#452,#452,#311,.T.);
#502=EDGE_CURVE('',#453,#453,#312,.T.);
#503=EDGE_CURVE('',#454,#454,#313,.T.);
#504=EDGE_CURVE('',#455,#455,#314,.T.);
#505=EDGE_CURVE('',#456,#456,#315,.T.);
#506=EDGE_CURVE('',#457,#457,#316,.T.);
#507=EDGE_CURVE('',#458,#458,#317,.T.);
#508=EDGE_CURVE('',#459,#459,#318,.T.);
#509=EDGE_CURVE('',#460,#460,#319,.T.);
#510=EDGE_CURVE('',#461,#461,#320,.T.);
#511=EDGE_CURVE('',#462,#462,#321,.T.);
#512=EDGE_CURVE('',#463,#463,#322,.T.);
#513=EDGE_CURVE('',#464,#464,#323,.T.);
#514=EDGE_CURVE('',#465,#465,#324,.T.);
#515=EDGE_CURVE('',#466,#466,#325,.T.);
#516=EDGE_CURVE('',#467,#467,#326,.T.);
#517=EDGE_CURVE('',#468,#468,#327,.T.);
#518=EDGE_CURVE('',#469,#469,#328,.T.);
#519=EDGE_CURVE('',#470,#470,#329,.T.);
#520=EDGE_CURVE('',#471,#471,#330,.T.);
#521=EDGE_CURVE('',#472,#472,#331,.T.);
#522=EDGE_CURVE('',#473,#473,#332,.T.);
#523=EDGE_CURVE('',#474,#474,#333,.T.);
#524=LINE('',#783,#532);
#525=LINE('',#788,#533);
#526=LINE('',#794,#534);
#527=LINE('',#799,#535);
#528=LINE('',#803,#536);
#529=LINE('',#807,#537);
#530=LINE('',#830,#538);
#531=LINE('',#833,#539);
#532=VECTOR('',#620,1.);
#533=VECTOR('',#623,1.);
#534=VECTOR('',#630,1.);
#535=VECTOR('',#633,1.);
#536=VECTOR('',#636,1.);
#537=VECTOR('',#639,1.);
#538=VECTOR('',#650,1.);
#539=VECTOR('',#655,1.);
#540=AXIS2_PLACEMENT_3D('',#782,#618,#619);
#541=AXIS2_PLACEMENT_3D('',#786,#621,#622);
#542=AXIS2_PLACEMENT_3D('',#790,#624,#625);
#543=AXIS2_PLACEMENT_3D('',#791,#626,#627);
#544=AXIS2_PLACEMENT_3D('',#792,#628,#629);
#545=AXIS2_PLACEMENT_3D('',#797,#631,#632);
#546=AXIS2_PLACEMENT_3D('',#801,#634,#635);
#547=AXIS2_PLACEMENT_3D('',#805,#637,#638);
#548=AXIS2_PLACEMENT_3D('',#809,#640,#641);
#549=AXIS2_PLACEMENT_3D('',#810,#642,#643);
#550=AXIS2_PLACEMENT_3D('',#819,#644,#645);
#551=AXIS2_PLACEMENT_3D('',#828,#646,#647);
#552=AXIS2_PLACEMENT_3D('',#829,#648,#649);
#553=AXIS2_PLACEMENT_3D('',#831,#651,#652);
#554=AXIS2_PLACEMENT_3D('',#832,#653,#654);
#555=AXIS2_PLACEMENT_3D('',#834,#656,#657);
#556=AXIS2_PLACEMENT_3D('',#835,#658,#659);
#557=AXIS2_PLACEMENT_3D('',#836,#660,#661);
#558=AXIS2_PLACEMENT_3D('',#838,#662,#663);
#559=AXIS2_PLACEMENT_3D('',#840,#664,#665);
#560=AXIS2_PLACEMENT_3D('',#841,#666,#667);
#561=AXIS2_PLACEMENT_3D('',#843,#668,#669);
#562=AXIS2_PLACEMENT_3D('',#845,#670,#671);
#563=AXIS2_PLACEMENT_3D('',#846,#672,#673);
#564=AXIS2_PLACEMENT_3D('',#847,#674,#675);
#565=AXIS2_PLACEMENT_3D('',#849,#676,#677);
#566=AXIS2_PLACEMENT_3D('',#850,#678,#679);
#567=AXIS2_PLACEMENT_3D('',#852,#680,#681);
#568=AXIS2_PLACEMENT_3D('',#853,#682,#683);
#569=AXIS2_PLACEMENT_3D('',#854,#684,#685);
#570=AXIS2_PLACEMENT_3D('',#856,#686,#687);
#571=AXIS2_PLACEMENT_3D('',#858,#688,#689);
#572=AXIS2_PLACEMENT_3D('',#859,#690,#691);
#573=AXIS2_PLACEMENT_3D('',#861,#692,#693);
#574=AXIS2_PLACEMENT_3D('',#863,#694,#695);
#575=AXIS2_PLACEMENT_3D('',#865,#696,#697);
#576=AXIS2_PLACEMENT_3D('',#867,#698,#699);
#577=AXIS2_PLACEMENT_3D('',#869,#700,#701);
#578=AXIS2_PLACEMENT_3D('',#871,#702,#703);
#579=AXIS2_PLACEMENT_3D('',#873,#704,#705);
#580=AXIS2_PLACEMENT_3D('',#874,#706,#707);
#581=AXIS2_PLACEMENT_3D('',#876,#708,#709);
#582=AXIS2_PLACEMENT_3D('',#878,#710,#711);
#583=AXIS2_PLACEMENT_3D('',#879,#712,#713);
#584=AXIS2_PLACEMENT_3D('',#880,#714,#715);
#585=AXIS2_PLACEMENT_3D('',#882,#716,#717);
#586=AXIS2_PLACEMENT_3D('',#883,#718,#719);
#587=AXIS2_PLACEMENT_3D('',#884,#720,#721);
#588=AXIS2_PLACEMENT_3D('',#886,#722,#723);
#589=AXIS2_PLACEMENT_3D('',#888,#724,#725);
#590=AXIS2_PLACEMENT_3D('',#889,#726,#727);
#591=AXIS2_PLACEMENT_3D('',#890,#728,#729);
#592=AXIS2_PLACEMENT_3D('',#892,#730,#731);
#593=AXIS2_PLACEMENT_3D('',#893,#732,#733);
#594=AXIS2_PLACEMENT_3D('',#895,#734,#735);
#595=AXIS2_PLACEMENT_3D('',#897,#736,#737);
#596=AXIS2_PLACEMENT_3D('',#898,#738,#739);
#597=AXIS2_PLACEMENT_3D('',#899,#740,#741);
#598=AXIS2_PLACEMENT_3D('',#901,#742,#743);
#599=AXIS2_PLACEMENT_3D('',#902,#744,#745);
#600=AXIS2_PLACEMENT_3D('',#903,#746,#747);
#601=AXIS2_PLACEMENT_3D('',#905,#748,#749);
#602=AXIS2_PLACEMENT_3D('',#906,#750,#751);
#603=AXIS2_PLACEMENT_3D('',#907,#752,#753);
#604=AXIS2_PLACEMENT_3D('',#909,#754,#755);
#605=AXIS2_PLACEMENT_3D('',#910,#756,#757);
#606=AXIS2_PLACEMENT_3D('',#911,#758,#759);
#607=AXIS2_PLACEMENT_3D('',#913,#760,#761);
#608=AXIS2_PLACEMENT_3D('',#914,#762,#763);
#609=AXIS2_PLACEMENT_3D('',#915,#764,#765);
#610=AXIS2_PLACEMENT_3D('',#917,#766,#767);
#611=AXIS2_PLACEMENT_3D('',#918,#768,#769);
#612=AXIS2_PLACEMENT_3D('',#919,#770,#771);
#613=AXIS2_PLACEMENT_3D('',#921,#772,#773);
#614=AXIS2_PLACEMENT_3D('',#922,#774,#775);
#615=AXIS2_PLACEMENT_3D('',#923,#776,#777);
#616=AXIS2_PLACEMENT_3D('',#925,#778,#779);
#617=AXIS2_PLACEMENT_3D('',#926,#780,#781);
#618=DIRECTION('',(0.,0.,1.));
#619=DIRECTION('',(1.,0.,0.));
#620=DIRECTION('',(-1.,0.,0.));
#621=DIRECTION('',(0.,0.,1.));
#622=DIRECTION('',(1.,0.,0.));
#623=DIRECTION('',(-1.,0.,0.));
#624=DIRECTION('',(0.,0.,1.));
#625=DIRECTION('',(1.,0.,0.));
#626=DIRECTION('',(0.,0.,1.));
#627=DIRECTION('',(1.,0.,0.));
#628=DIRECTION('',(0.,0.,1.));
#629=DIRECTION('',(1.,0.,0.));
#630=DIRECTION('',(0.,0.,-1.));
#631=DIRECTION('',(0.,0.707106781186548,-0.707106781186547));
#632=DIRECTION('',(0.,0.707106781186547,0.707106781186548));
#633=DIRECTION('',(0.,0.,1.));
#634=DIRECTION('',(0.,0.,-1.));
#635=DIRECTION('',(1.,0.,0.));
#636=DIRECTION('',(0.,0.,1.));
#637=DIRECTION('',(0.,0.707106781186548,0.707106781186547));
#638=DIRECTION('',(0.,-0.707106781186547,0.707106781186548));
#639=DIRECTION('',(0.,0.,-1.));
#640=DIRECTION('',(0.,0.,-1.));
#641=DIRECTION('',(1.,0.,0.));
#642=DIRECTION('',(0.,0.,1.));
#643=DIRECTION('',(1.,0.,0.));
#644=DIRECTION('',(0.,0.,-1.));
#645=DIRECTION('',(-1.,0.,3.80497671699796E-17));
#646=DIRECTION('',(0.,0.,-1.));
#647=DIRECTION('',(-1.,0.,3.80497671699796E-17));
#648=DIRECTION('',(0.,0.,-1.));
#649=DIRECTION('',(-1.,0.,0.));
#650=DIRECTION('',(1.,0.,0.));
#651=DIRECTION('',(0.,-1.,-1.44560289664734E-16));
#652=DIRECTION('',(0.,1.44415729375069E-16,-1.));
#653=DIRECTION('',(0.,0.707106781186548,0.707106781186547));
#654=DIRECTION('',(0.,-0.707106781186547,0.707106781186548));
#655=DIRECTION('',(1.,0.,0.));
#656=DIRECTION('',(0.,-0.707106781186548,0.707106781186547));
#657=DIRECTION('',(0.,-0.707106781186547,-0.707106781186548));
#658=DIRECTION('',(0.,-1.,-1.40946282423116E-15));
#659=DIRECTION('',(0.,1.40946282423116E-15,-1.));
#660=DIRECTION('',(0.,0.,-1.));
#661=DIRECTION('',(-1.,0.,0.));
#662=DIRECTION('',(0.,0.,1.));
#663=DIRECTION('',(1.,0.,0.));
#664=DIRECTION('',(0.,0.,1.));
#665=DIRECTION('',(1.,0.,0.));
#666=DIRECTION('',(0.,0.,-1.));
#667=DIRECTION('',(-1.,0.,0.));
#668=DIRECTION('',(0.,0.,-1.));
#669=DIRECTION('',(-1.,0.,0.));
#670=DIRECTION('',(0.,0.,1.));
#671=DIRECTION('',(1.,0.,0.));
#672=DIRECTION('',(0.,0.,-1.));
#673=DIRECTION('',(-1.,0.,0.));
#674=DIRECTION('',(0.,0.,-1.));
#675=DIRECTION('',(1.,0.,0.));
#676=DIRECTION('',(0.,0.,1.));
#677=DIRECTION('',(1.,0.,0.));
#678=DIRECTION('',(0.,0.,-1.));
#679=DIRECTION('',(1.,0.,0.));
#680=DIRECTION('',(0.,0.,1.));
#681=DIRECTION('',(1.,0.,0.));
#682=DIRECTION('',(0.,0.,1.));
#683=DIRECTION('',(1.,0.,0.));
#684=DIRECTION('',(0.,0.,-1.));
#685=DIRECTION('',(1.,0.,0.));
#686=DIRECTION('',(0.,0.,1.));
#687=DIRECTION('',(-1.,0.,0.));
#688=DIRECTION('',(0.,0.,-1.));
#689=DIRECTION('',(1.,0.,0.));
#690=DIRECTION('',(0.,0.,-1.));
#691=DIRECTION('',(-0.499999999999997,0.866025403784441,0.));
#692=DIRECTION('',(0.,0.,-1.));
#693=DIRECTION('',(0.500000000000003,0.866025403784437,0.));
#694=DIRECTION('',(0.,0.,-1.));
#695=DIRECTION('',(1.,-2.16840434497101E-15,0.));
#696=DIRECTION('',(0.,0.,-1.));
#697=DIRECTION('',(0.499999999999999,-0.866025403784439,0.));
#698=DIRECTION('',(0.,0.,-1.));
#699=DIRECTION('',(-0.500000000000001,-0.866025403784439,0.));
#700=DIRECTION('',(0.,0.,-1.));
#701=DIRECTION('',(-1.,0.,0.));
#702=DIRECTION('',(0.,0.,1.));
#703=DIRECTION('',(1.,0.,0.));
#704=DIRECTION('',(0.,0.,1.));
#705=DIRECTION('',(1.,0.,0.));
#706=DIRECTION('',(0.,0.,1.));
#707=DIRECTION('',(1.,0.,0.));
#708=DIRECTION('',(0.,0.,1.));
#709=DIRECTION('',(1.,0.,0.));
#710=DIRECTION('',(0.,0.,1.));
#711=DIRECTION('',(1.,0.,0.));
#712=DIRECTION('',(0.,0.,1.));
#713=DIRECTION('',(1.,0.,0.));
#714=DIRECTION('',(0.,0.,1.));
#715=DIRECTION('',(1.,0.,0.));
#716=DIRECTION('',(0.,0.,1.));
#717=DIRECTION('',(1.,0.,0.));
#718=DIRECTION('',(0.,0.,1.));
#719=DIRECTION('',(1.,0.,0.));
#720=DIRECTION('',(0.,0.,1.));
#721=DIRECTION('',(-1.,0.,0.));
#722=DIRECTION('',(0.,0.,1.));
#723=DIRECTION('',(-1.,0.,0.));
#724=DIRECTION('',(0.,0.,-1.));
#725=DIRECTION('',(-1.,0.,0.));
#726=DIRECTION('',(0.,0.,-1.));
#727=DIRECTION('',(-1.,0.,0.));
#728=DIRECTION('',(0.,0.,1.));
#729=DIRECTION('',(-1.,0.,0.));
#730=DIRECTION('',(0.,0.,-1.));
#731=DIRECTION('',(-1.,0.,0.));
#732=DIRECTION('',(0.,0.,1.));
#733=DIRECTION('',(1.,0.,0.));
#734=DIRECTION('',(0.,0.,-1.));
#735=DIRECTION('',(-1.,0.,0.));
#736=DIRECTION('',(0.,0.,-1.));
#737=DIRECTION('',(-1.,0.,0.));
#738=DIRECTION('',(0.,0.,-1.));
#739=DIRECTION('',(1.,0.,0.));
#740=DIRECTION('',(0.,0.,1.));
#741=DIRECTION('',(-1.,0.,0.));
#742=DIRECTION('',(0.,0.,-1.));
#743=DIRECTION('',(-1.,0.,0.));
#744=DIRECTION('',(0.,0.,-1.));
#745=DIRECTION('',(-1.,0.,0.));
#746=DIRECTION('',(0.,0.,-1.));
#747=DIRECTION('',(-0.500000000000001,-0.866025403784439,0.));
#748=DIRECTION('',(0.,0.,-1.));
#749=DIRECTION('',(-0.500000000000001,-0.866025403784438,0.));
#750=DIRECTION('',(0.,0.,-1.));
#751=DIRECTION('',(-0.500000000000001,-0.866025403784439,0.));
#752=DIRECTION('',(0.,0.,-1.));
#753=DIRECTION('',(0.499999999999999,-0.866025403784439,0.));
#754=DIRECTION('',(0.,0.,-1.));
#755=DIRECTION('',(0.499999999999999,-0.866025403784439,0.));
#756=DIRECTION('',(0.,0.,-1.));
#757=DIRECTION('',(0.499999999999999,-0.866025403784439,0.));
#758=DIRECTION('',(0.,0.,-1.));
#759=DIRECTION('',(1.,-2.16840434497101E-15,0.));
#760=DIRECTION('',(0.,0.,-1.));
#761=DIRECTION('',(1.,-2.34361141604467E-15,0.));
#762=DIRECTION('',(0.,0.,-1.));
#763=DIRECTION('',(1.,-2.16840434497101E-15,0.));
#764=DIRECTION('',(0.,0.,-1.));
#765=DIRECTION('',(0.500000000000003,0.866025403784437,0.));
#766=DIRECTION('',(0.,0.,-1.));
#767=DIRECTION('',(0.500000000000003,0.866025403784437,0.));
#768=DIRECTION('',(0.,0.,-1.));
#769=DIRECTION('',(0.500000000000003,0.866025403784437,0.));
#770=DIRECTION('',(0.,0.,-1.));
#771=DIRECTION('',(-0.499999999999997,0.866025403784441,0.));
#772=DIRECTION('',(0.,0.,-1.));
#773=DIRECTION('',(-0.499999999999996,0.866025403784441,0.));
#774=DIRECTION('',(0.,0.,-1.));
#775=DIRECTION('',(-0.499999999999997,0.866025403784441,0.));
#776=DIRECTION('',(0.,0.,-1.));
#777=DIRECTION('',(1.,0.,0.));
#778=DIRECTION('',(0.,0.,1.));
#779=DIRECTION('',(1.,0.,0.));
#780=DIRECTION('',(0.,0.,1.));
#781=DIRECTION('',(1.,0.,0.));
#782=CARTESIAN_POINT('',(0.,0.,0.));
#783=CARTESIAN_POINT('',(3.,-2.50000000000002,21.));
#784=CARTESIAN_POINT('',(1.26095202129182,-2.50000000000002,21.));
#785=CARTESIAN_POINT('',(-1.26095202129182,-2.50000000000002,21.));
#786=CARTESIAN_POINT('',(0.,0.,21.));
#787=CARTESIAN_POINT('',(1.26095202129186,2.49999999999999,21.));
#788=CARTESIAN_POINT('',(3.,2.49999999999999,21.));
#789=CARTESIAN_POINT('',(-1.26095202129171,2.49999999999999,21.));
#790=CARTESIAN_POINT('',(0.,0.,21.));
#791=CARTESIAN_POINT('',(0.,0.,21.));
#792=CARTESIAN_POINT('',(0.,0.,0.));
#793=CARTESIAN_POINT('',(3.,0.,0.));
#794=CARTESIAN_POINT('',(1.65831239517772,-2.49999999999999,-3.52365706057787E-15));
#795=CARTESIAN_POINT('',(1.65831239517768,-2.50000000000002,20.8));
#796=CARTESIAN_POINT('',(1.65831239517772,-2.49999999999999,9.00000000000001));
#797=CARTESIAN_POINT('',(0.,0.,11.5));
#798=CARTESIAN_POINT('',(-1.65831239517772,-2.49999999999999,9.00000000000001));
#799=CARTESIAN_POINT('',(-1.65831239517772,-2.49999999999999,-3.52365706057787E-15));
#800=CARTESIAN_POINT('',(-1.65831239517969,-2.50000000000002,20.7999999999999));
#801=CARTESIAN_POINT('',(0.,0.,20.8));
#802=CARTESIAN_POINT('',(-1.65831239517972,2.49999999999999,20.7999999999999));
#803=CARTESIAN_POINT('',(-1.65831239517771,2.5,3.61400724161834E-16));
#804=CARTESIAN_POINT('',(-1.65831239517771,2.5,9.00000000000001));
#805=CARTESIAN_POINT('',(0.,0.,11.5));
#806=CARTESIAN_POINT('',(1.65831239517771,2.5,9.00000000000001));
#807=CARTESIAN_POINT('',(1.65831239517771,2.5,3.61400724161834E-16));
#808=CARTESIAN_POINT('',(1.65831239517771,2.49999999999999,20.8));
#809=CARTESIAN_POINT('',(0.,0.,20.8));
#810=CARTESIAN_POINT('',(0.,0.,0.));
#811=CARTESIAN_POINT('',(-1.65831239517939,-2.50000000000002,20.7999999999993));
#812=CARTESIAN_POINT('',(-1.52835666937828,-2.50000000000002,20.8718357303061));
#813=CARTESIAN_POINT('',(-1.39619040514283,-2.50000000000002,20.9390967451882));
#814=CARTESIAN_POINT('',(-1.26095202129183,-2.50000000000002,21.));
#815=CARTESIAN_POINT('',(-1.65831239517942,2.49999999999999,20.7999999999993));
#816=CARTESIAN_POINT('',(-1.52835666937828,2.49999999999999,20.8718357303061));
#817=CARTESIAN_POINT('',(-1.39619040514279,2.49999999999999,20.9390967451882));
#818=CARTESIAN_POINT('',(-1.26095202129176,2.49999999999999,21.0000000000001));
#819=CARTESIAN_POINT('',(0.,0.,20.8));
#820=CARTESIAN_POINT('',(1.26095202129185,-2.50000000000002,21.0000000000001));
#821=CARTESIAN_POINT('',(1.39660693327473,-2.50000000000002,20.9389091659061));
#822=CARTESIAN_POINT('',(1.52871356573638,-2.50000000000002,20.871638448421));
#823=CARTESIAN_POINT('',(1.65831239517767,-2.50000000000002,20.8));
#824=CARTESIAN_POINT('',(1.2609520212919,2.49999999999999,21.0000000000001));
#825=CARTESIAN_POINT('',(1.39660693327477,2.49999999999999,20.9389091659061));
#826=CARTESIAN_POINT('',(1.52871356573642,2.49999999999999,20.871638448421));
#827=CARTESIAN_POINT('',(1.65831239517771,2.49999999999999,20.8));
#828=CARTESIAN_POINT('',(0.,0.,20.8));
#829=CARTESIAN_POINT('',(0.,0.,0.));
#830=CARTESIAN_POINT('',(3.,2.49999999999999,9.00000000000001));
#831=CARTESIAN_POINT('',(3.,2.49999999999999,9.00000000000001));
#832=CARTESIAN_POINT('',(-1.00570593519755E-12,2.49999999999999,9.00000000000001));
#833=CARTESIAN_POINT('',(-9.8358821087885E-13,-2.5,9.));
#834=CARTESIAN_POINT('',(-9.8358821087885E-13,-2.5,9.));
#835=CARTESIAN_POINT('',(3.,-2.5,9.));
#836=CARTESIAN_POINT('',(0.,0.,-23.25));
#837=CARTESIAN_POINT('',(-10.3999999999995,0.,-23.25));
#838=CARTESIAN_POINT('',(0.,0.,-23.2));
#839=CARTESIAN_POINT('',(10.3999999999995,0.,-23.2));
#840=CARTESIAN_POINT('',(0.,0.,-23.25));
#841=CARTESIAN_POINT('',(0.,0.,-23.25));
#842=CARTESIAN_POINT('',(-6.,0.,-23.25));
#843=CARTESIAN_POINT('',(0.,0.,-22.05));
#844=CARTESIAN_POINT('',(-6.,0.,-22.05));
#845=CARTESIAN_POINT('',(0.,0.,-23.25));
#846=CARTESIAN_POINT('',(0.,0.,-23.25));
#847=CARTESIAN_POINT('',(0.,-3.3881317890172E-18,-17.3));
#848=CARTESIAN_POINT('',(5.034,-3.3881317890172E-18,-17.3));
#849=CARTESIAN_POINT('',(0.,-3.3881317890172E-18,-17.3));
#850=CARTESIAN_POINT('',(0.,-3.3881317890172E-18,-22.05));
#851=CARTESIAN_POINT('',(5.034,-3.3881317890172E-18,-22.05));
#852=CARTESIAN_POINT('',(0.,-3.3881317890172E-18,-24.5));
#853=CARTESIAN_POINT('',(0.,-3.3881317890172E-18,-22.05));
#854=CARTESIAN_POINT('',(0.,0.,0.));
#855=CARTESIAN_POINT('',(11.,0.,0.));
#856=CARTESIAN_POINT('',(0.,0.,-4.7999));
#857=CARTESIAN_POINT('',(-11.,0.,-4.7999));
#858=CARTESIAN_POINT('',(0.,0.,0.));
#859=CARTESIAN_POINT('',(8.22724133595219,4.74999999999996,0.));
#860=CARTESIAN_POINT('',(7.82724133595219,5.44282032302752,0.));
#861=CARTESIAN_POINT('',(8.22724133595215,-4.75000000000002,0.));
#862=CARTESIAN_POINT('',(8.62724133595215,-4.05717967697248,0.));
#863=CARTESIAN_POINT('',(-2.2257651927068E-14,-9.5,0.));
#864=CARTESIAN_POINT('',(0.799999999999978,-9.5,0.));
#865=CARTESIAN_POINT('',(-8.22724133595217,-4.74999999999999,0.));
#866=CARTESIAN_POINT('',(-7.82724133595217,-5.44282032302754,0.));
#867=CARTESIAN_POINT('',(-8.22724133595216,4.75000000000001,0.));
#868=CARTESIAN_POINT('',(-8.62724133595216,4.05717967697245,0.));
#869=CARTESIAN_POINT('',(0.,9.5,0.));
#870=CARTESIAN_POINT('',(-0.8,9.5,0.));
#871=CARTESIAN_POINT('',(0.,-8.67361737988404E-16,0.));
#872=CARTESIAN_POINT('',(7.5,-8.67361737988404E-16,0.));
#873=CARTESIAN_POINT('',(0.,0.,0.));
#874=CARTESIAN_POINT('',(4.33680868994202E-16,-1.30104260698261E-15,1.5));
#875=CARTESIAN_POINT('',(4.,-1.30104260698261E-15,1.5));
#876=CARTESIAN_POINT('',(0.,-8.67361737988404E-16,1.5));
#877=CARTESIAN_POINT('',(7.5,-8.67361737988404E-16,1.5));
#878=CARTESIAN_POINT('',(0.,-8.67361737988404E-16,1.5));
#879=CARTESIAN_POINT('',(0.,-8.67361737988404E-16,0.));
#880=CARTESIAN_POINT('',(4.33680868994202E-16,-1.30104260698261E-15,3.1));
#881=CARTESIAN_POINT('',(4.,-1.30104260698261E-15,3.1));
#882=CARTESIAN_POINT('',(4.33680868994202E-16,-1.30104260698261E-15,3.1));
#883=CARTESIAN_POINT('',(4.33680868994202E-16,-1.30104260698261E-15,1.5));
#884=CARTESIAN_POINT('',(0.,0.,-4.8));
#885=CARTESIAN_POINT('',(-10.9995,0.,-4.8));
#886=CARTESIAN_POINT('',(0.,0.,-4.7999));
#887=CARTESIAN_POINT('',(-10.9995,0.,-4.7999));
#888=CARTESIAN_POINT('',(0.,0.,-4.79995));
#889=CARTESIAN_POINT('',(0.,0.,-4.7999));
#890=CARTESIAN_POINT('',(0.,0.,-4.8));
#891=CARTESIAN_POINT('',(-11.,0.,-4.8));
#892=CARTESIAN_POINT('',(0.,0.,-4.8));
#893=CARTESIAN_POINT('',(0.,-3.3881317890172E-18,-24.5));
#894=CARTESIAN_POINT('',(10.5,-3.3881317890172E-18,-24.5));
#895=CARTESIAN_POINT('',(0.,-3.3881317890172E-18,-24.5));
#896=CARTESIAN_POINT('',(-11.,-3.3881317890172E-18,-24.5));
#897=CARTESIAN_POINT('',(0.,-3.3881317890172E-18,-24.5));
#898=CARTESIAN_POINT('',(0.,0.,0.));
#899=CARTESIAN_POINT('',(0.,9.5,-3.));
#900=CARTESIAN_POINT('',(-0.8,9.5,-3.));
#901=CARTESIAN_POINT('',(0.,9.5,-3.));
#902=CARTESIAN_POINT('',(0.,9.5,0.));
#903=CARTESIAN_POINT('',(-8.22724133595216,4.75000000000001,-3.));
#904=CARTESIAN_POINT('',(-8.62724133595216,4.05717967697245,-3.));
#905=CARTESIAN_POINT('',(-8.22724133595216,4.75000000000001,-3.));
#906=CARTESIAN_POINT('',(-8.22724133595216,4.75000000000001,0.));
#907=CARTESIAN_POINT('',(-8.22724133595217,-4.74999999999999,-3.));
#908=CARTESIAN_POINT('',(-7.82724133595217,-5.44282032302754,-3.));
#909=CARTESIAN_POINT('',(-8.22724133595217,-4.74999999999999,-3.));
#910=CARTESIAN_POINT('',(-8.22724133595217,-4.74999999999999,0.));
#911=CARTESIAN_POINT('',(-2.2257651927068E-14,-9.5,-3.));
#912=CARTESIAN_POINT('',(0.799999999999978,-9.5,-3.));
#913=CARTESIAN_POINT('',(-2.2257651927068E-14,-9.5,-3.));
#914=CARTESIAN_POINT('',(-2.2257651927068E-14,-9.5,0.));
#915=CARTESIAN_POINT('',(8.22724133595215,-4.75000000000002,-3.));
#916=CARTESIAN_POINT('',(8.62724133595215,-4.05717967697248,-3.));
#917=CARTESIAN_POINT('',(8.22724133595215,-4.75000000000002,-3.));
#918=CARTESIAN_POINT('',(8.22724133595215,-4.75000000000002,0.));
#919=CARTESIAN_POINT('',(8.22724133595219,4.74999999999996,-3.));
#920=CARTESIAN_POINT('',(7.82724133595219,5.44282032302752,-3.));
#921=CARTESIAN_POINT('',(8.22724133595219,4.74999999999996,-3.));
#922=CARTESIAN_POINT('',(8.22724133595219,4.74999999999996,0.));
#923=CARTESIAN_POINT('',(0.,-3.3881317890172E-18,-23.2));
#924=CARTESIAN_POINT('',(10.5,-3.3881317890172E-18,-23.2));
#925=CARTESIAN_POINT('',(0.,-3.3881317890172E-18,-23.2));
#926=CARTESIAN_POINT('',(0.,-3.3881317890172E-18,-24.5));
#927=MECHANICAL_DESIGN_GEOMETRIC_PRESENTATION_REPRESENTATION('',(#30,#23,
#31,#24,#25,#26),#928);
#928=(
GEOMETRIC_REPRESENTATION_CONTEXT(3)
GLOBAL_UNCERTAINTY_ASSIGNED_CONTEXT((#929))
GLOBAL_UNIT_ASSIGNED_CONTEXT((#935,#931,#930))
REPRESENTATION_CONTEXT('F0013963500-A-P2016.038',
'TOP_LEVEL_ASSEMBLY_PART')
);
#929=UNCERTAINTY_MEASURE_WITH_UNIT(LENGTH_MEASURE(0.0508),#935,
'DISTANCE_ACCURACY_VALUE','Maximum Tolerance applied to model');
#930=(
NAMED_UNIT(*)
SI_UNIT($,.STERADIAN.)
SOLID_ANGLE_UNIT()
);
#931=(
CONVERSION_BASED_UNIT('DEGREE',#933)
NAMED_UNIT(#932)
PLANE_ANGLE_UNIT()
);
#932=DIMENSIONAL_EXPONENTS(0.,0.,0.,0.,0.,0.,0.);
#933=PLANE_ANGLE_MEASURE_WITH_UNIT(PLANE_ANGLE_MEASURE(0.0174532925),#934);
#934=(
NAMED_UNIT(*)
PLANE_ANGLE_UNIT()
SI_UNIT($,.RADIAN.)
);
#935=(
LENGTH_UNIT()
NAMED_UNIT(*)
SI_UNIT(.MILLI.,.METRE.)
);
ENDSEC;
END-ISO-10303-21;
