%!PS-Adobe-3.0 EPSF-3.0
%%Title: pics\gyro_exp_zoom_sphere_2.eps
%%Creator: matplotlib version 3.2.1, http://matplotlib.org/
%%CreationDate: Sat Apr 10 16:53:38 2021
%%Orientation: portrait
%%BoundingBox: -594.0 216.0 1206.0 576.0
%%EndComments
%%BeginProlog
/mpldict 8 dict def
mpldict begin
/m { moveto } bind def
/l { lineto } bind def
/r { rlineto } bind def
/c { curveto } bind def
/cl { closepath } bind def
/box {
m
1 index 0 r
0 exch r
neg 0 r
cl
} bind def
/clipbox {
box
clip
newpath
} bind def
%!PS-Adobe-3.0 Resource-Font
%%Title: DejaVu Sans
%%Copyright: Copyright (c) 2003 by Bitstream, Inc. All Rights Reserved. Copyright (c) 2006 by Tavmjong Bah. All Rights Reserved. DejaVu changes are in public domain 
%%Creator: Converted from TrueType to type 3 by PPR
25 dict begin
/_d{bind def}bind def
/_m{moveto}_d
/_l{lineto}_d
/_cl{closepath eofill}_d
/_c{curveto}_d
/_sc{7 -1 roll{setcachedevice}{pop pop pop pop pop pop}ifelse}_d
/_e{exec}_d
/FontName /DejaVuSans def
/PaintType 0 def
/FontMatrix[.001 0 0 .001 0 0]def
/FontBBox[-1021 -463 1793 1232]def
/FontType 3 def
/Encoding [ /space /period /zero /one /two /three /four /five /six /seven /eight /nine /A /E /H /T /Z /bracketleft /bracketright /a /b /c /e /g /i /l /m /n /o /p /r /s /t /u /v /x /y /z ] def
/FontInfo 10 dict dup begin
/FamilyName (DejaVu Sans) def
/FullName (DejaVu Sans) def
/Notice (Copyright (c) 2003 by Bitstream, Inc. All Rights Reserved. Copyright (c) 2006 by Tavmjong Bah. All Rights Reserved. DejaVu changes are in public domain ) def
/Weight (Book) def
/Version (Version 2.35) def
/ItalicAngle 0.0 def
/isFixedPitch false def
/UnderlinePosition -130 def
/UnderlineThickness 90 def
end readonly def
/CharStrings 39 dict dup begin
/.notdef 0 def
/space{318 0 0 0 0 0 _sc
}_d
/period{318 0 107 0 210 124 _sc
107 124 _m
210 124 _l
210 0 _l
107 0 _l
107 124 _l
_cl}_d
/zero{636 0 66 -13 570 742 _sc
318 664 _m
267 664 229 639 203 589 _c
177 539 165 464 165 364 _c
165 264 177 189 203 139 _c
229 89 267 64 318 64 _c
369 64 407 89 433 139 _c
458 189 471 264 471 364 _c
471 464 458 539 433 589 _c
407 639 369 664 318 664 _c
318 742 _m
399 742 461 709 505 645 _c
548 580 570 486 570 364 _c
570 241 548 147 505 83 _c
461 19 399 -13 318 -13 _c
236 -13 173 19 130 83 _c
87 147 66 241 66 364 _c
66 486 87 580 130 645 _c
173 709 236 742 318 742 _c
_cl}_d
/one{636 0 110 0 544 729 _sc
124 83 _m
285 83 _l
285 639 _l
110 604 _l
110 694 _l
284 729 _l
383 729 _l
383 83 _l
544 83 _l
544 0 _l
124 0 _l
124 83 _l
_cl}_d
/two{{636 0 73 0 536 742 _sc
192 83 _m
536 83 _l
536 0 _l
73 0 _l
73 83 _l
110 121 161 173 226 239 _c
290 304 331 346 348 365 _c
380 400 402 430 414 455 _c
426 479 433 504 433 528 _c
433 566 419 598 392 622 _c
365 646 330 659 286 659 _c
255 659 222 653 188 643 _c
154 632 117 616 78 594 _c
78 694 _l
118 710 155 722 189 730 _c
223 738 255 742 284 742 _c
}_e{359 742 419 723 464 685 _c
509 647 532 597 532 534 _c
532 504 526 475 515 449 _c
504 422 484 390 454 354 _c
446 344 420 317 376 272 _c
332 227 271 164 192 83 _c
_cl}_e}_d
/three{{636 0 76 -13 556 742 _sc
406 393 _m
453 383 490 362 516 330 _c
542 298 556 258 556 212 _c
556 140 531 84 482 45 _c
432 6 362 -13 271 -13 _c
240 -13 208 -10 176 -4 _c
144 1 110 10 76 22 _c
76 117 _l
103 101 133 89 166 81 _c
198 73 232 69 268 69 _c
330 69 377 81 409 105 _c
441 129 458 165 458 212 _c
458 254 443 288 413 312 _c
383 336 341 349 287 349 _c
}_e{202 349 _l
202 430 _l
291 430 _l
339 430 376 439 402 459 _c
428 478 441 506 441 543 _c
441 580 427 609 401 629 _c
374 649 336 659 287 659 _c
260 659 231 656 200 650 _c
169 644 135 635 98 623 _c
98 711 _l
135 721 170 729 203 734 _c
235 739 266 742 296 742 _c
370 742 429 725 473 691 _c
517 657 539 611 539 553 _c
539 513 527 479 504 451 _c
481 423 448 403 406 393 _c
_cl}_e}_d
/four{636 0 49 0 580 729 _sc
378 643 _m
129 254 _l
378 254 _l
378 643 _l
352 729 _m
476 729 _l
476 254 _l
580 254 _l
580 172 _l
476 172 _l
476 0 _l
378 0 _l
378 172 _l
49 172 _l
49 267 _l
352 729 _l
_cl}_d
/five{{636 0 77 -13 549 729 _sc
108 729 _m
495 729 _l
495 646 _l
198 646 _l
198 467 _l
212 472 227 476 241 478 _c
255 480 270 482 284 482 _c
365 482 429 459 477 415 _c
525 370 549 310 549 234 _c
549 155 524 94 475 51 _c
426 8 357 -13 269 -13 _c
238 -13 207 -10 175 -6 _c
143 -1 111 6 77 17 _c
77 116 _l
106 100 136 88 168 80 _c
199 72 232 69 267 69 _c
}_e{323 69 368 83 401 113 _c
433 143 450 183 450 234 _c
450 284 433 324 401 354 _c
368 384 323 399 267 399 _c
241 399 214 396 188 390 _c
162 384 135 375 108 363 _c
108 729 _l
_cl}_e}_d
/six{{636 0 70 -13 573 742 _sc
330 404 _m
286 404 251 388 225 358 _c
199 328 186 286 186 234 _c
186 181 199 139 225 109 _c
251 79 286 64 330 64 _c
374 64 409 79 435 109 _c
461 139 474 181 474 234 _c
474 286 461 328 435 358 _c
409 388 374 404 330 404 _c
526 713 _m
526 623 _l
501 635 476 644 451 650 _c
425 656 400 659 376 659 _c
310 659 260 637 226 593 _c
}_e{192 549 172 482 168 394 _c
187 422 211 444 240 459 _c
269 474 301 482 336 482 _c
409 482 467 459 509 415 _c
551 371 573 310 573 234 _c
573 159 550 99 506 54 _c
462 9 403 -13 330 -13 _c
246 -13 181 19 137 83 _c
92 147 70 241 70 364 _c
70 479 97 571 152 639 _c
206 707 280 742 372 742 _c
396 742 421 739 447 735 _c
472 730 498 723 526 713 _c
_cl}_e}_d
/seven{636 0 82 0 551 729 _sc
82 729 _m
551 729 _l
551 687 _l
286 0 _l
183 0 _l
432 646 _l
82 646 _l
82 729 _l
_cl}_d
/eight{{636 0 68 -13 568 742 _sc
318 346 _m
271 346 234 333 207 308 _c
180 283 167 249 167 205 _c
167 161 180 126 207 101 _c
234 76 271 64 318 64 _c
364 64 401 76 428 102 _c
455 127 469 161 469 205 _c
469 249 455 283 429 308 _c
402 333 365 346 318 346 _c
219 388 _m
177 398 144 418 120 447 _c
96 476 85 511 85 553 _c
85 611 105 657 147 691 _c
188 725 245 742 318 742 _c
}_e{390 742 447 725 489 691 _c
530 657 551 611 551 553 _c
551 511 539 476 515 447 _c
491 418 459 398 417 388 _c
464 377 501 355 528 323 _c
554 291 568 251 568 205 _c
568 134 546 80 503 43 _c
459 5 398 -13 318 -13 _c
237 -13 175 5 132 43 _c
89 80 68 134 68 205 _c
68 251 81 291 108 323 _c
134 355 171 377 219 388 _c
183 544 _m
183 506 194 476 218 455 _c
}_e{242 434 275 424 318 424 _c
360 424 393 434 417 455 _c
441 476 453 506 453 544 _c
453 582 441 611 417 632 _c
393 653 360 664 318 664 _c
275 664 242 653 218 632 _c
194 611 183 582 183 544 _c
_cl}_e}_d
/nine{{636 0 63 -13 566 742 _sc
110 15 _m
110 105 _l
134 93 159 84 185 78 _c
210 72 235 69 260 69 _c
324 69 374 90 408 134 _c
442 178 462 244 468 334 _c
448 306 424 284 396 269 _c
367 254 335 247 300 247 _c
226 247 168 269 126 313 _c
84 357 63 417 63 494 _c
63 568 85 628 129 674 _c
173 719 232 742 306 742 _c
390 742 455 709 499 645 _c
543 580 566 486 566 364 _c
}_e{566 248 538 157 484 89 _c
429 21 356 -13 264 -13 _c
239 -13 214 -10 189 -6 _c
163 -2 137 5 110 15 _c
306 324 _m
350 324 385 339 411 369 _c
437 399 450 441 450 494 _c
450 546 437 588 411 618 _c
385 648 350 664 306 664 _c
262 664 227 648 201 618 _c
175 588 162 546 162 494 _c
162 441 175 399 201 369 _c
227 339 262 324 306 324 _c
_cl}_e}_d
/A{684 0 8 0 676 729 _sc
342 632 _m
208 269 _l
476 269 _l
342 632 _l
286 729 _m
398 729 _l
676 0 _l
573 0 _l
507 187 _l
178 187 _l
112 0 _l
8 0 _l
286 729 _l
_cl}_d
/E{632 0 98 0 568 729 _sc
98 729 _m
559 729 _l
559 646 _l
197 646 _l
197 430 _l
544 430 _l
544 347 _l
197 347 _l
197 83 _l
568 83 _l
568 0 _l
98 0 _l
98 729 _l
_cl}_d
/H{752 0 98 0 654 729 _sc
98 729 _m
197 729 _l
197 430 _l
555 430 _l
555 729 _l
654 729 _l
654 0 _l
555 0 _l
555 347 _l
197 347 _l
197 0 _l
98 0 _l
98 729 _l
_cl}_d
/T{611 0 -2 0 614 729 _sc
-2 729 _m
614 729 _l
614 646 _l
355 646 _l
355 0 _l
256 0 _l
256 646 _l
-2 646 _l
-2 729 _l
_cl}_d
/Z{685 0 45 0 640 729 _sc
56 729 _m
629 729 _l
629 654 _l
168 83 _l
640 83 _l
640 0 _l
45 0 _l
45 75 _l
506 646 _l
56 646 _l
56 729 _l
_cl}_d
/bracketleft{390 0 86 -131 293 760 _sc
86 760 _m
293 760 _l
293 690 _l
176 690 _l
176 -61 _l
293 -61 _l
293 -131 _l
86 -131 _l
86 760 _l
_cl}_d
/bracketright{390 0 97 -131 304 760 _sc
304 760 _m
304 -131 _l
97 -131 _l
97 -61 _l
214 -61 _l
214 690 _l
97 690 _l
97 760 _l
304 760 _l
_cl}_d
/a{{613 0 60 -13 522 560 _sc
343 275 _m
270 275 220 266 192 250 _c
164 233 150 205 150 165 _c
150 133 160 107 181 89 _c
202 70 231 61 267 61 _c
317 61 357 78 387 114 _c
417 149 432 196 432 255 _c
432 275 _l
343 275 _l
522 312 _m
522 0 _l
432 0 _l
432 83 _l
411 49 385 25 355 10 _c
325 -5 287 -13 243 -13 _c
187 -13 142 2 109 33 _c
76 64 60 106 60 159 _c
}_e{60 220 80 266 122 298 _c
163 329 224 345 306 345 _c
432 345 _l
432 354 _l
432 395 418 427 391 450 _c
364 472 326 484 277 484 _c
245 484 215 480 185 472 _c
155 464 127 453 100 439 _c
100 522 _l
132 534 164 544 195 550 _c
226 556 256 560 286 560 _c
365 560 424 539 463 498 _c
502 457 522 395 522 312 _c
_cl}_e}_d
/b{{635 0 91 -13 580 760 _sc
487 273 _m
487 339 473 390 446 428 _c
418 466 381 485 334 485 _c
286 485 249 466 222 428 _c
194 390 181 339 181 273 _c
181 207 194 155 222 117 _c
249 79 286 61 334 61 _c
381 61 418 79 446 117 _c
473 155 487 207 487 273 _c
181 464 _m
199 496 223 520 252 536 _c
281 552 316 560 356 560 _c
422 560 476 533 518 481 _c
559 428 580 359 580 273 _c
}_e{580 187 559 117 518 65 _c
476 13 422 -13 356 -13 _c
316 -13 281 -5 252 10 _c
223 25 199 49 181 82 _c
181 0 _l
91 0 _l
91 760 _l
181 760 _l
181 464 _l
_cl}_e}_d
/c{{550 0 55 -13 488 560 _sc
488 526 _m
488 442 _l
462 456 437 466 411 473 _c
385 480 360 484 334 484 _c
276 484 230 465 198 428 _c
166 391 150 339 150 273 _c
150 206 166 154 198 117 _c
230 80 276 62 334 62 _c
360 62 385 65 411 72 _c
437 79 462 90 488 104 _c
488 21 _l
462 9 436 0 410 -5 _c
383 -10 354 -13 324 -13 _c
242 -13 176 12 128 64 _c
}_e{79 115 55 185 55 273 _c
55 362 79 432 128 483 _c
177 534 244 560 330 560 _c
358 560 385 557 411 551 _c
437 545 463 537 488 526 _c
_cl}_e}_d
/e{{615 0 55 -13 562 560 _sc
562 296 _m
562 252 _l
149 252 _l
153 190 171 142 205 110 _c
238 78 284 62 344 62 _c
378 62 412 66 444 74 _c
476 82 509 95 541 113 _c
541 28 _l
509 14 476 3 442 -3 _c
408 -9 373 -13 339 -13 _c
251 -13 182 12 131 62 _c
80 112 55 181 55 268 _c
55 357 79 428 127 481 _c
175 533 241 560 323 560 _c
397 560 455 536 498 489 _c
}_e{540 441 562 377 562 296 _c
472 322 _m
471 371 457 410 431 440 _c
404 469 368 484 324 484 _c
274 484 234 469 204 441 _c
174 413 156 373 152 322 _c
472 322 _l
_cl}_e}_d
/g{{635 0 55 -207 544 560 _sc
454 280 _m
454 344 440 395 414 431 _c
387 467 349 485 301 485 _c
253 485 215 467 188 431 _c
161 395 148 344 148 280 _c
148 215 161 165 188 129 _c
215 93 253 75 301 75 _c
349 75 387 93 414 129 _c
440 165 454 215 454 280 _c
544 68 _m
544 -24 523 -93 482 -139 _c
440 -184 377 -207 292 -207 _c
260 -207 231 -204 203 -200 _c
175 -195 147 -188 121 -178 _c
}_e{121 -91 _l
147 -105 173 -115 199 -122 _c
225 -129 251 -133 278 -133 _c
336 -133 380 -117 410 -87 _c
439 -56 454 -10 454 52 _c
454 96 _l
435 64 411 40 382 24 _c
353 8 319 0 279 0 _c
211 0 157 25 116 76 _c
75 127 55 195 55 280 _c
55 364 75 432 116 483 _c
157 534 211 560 279 560 _c
319 560 353 552 382 536 _c
411 520 435 496 454 464 _c
454 547 _l
544 547 _l
}_e{544 68 _l
_cl}_e}_d
/i{278 0 94 0 184 760 _sc
94 547 _m
184 547 _l
184 0 _l
94 0 _l
94 547 _l
94 760 _m
184 760 _l
184 646 _l
94 646 _l
94 760 _l
_cl}_d
/l{278 0 94 0 184 760 _sc
94 760 _m
184 760 _l
184 0 _l
94 0 _l
94 760 _l
_cl}_d
/m{{974 0 91 0 889 560 _sc
520 442 _m
542 482 569 511 600 531 _c
631 550 668 560 711 560 _c
767 560 811 540 842 500 _c
873 460 889 403 889 330 _c
889 0 _l
799 0 _l
799 327 _l
799 379 789 418 771 444 _c
752 469 724 482 686 482 _c
639 482 602 466 575 435 _c
548 404 535 362 535 309 _c
535 0 _l
445 0 _l
445 327 _l
445 379 435 418 417 444 _c
398 469 369 482 331 482 _c
}_e{285 482 248 466 221 435 _c
194 404 181 362 181 309 _c
181 0 _l
91 0 _l
91 547 _l
181 547 _l
181 462 _l
201 495 226 520 255 536 _c
283 552 317 560 357 560 _c
397 560 430 550 458 530 _c
486 510 506 480 520 442 _c
_cl}_e}_d
/n{634 0 91 0 549 560 _sc
549 330 _m
549 0 _l
459 0 _l
459 327 _l
459 379 448 417 428 443 _c
408 469 378 482 338 482 _c
289 482 251 466 223 435 _c
195 404 181 362 181 309 _c
181 0 _l
91 0 _l
91 547 _l
181 547 _l
181 462 _l
202 494 227 519 257 535 _c
286 551 320 560 358 560 _c
420 560 468 540 500 501 _c
532 462 549 405 549 330 _c
_cl}_d
/o{612 0 55 -13 557 560 _sc
306 484 _m
258 484 220 465 192 427 _c
164 389 150 338 150 273 _c
150 207 163 156 191 118 _c
219 80 257 62 306 62 _c
354 62 392 80 420 118 _c
448 156 462 207 462 273 _c
462 337 448 389 420 427 _c
392 465 354 484 306 484 _c
306 560 _m
384 560 445 534 490 484 _c
534 433 557 363 557 273 _c
557 183 534 113 490 63 _c
445 12 384 -13 306 -13 _c
227 -13 165 12 121 63 _c
77 113 55 183 55 273 _c
55 363 77 433 121 484 _c
165 534 227 560 306 560 _c
_cl}_d
/p{{635 0 91 -207 580 560 _sc
181 82 _m
181 -207 _l
91 -207 _l
91 547 _l
181 547 _l
181 464 _l
199 496 223 520 252 536 _c
281 552 316 560 356 560 _c
422 560 476 533 518 481 _c
559 428 580 359 580 273 _c
580 187 559 117 518 65 _c
476 13 422 -13 356 -13 _c
316 -13 281 -5 252 10 _c
223 25 199 49 181 82 _c
487 273 _m
487 339 473 390 446 428 _c
418 466 381 485 334 485 _c
}_e{286 485 249 466 222 428 _c
194 390 181 339 181 273 _c
181 207 194 155 222 117 _c
249 79 286 61 334 61 _c
381 61 418 79 446 117 _c
473 155 487 207 487 273 _c
_cl}_e}_d
/r{411 0 91 0 411 560 _sc
411 463 _m
401 469 390 473 378 476 _c
366 478 353 480 339 480 _c
288 480 249 463 222 430 _c
194 397 181 350 181 288 _c
181 0 _l
91 0 _l
91 547 _l
181 547 _l
181 462 _l
199 495 224 520 254 536 _c
284 552 321 560 365 560 _c
371 560 378 559 386 559 _c
393 558 401 557 411 555 _c
411 463 _l
_cl}_d
/s{{521 0 54 -13 472 560 _sc
443 531 _m
443 446 _l
417 458 391 468 364 475 _c
336 481 308 485 279 485 _c
234 485 200 478 178 464 _c
156 450 145 430 145 403 _c
145 382 153 366 169 354 _c
185 342 217 330 265 320 _c
296 313 _l
360 299 405 279 432 255 _c
458 230 472 195 472 151 _c
472 100 452 60 412 31 _c
372 1 316 -13 246 -13 _c
216 -13 186 -10 154 -5 _c
}_e{122 0 89 8 54 20 _c
54 113 _l
87 95 120 82 152 74 _c
184 65 216 61 248 61 _c
290 61 323 68 346 82 _c
368 96 380 117 380 144 _c
380 168 371 187 355 200 _c
339 213 303 226 247 238 _c
216 245 _l
160 257 119 275 95 299 _c
70 323 58 356 58 399 _c
58 450 76 490 112 518 _c
148 546 200 560 268 560 _c
301 560 332 557 362 552 _c
391 547 418 540 443 531 _c
}_e{_cl}_e}_d
/t{392 0 27 0 368 702 _sc
183 702 _m
183 547 _l
368 547 _l
368 477 _l
183 477 _l
183 180 _l
183 135 189 106 201 94 _c
213 81 238 75 276 75 _c
368 75 _l
368 0 _l
276 0 _l
206 0 158 13 132 39 _c
106 65 93 112 93 180 _c
93 477 _l
27 477 _l
27 547 _l
93 547 _l
93 702 _l
183 702 _l
_cl}_d
/u{634 0 85 -13 543 560 _sc
85 216 _m
85 547 _l
175 547 _l
175 219 _l
175 167 185 129 205 103 _c
225 77 255 64 296 64 _c
344 64 383 79 411 110 _c
439 141 453 183 453 237 _c
453 547 _l
543 547 _l
543 0 _l
453 0 _l
453 84 _l
431 50 405 26 377 10 _c
348 -5 315 -13 277 -13 _c
214 -13 166 6 134 45 _c
101 83 85 140 85 216 _c
311 560 _m
311 560 _l
_cl}_d
/v{592 0 30 0 562 547 _sc
30 547 _m
125 547 _l
296 88 _l
467 547 _l
562 547 _l
357 0 _l
235 0 _l
30 547 _l
_cl}_d
/x{592 0 29 0 559 547 _sc
549 547 _m
351 281 _l
559 0 _l
453 0 _l
294 215 _l
135 0 _l
29 0 _l
241 286 _l
47 547 _l
153 547 _l
298 352 _l
443 547 _l
549 547 _l
_cl}_d
/y{592 0 30 -207 562 547 _sc
322 -50 _m
296 -114 271 -157 247 -177 _c
223 -197 191 -207 151 -207 _c
79 -207 _l
79 -132 _l
132 -132 _l
156 -132 175 -126 189 -114 _c
203 -102 218 -75 235 -31 _c
251 9 _l
30 547 _l
125 547 _l
296 119 _l
467 547 _l
562 547 _l
322 -50 _l
_cl}_d
/z{525 0 43 0 482 547 _sc
55 547 _m
482 547 _l
482 465 _l
144 72 _l
482 72 _l
482 0 _l
43 0 _l
43 82 _l
381 475 _l
55 475 _l
55 547 _l
_cl}_d
end readonly def

/BuildGlyph
 {exch begin
 CharStrings exch
 2 copy known not{pop /.notdef}if
 true 3 1 roll get exec
 end}_d

/BuildChar {
 1 index /Encoding get exch get
 1 index /BuildGlyph get exec
}_d

FontName currentdict end definefont pop
end
%%EndProlog
mpldict begin
-594 216 translate
1800 360 0 0 clipbox
gsave
0 0 m
1800 0 l
1800 360 l
0 360 l
cl
1.000 setgray
fill
grestore
gsave
99.03 58.28 m
442.730552 58.28 l
442.730552 321.72 l
99.03 321.72 l
cl
1.000 setgray
fill
grestore
0.800 setlinewidth
1 setlinejoin
0 setlinecap
[] 0 setdash
0.000 setgray
gsave
/o {
gsave
newpath
translate
0.8 setlinewidth
1 setlinejoin
0 setlinecap
0 0 m
0 -3.5 l

gsave
0.000 setgray
fill
grestore
stroke
grestore
} bind def
118.923 58.28 o
grestore
/DejaVuSans findfont
16.000 scalefont
setfont
gsave
98.548309 39.123750 translate
0.000000 rotate
0.000000 0 m /eight glyphshow
10.179688 0 m /zero glyphshow
20.359375 0 m /zero glyphshow
30.539062 0 m /zero glyphshow
grestore
gsave
/o {
gsave
newpath
translate
0.8 setlinewidth
1 setlinejoin
0 setlinecap
0 0 m
0 -3.5 l

gsave
0.000 setgray
fill
grestore
stroke
grestore
} bind def
206.976 58.28 o
grestore
gsave
181.507271 39.123750 translate
0.000000 rotate
0.000000 0 m /one glyphshow
10.179688 0 m /zero glyphshow
20.359375 0 m /zero glyphshow
30.539062 0 m /zero glyphshow
40.718750 0 m /zero glyphshow
grestore
gsave
/o {
gsave
newpath
translate
0.8 setlinewidth
1 setlinejoin
0 setlinecap
0 0 m
0 -3.5 l

gsave
0.000 setgray
fill
grestore
stroke
grestore
} bind def
295.029 58.28 o
grestore
gsave
269.559982 39.123750 translate
0.000000 rotate
0.000000 0 m /one glyphshow
10.179688 0 m /two glyphshow
20.359375 0 m /zero glyphshow
30.539062 0 m /zero glyphshow
40.718750 0 m /zero glyphshow
grestore
gsave
/o {
gsave
newpath
translate
0.8 setlinewidth
1 setlinejoin
0 setlinecap
0 0 m
0 -3.5 l

gsave
0.000 setgray
fill
grestore
stroke
grestore
} bind def
383.081 58.28 o
grestore
gsave
357.612694 39.123750 translate
0.000000 rotate
0.000000 0 m /one glyphshow
10.179688 0 m /four glyphshow
20.359375 0 m /zero glyphshow
30.539062 0 m /zero glyphshow
40.718750 0 m /zero glyphshow
grestore
gsave
230.528714 19.639375 translate
0.000000 rotate
0.000000 0 m /T glyphshow
9.273438 0 m /i glyphshow
13.718750 0 m /m glyphshow
29.304688 0 m /e glyphshow
39.148438 0 m /space glyphshow
44.234375 0 m /bracketleft glyphshow
50.476562 0 m /m glyphshow
66.062500 0 m /s glyphshow
74.398438 0 m /bracketright glyphshow
grestore
gsave
/o {
gsave
newpath
translate
0.8 setlinewidth
1 setlinejoin
0 setlinecap
0 0 m
-3.5 0 l

gsave
0.000 setgray
fill
grestore
stroke
grestore
} bind def
99.03 71.6491 o
grestore
gsave
35.998750 65.570966 translate
0.000000 rotate
0.000000 0 m /one glyphshow
10.179688 0 m /period glyphshow
15.265625 0 m /four glyphshow
25.445312 0 m /four glyphshow
35.625000 0 m /five glyphshow
45.804688 0 m /zero glyphshow
grestore
gsave
/o {
gsave
newpath
translate
0.8 setlinewidth
1 setlinejoin
0 setlinecap
0 0 m
-3.5 0 l

gsave
0.000 setgray
fill
grestore
stroke
grestore
} bind def
99.03 105.061 o
grestore
gsave
35.998750 98.983097 translate
0.000000 rotate
0.000000 0 m /one glyphshow
10.179688 0 m /period glyphshow
15.265625 0 m /four glyphshow
25.445312 0 m /four glyphshow
35.625000 0 m /seven glyphshow
45.804688 0 m /five glyphshow
grestore
gsave
/o {
gsave
newpath
translate
0.8 setlinewidth
1 setlinejoin
0 setlinecap
0 0 m
-3.5 0 l

gsave
0.000 setgray
fill
grestore
stroke
grestore
} bind def
99.03 138.473 o
grestore
gsave
35.998750 132.395228 translate
0.000000 rotate
0.000000 0 m /one glyphshow
10.179688 0 m /period glyphshow
15.265625 0 m /four glyphshow
25.445312 0 m /five glyphshow
35.625000 0 m /zero glyphshow
45.804688 0 m /zero glyphshow
grestore
gsave
/o {
gsave
newpath
translate
0.8 setlinewidth
1 setlinejoin
0 setlinecap
0 0 m
-3.5 0 l

gsave
0.000 setgray
fill
grestore
stroke
grestore
} bind def
99.03 171.885 o
grestore
gsave
35.998750 165.807358 translate
0.000000 rotate
0.000000 0 m /one glyphshow
10.179688 0 m /period glyphshow
15.265625 0 m /four glyphshow
25.445312 0 m /five glyphshow
35.625000 0 m /two glyphshow
45.804688 0 m /five glyphshow
grestore
gsave
/o {
gsave
newpath
translate
0.8 setlinewidth
1 setlinejoin
0 setlinecap
0 0 m
-3.5 0 l

gsave
0.000 setgray
fill
grestore
stroke
grestore
} bind def
99.03 205.298 o
grestore
gsave
35.998750 199.219489 translate
0.000000 rotate
0.000000 0 m /one glyphshow
10.179688 0 m /period glyphshow
15.265625 0 m /four glyphshow
25.445312 0 m /five glyphshow
35.625000 0 m /five glyphshow
45.804688 0 m /zero glyphshow
grestore
gsave
/o {
gsave
newpath
translate
0.8 setlinewidth
1 setlinejoin
0 setlinecap
0 0 m
-3.5 0 l

gsave
0.000 setgray
fill
grestore
stroke
grestore
} bind def
99.03 238.71 o
grestore
gsave
35.998750 232.631620 translate
0.000000 rotate
0.000000 0 m /one glyphshow
10.179688 0 m /period glyphshow
15.265625 0 m /four glyphshow
25.445312 0 m /five glyphshow
35.625000 0 m /seven glyphshow
45.804688 0 m /five glyphshow
grestore
gsave
/o {
gsave
newpath
translate
0.8 setlinewidth
1 setlinejoin
0 setlinecap
0 0 m
-3.5 0 l

gsave
0.000 setgray
fill
grestore
stroke
grestore
} bind def
99.03 272.122 o
grestore
gsave
35.998750 266.043751 translate
0.000000 rotate
0.000000 0 m /one glyphshow
10.179688 0 m /period glyphshow
15.265625 0 m /four glyphshow
25.445312 0 m /six glyphshow
35.625000 0 m /zero glyphshow
45.804688 0 m /zero glyphshow
grestore
gsave
/o {
gsave
newpath
translate
0.8 setlinewidth
1 setlinejoin
0 setlinecap
0 0 m
-3.5 0 l

gsave
0.000 setgray
fill
grestore
stroke
grestore
} bind def
99.03 305.534 o
grestore
gsave
35.998750 299.455882 translate
0.000000 rotate
0.000000 0 m /one glyphshow
10.179688 0 m /period glyphshow
15.265625 0 m /four glyphshow
25.445312 0 m /six glyphshow
35.625000 0 m /two glyphshow
45.804688 0 m /five glyphshow
grestore
gsave
28.670625 53.781250 translate
90.000000 rotate
0.000000 0 m /A glyphshow
10.945312 0 m /n glyphshow
21.085938 0 m /g glyphshow
31.242188 0 m /u glyphshow
41.382812 0 m /l glyphshow
45.828125 0 m /a glyphshow
55.632812 0 m /r glyphshow
62.210938 0 m /space glyphshow
67.296875 0 m /v glyphshow
76.765625 0 m /e glyphshow
86.609375 0 m /l glyphshow
91.054688 0 m /o glyphshow
100.843750 0 m /c glyphshow
109.640625 0 m /i glyphshow
114.085938 0 m /t glyphshow
120.359375 0 m /y glyphshow
129.828125 0 m /space glyphshow
134.914062 0 m /bracketleft glyphshow
141.156250 0 m /H glyphshow
153.187500 0 m /z glyphshow
161.585938 0 m /bracketright glyphshow
167.828125 0 m /space glyphshow
172.914062 0 m /a glyphshow
182.718750 0 m /b glyphshow
192.875000 0 m /o glyphshow
202.664062 0 m /u glyphshow
212.804688 0 m /t glyphshow
219.078125 0 m /space glyphshow
224.164062 0 m /Z glyphshow
235.125000 0 m /space glyphshow
240.210938 0 m /a glyphshow
250.015625 0 m /x glyphshow
259.484375 0 m /i glyphshow
263.929688 0 m /s glyphshow
grestore
1.500 setlinewidth
2 setlinecap
0.122 0.467 0.706 setrgbcolor
gsave
343.7 263.4 99.03 58.28 clipbox
114.652752 303.203973 m
115.137042 309.745455 l
115.797438 301.023479 l
116.325754 298.842985 l
116.898097 298.842985 l
117.33836 307.564961 l
117.778624 301.023479 l
118.30694 296.662491 l
119.187467 309.745455 l
119.627731 305.384467 l
120.288126 296.662491 l
120.728389 296.662491 l
121.168653 301.023479 l
121.696969 303.203973 l
122.137233 303.203973 l
122.577496 298.842985 l
123.01776 296.662491 l
123.458024 303.203973 l
123.898287 298.842985 l
124.602709 294.481998 l
125.131025 298.842985 l
125.571289 292.301504 l
126.055579 294.481998 l
126.539868 292.301504 l
127.420396 287.5771 l
127.948712 296.662491 l
128.388975 294.481998 l
129.137423 292.301504 l
129.577687 296.662491 l
130.061977 298.842985 l
130.546267 296.662491 l
131.030557 296.662491 l
131.514847 292.301504 l
131.95511 289.757594 l
132.483426 301.023479 l
132.967716 287.5771 l
133.672138 283.216113 l
134.156428 289.757594 l
134.640718 298.842985 l
135.080981 289.757594 l
136.005535 285.396606 l
136.533851 292.301504 l
137.502431 283.216113 l
138.206853 285.396606 l
138.647116 292.301504 l
139.175433 294.481998 l
140.099986 285.396606 l
140.672329 285.396606 l
141.156619 287.5771 l
141.596882 283.216113 l
142.873646 283.216113 l
143.31391 287.5771 l
143.754174 285.396606 l
144.194437 278.855125 l
144.810806 281.035619 l
145.295096 278.855125 l
145.823412 283.216113 l
146.263676 281.035619 l
146.747966 281.035619 l
147.452387 276.674631 l
147.936677 285.396606 l
148.464994 276.674631 l
148.949284 274.494137 l
149.389547 274.494137 l
150.005916 283.216113 l
150.44618 272.313643 l
150.886443 278.855125 l
152.383339 272.313643 l
152.823603 278.855125 l
153.792183 270.133149 l
154.232446 272.313643 l
154.716736 272.313643 l
155.201026 270.133149 l
155.64129 265.408746 l
156.521817 276.674631 l
157.094159 263.228252 l
157.534423 265.408746 l
157.974686 258.867264 l
158.89924 270.133149 l
159.38353 261.047758 l
159.86782 267.58924 l
160.35211 263.228252 l
161.100558 263.228252 l
161.584848 261.047758 l
162.025111 263.228252 l
162.465375 256.686771 l
162.905638 265.408746 l
163.433955 263.228252 l
163.918245 254.506277 l
164.446561 258.867264 l
164.886824 258.867264 l
165.591246 261.047758 l
166.119562 254.506277 l
166.603852 254.506277 l
167.088142 256.686771 l
167.528406 265.408746 l
167.968669 256.686771 l
168.452959 254.506277 l
168.893223 250.145289 l
169.333486 256.686771 l
170.081934 258.867264 l
170.522198 252.325783 l
170.962461 254.506277 l
171.402725 247.60138 l
171.842989 263.228252 l
172.283252 256.686771 l
172.767542 247.60138 l
173.692096 247.60138 l
174.48457 252.325783 l
175.45315 252.325783 l
175.981466 250.145289 l
176.465756 256.686771 l
176.950046 250.145289 l
177.390309 247.60138 l
177.962652 245.420886 l
178.446942 252.325783 l
179.767733 245.420886 l
180.252023 247.60138 l
180.824365 245.420886 l
182.585419 245.420886 l
183.025683 243.240392 l
184.258421 243.240392 l
184.698684 245.420886 l
185.182974 250.145289 l
185.623238 243.240392 l
186.063502 241.059898 l
186.988055 241.059898 l
187.560398 245.420886 l
188.308846 238.879404 l
188.749109 243.240392 l
189.189373 245.420886 l
189.717689 238.879404 l
190.201979 236.69891 l
190.642243 243.240392 l
191.082506 234.518416 l
191.52277 243.240392 l
192.095112 236.69891 l
192.711481 232.337922 l
193.151745 241.059898 l
193.592008 243.240392 l
194.032272 241.059898 l
195.000852 232.337922 l
195.485142 234.518416 l
196.101511 238.879404 l
196.541774 236.69891 l
197.20217 236.69891 l
197.642433 238.879404 l
198.699066 238.879404 l
199.139329 236.69891 l
199.579593 227.976935 l
200.151935 227.976935 l
200.592199 232.337922 l
201.296621 227.976935 l
201.736884 230.157429 l
202.177148 227.976935 l
202.661438 236.69891 l
203.189754 225.433025 l
203.630017 230.157429 l
204.070281 232.337922 l
204.598597 238.879404 l
205.082887 234.518416 l
205.787309 225.433025 l
206.271599 225.433025 l
206.711862 234.518416 l
207.636416 221.072038 l
208.120706 225.433025 l
209.045259 230.157429 l
209.529549 230.157429 l
210.277997 223.252531 l
210.762287 232.337922 l
211.246577 236.69891 l
211.686841 223.252531 l
212.171131 218.891544 l
213.756079 225.433025 l
214.548554 223.252531 l
215.032844 225.433025 l
215.913371 230.157429 l
216.353634 225.433025 l
217.322214 212.350062 l
217.85053 227.976935 l
218.33482 218.891544 l
219.479506 218.891544 l
219.919769 221.072038 l
220.888349 216.71105 l
221.328613 221.072038 l
221.812902 216.71105 l
222.341219 225.433025 l
223.089667 216.71105 l
223.52993 221.072038 l
223.970194 221.072038 l
224.850721 225.433025 l
225.335011 216.71105 l
225.775274 216.71105 l
226.215538 218.891544 l
226.699828 218.891544 l
227.448276 223.252531 l
227.932566 218.891544 l
228.372829 216.71105 l
228.857119 221.072038 l
229.341409 214.530556 l
229.869726 214.530556 l
230.354015 216.71105 l
230.794279 230.157429 l
231.498701 221.072038 l
231.938964 221.072038 l
232.863518 216.71105 l
233.303781 221.072038 l
233.744045 223.252531 l
234.228335 212.350062 l
234.800677 216.71105 l
235.284967 225.433025 l
235.989389 218.891544 l
236.561732 216.71105 l
237.001995 212.350062 l
237.442259 210.169568 l
237.882522 221.072038 l
238.410839 216.71105 l
238.851102 214.530556 l
239.291366 216.71105 l
239.995787 225.433025 l
240.480077 218.891544 l
240.964367 216.71105 l
241.448657 212.350062 l
241.888921 210.169568 l
242.373211 216.71105 l
242.857501 212.350062 l
243.297764 210.169568 l
243.738028 212.350062 l
244.442449 221.072038 l
244.926739 221.072038 l
245.367003 214.530556 l
245.807266 210.169568 l
246.335583 212.350062 l
246.775846 210.169568 l
247.21611 212.350062 l
247.7004 212.350062 l
248.404821 214.530556 l
248.933138 214.530556 l
249.373401 212.350062 l
249.901717 212.350062 l
250.341981 214.530556 l
250.826271 218.891544 l
251.266534 212.350062 l
251.706798 216.71105 l
252.235114 214.530556 l
252.939536 216.71105 l
253.423826 214.530556 l
253.864089 210.169568 l
254.392406 203.264671 l
254.832669 212.350062 l
255.316959 210.169568 l
255.757223 210.169568 l
256.241513 212.350062 l
257.386198 214.530556 l
258.310751 218.891544 l
258.839068 210.169568 l
259.323358 210.169568 l
259.8957 212.350062 l
260.335964 212.350062 l
260.820254 203.264671 l
261.304544 210.169568 l
262.052992 210.169568 l
262.493255 207.989074 l
263.065598 207.989074 l
263.549888 210.169568 l
264.078204 216.71105 l
264.562494 214.530556 l
265.002758 207.989074 l
265.443021 207.989074 l
266.191469 216.71105 l
266.675759 212.350062 l
267.116023 212.350062 l
267.600313 203.264671 l
268.260708 207.989074 l
269.185261 212.350062 l
269.669551 212.350062 l
270.153841 207.989074 l
270.902289 207.989074 l
271.342553 210.169568 l
271.826843 201.084177 l
272.311133 201.084177 l
272.795422 212.350062 l
273.896081 201.084177 l
274.336345 205.80858 l
275.128819 207.989074 l
276.757795 207.989074 l
277.286111 205.80858 l
277.726374 198.903683 l
278.166638 201.084177 l
278.606901 201.084177 l
279.091191 198.903683 l
279.795613 201.084177 l
280.764193 201.084177 l
281.248483 196.723189 l
281.688746 198.903683 l
282.12901 194.542696 l
282.569273 205.80858 l
283.09759 203.264671 l
283.802011 198.903683 l
284.242275 192.362202 l
284.682539 196.723189 l
285.122802 192.362202 l
285.563066 192.362202 l
286.003329 203.264671 l
286.487619 192.362202 l
287.015935 190.181708 l
287.500225 194.542696 l
288.644911 194.542696 l
289.129201 192.362202 l
290.09778 192.362202 l
290.58207 194.542696 l
291.022334 188.001214 l
291.638703 188.001214 l
292.167019 190.181708 l
292.915467 190.181708 l
293.48781 192.362202 l
293.928073 190.181708 l
294.368337 192.362202 l
294.8086 192.362202 l
295.29289 183.276811 l
295.733154 181.096317 l
296.173417 183.276811 l
296.701734 190.181708 l
297.538234 185.82072 l
298.022524 185.82072 l
298.462788 176.735329 l
299.035131 185.82072 l
299.475394 185.82072 l
299.959684 181.096317 l
300.399948 178.915823 l
300.928264 181.096317 l
301.588659 185.82072 l
302.116975 181.096317 l
302.601265 178.915823 l
303.041529 178.915823 l
303.481793 181.096317 l
303.966082 178.915823 l
304.450372 178.915823 l
304.890636 174.554835 l
305.330899 176.735329 l
305.991295 181.096317 l
306.431558 178.915823 l
306.871822 174.554835 l
307.400138 176.735329 l
307.928454 183.276811 l
308.412744 174.554835 l
309.425351 170.193847 l
310.87822 176.735329 l
311.36251 176.735329 l
311.8468 172.374341 l
312.375116 176.735329 l
313.343696 168.013354 l
313.78396 168.013354 l
314.312276 174.554835 l
315.016698 168.013354 l
315.985278 168.013354 l
316.469567 170.193847 l
316.953857 170.193847 l
317.394121 163.652366 l
317.834385 158.927962 l
318.362701 158.927962 l
319.419333 170.193847 l
319.859597 165.83286 l
320.872203 165.83286 l
321.356493 168.013354 l
321.884809 158.927962 l
322.809363 158.927962 l
323.249626 163.652366 l
323.910022 156.747469 l
324.350285 156.747469 l
325.230812 165.83286 l
325.891208 161.108456 l
326.419524 152.386481 l
327.388104 156.747469 l
327.828367 163.652366 l
328.620842 152.386481 l
329.149158 154.566975 l
329.633448 158.927962 l
330.513975 154.566975 l
331.042291 154.566975 l
331.482555 152.386481 l
331.966845 156.747469 l
332.759319 145.844999 l
333.243609 148.025493 l
333.727899 138.940102 l
334.168163 154.566975 l
334.740505 148.025493 l
335.224795 150.205987 l
335.665059 148.025493 l
336.765718 152.386481 l
337.558192 145.844999 l
338.086508 145.844999 l
338.526772 143.664505 l
338.967035 138.940102 l
339.583404 148.025493 l
340.59601 148.025493 l
341.0803 150.205987 l
341.784722 143.664505 l
342.269012 145.844999 l
342.709276 150.205987 l
343.281618 148.025493 l
343.765908 141.484012 l
344.294224 136.759608 l
344.734488 138.940102 l
345.174751 145.844999 l
345.615015 143.664505 l
346.319437 138.940102 l
346.803727 141.484012 l
347.332043 148.025493 l
347.816333 136.759608 l
348.300623 134.579114 l
348.784913 136.759608 l
349.269203 136.759608 l
349.709466 141.484012 l
350.14973 130.218127 l
351.426494 136.759608 l
351.910784 145.844999 l
352.835337 132.39862 l
353.319627 132.39862 l
353.803917 125.857139 l
354.332233 130.218127 l
356.269393 138.940102 l
358.955001 130.218127 l
359.395264 130.218127 l
360.011633 128.037633 l
360.495923 132.39862 l
360.980213 130.218127 l
361.420477 130.218127 l
361.86074 128.037633 l
362.301004 128.037633 l
363.049452 125.857139 l
363.489715 125.857139 l
363.974005 123.676645 l
364.458295 118.952242 l
364.898559 130.218127 l
365.338822 130.218127 l
365.955191 123.676645 l
366.483508 123.676645 l
367.143903 132.39862 l
367.584167 132.39862 l
368.200536 118.952242 l
368.640799 121.496151 l
369.125089 132.39862 l
369.609379 128.037633 l
370.049643 121.496151 l
370.489906 121.496151 l
370.93017 118.952242 l
371.546539 125.857139 l
371.986802 125.857139 l
372.427066 118.952242 l
373.527725 118.952242 l
374.012015 116.771748 l
374.936568 116.771748 l
375.685016 123.676645 l
376.169306 118.952242 l
377.137886 114.591254 l
377.578149 114.591254 l
378.106466 123.676645 l
378.546729 112.41076 l
379.031019 114.591254 l
380.131678 118.952242 l
380.571942 123.676645 l
381.056231 112.41076 l
381.584548 108.049772 l
382.068838 110.230266 l
382.64118 121.496151 l
383.12547 112.41076 l
383.60976 114.591254 l
384.050024 118.952242 l
384.842498 121.496151 l
385.326788 112.41076 l
385.767052 114.591254 l
386.207315 108.049772 l
386.735631 108.049772 l
387.175895 112.41076 l
387.616158 112.41076 l
388.056422 110.230266 l
388.848896 110.230266 l
389.333186 114.591254 l
389.817476 108.049772 l
390.25774 108.049772 l
391.22632 112.41076 l
391.666583 105.869279 l
392.150873 103.688785 l
392.679189 105.869279 l
393.427637 114.591254 l
393.867901 110.230266 l
395.232718 103.688785 l
395.717008 108.049772 l
396.245324 105.869279 l
396.685588 99.327797 l
397.434036 103.688785 l
397.918326 108.049772 l
398.402616 101.508291 l
398.842879 101.508291 l
399.459248 96.783887 l
399.899512 103.688785 l
400.339775 99.327797 l
400.780039 90.242406 l
401.264329 94.603394 l
401.924724 103.688785 l
402.409014 108.049772 l
402.849278 101.508291 l
403.333568 96.783887 l
403.861884 94.603394 l
404.346174 103.688785 l
404.786437 101.508291 l
405.35878 96.783887 l
406.063202 99.327797 l
406.547491 101.508291 l
407.031781 99.327797 l
407.560098 99.327797 l
408.000361 96.783887 l
408.484651 101.508291 l
408.968941 96.783887 l
409.409205 90.242406 l
409.849468 90.242406 l
410.55389 94.603394 l
410.994153 99.327797 l
411.478443 92.4229 l
411.918707 92.4229 l
412.402997 90.242406 l
412.84326 85.881418 l
413.283524 92.4229 l
413.723787 88.061912 l
414.516262 88.061912 l
415.044578 85.881418 l
415.528868 92.4229 l
416.013158 77.159443 l
416.453422 83.700924 l
417.466028 83.700924 l
417.950318 85.881418 l
418.390581 90.242406 l
419.050977 83.700924 l
419.49124 83.700924 l
419.97553 92.4229 l
420.45982 83.700924 l
420.988136 81.52043 l
421.472426 77.159443 l
421.956716 85.881418 l
422.441006 79.339937 l
423.189454 77.159443 l
424.069981 85.881418 l
424.68635 72.435039 l
425.17064 74.615533 l
425.698956 74.615533 l
426.183246 77.159443 l
426.667536 72.435039 l
427.1078 70.254545 l
427.1078 70.254545 l
stroke
grestore
0.800 setlinewidth
0 setlinejoin
[] 0 setdash
0.000 setgray
gsave
99.03 58.28 m
99.03 321.72 l
stroke
grestore
gsave
442.730552 58.28 m
442.730552 321.72 l
stroke
grestore
gsave
99.03 58.28 m
442.730552 58.28 l
stroke
grestore
gsave
99.03 321.72 m
442.730552 321.72 l
stroke
grestore
/DejaVuSans findfont
19.200 scalefont
setfont
gsave
206.286526 327.720000 translate
0.000000 rotate
0.000000 0 m /E glyphshow
12.123352 0 m /x glyphshow
23.478455 0 m /p glyphshow
35.658020 0 m /e glyphshow
47.462830 0 m /r glyphshow
55.351440 0 m /i glyphshow
60.682343 0 m /m glyphshow
79.373291 0 m /e glyphshow
91.178101 0 m /n glyphshow
103.338928 0 m /t glyphshow
110.862152 0 m /space glyphshow
116.961304 0 m /one glyphshow
grestore
gsave
545.693149 58.28 m
889.393701 58.28 l
889.393701 321.72 l
545.693149 321.72 l
cl
1.000 setgray
fill
grestore
1 setlinejoin
0 setlinecap
[] 0 setdash
gsave
/o {
gsave
newpath
translate
0.8 setlinewidth
1 setlinejoin
0 setlinecap
0 0 m
0 -3.5 l

gsave
0.000 setgray
fill
grestore
stroke
grestore
} bind def
594.506 58.28 o
grestore
/DejaVuSans findfont
16.000 scalefont
setfont
gsave
569.037119 39.123750 translate
0.000000 rotate
0.000000 0 m /one glyphshow
10.179688 0 m /one glyphshow
20.359375 0 m /five glyphshow
30.539062 0 m /zero glyphshow
40.718750 0 m /zero glyphshow
grestore
gsave
/o {
gsave
newpath
translate
0.8 setlinewidth
1 setlinejoin
0 setlinecap
0 0 m
0 -3.5 l

gsave
0.000 setgray
fill
grestore
stroke
grestore
} bind def
650.381 58.28 o
grestore
gsave
624.912485 39.123750 translate
0.000000 rotate
0.000000 0 m /one glyphshow
10.179688 0 m /two glyphshow
20.359375 0 m /zero glyphshow
30.539062 0 m /zero glyphshow
40.718750 0 m /zero glyphshow
grestore
gsave
/o {
gsave
newpath
translate
0.8 setlinewidth
1 setlinejoin
0 setlinecap
0 0 m
0 -3.5 l

gsave
0.000 setgray
fill
grestore
stroke
grestore
} bind def
706.257 58.28 o
grestore
gsave
680.787851 39.123750 translate
0.000000 rotate
0.000000 0 m /one glyphshow
10.179688 0 m /two glyphshow
20.359375 0 m /five glyphshow
30.539062 0 m /zero glyphshow
40.718750 0 m /zero glyphshow
grestore
gsave
/o {
gsave
newpath
translate
0.8 setlinewidth
1 setlinejoin
0 setlinecap
0 0 m
0 -3.5 l

gsave
0.000 setgray
fill
grestore
stroke
grestore
} bind def
762.132 58.28 o
grestore
gsave
736.663217 39.123750 translate
0.000000 rotate
0.000000 0 m /one glyphshow
10.179688 0 m /three glyphshow
20.359375 0 m /zero glyphshow
30.539062 0 m /zero glyphshow
40.718750 0 m /zero glyphshow
grestore
gsave
/o {
gsave
newpath
translate
0.8 setlinewidth
1 setlinejoin
0 setlinecap
0 0 m
0 -3.5 l

gsave
0.000 setgray
fill
grestore
stroke
grestore
} bind def
818.007 58.28 o
grestore
gsave
792.538584 39.123750 translate
0.000000 rotate
0.000000 0 m /one glyphshow
10.179688 0 m /three glyphshow
20.359375 0 m /five glyphshow
30.539062 0 m /zero glyphshow
40.718750 0 m /zero glyphshow
grestore
gsave
/o {
gsave
newpath
translate
0.8 setlinewidth
1 setlinejoin
0 setlinecap
0 0 m
0 -3.5 l

gsave
0.000 setgray
fill
grestore
stroke
grestore
} bind def
873.883 58.28 o
grestore
gsave
848.413950 39.123750 translate
0.000000 rotate
0.000000 0 m /one glyphshow
10.179688 0 m /four glyphshow
20.359375 0 m /zero glyphshow
30.539062 0 m /zero glyphshow
40.718750 0 m /zero glyphshow
grestore
gsave
677.191863 19.639375 translate
0.000000 rotate
0.000000 0 m /T glyphshow
9.273438 0 m /i glyphshow
13.718750 0 m /m glyphshow
29.304688 0 m /e glyphshow
39.148438 0 m /space glyphshow
44.234375 0 m /bracketleft glyphshow
50.476562 0 m /m glyphshow
66.062500 0 m /s glyphshow
74.398438 0 m /bracketright glyphshow
grestore
gsave
/o {
gsave
newpath
translate
0.8 setlinewidth
1 setlinejoin
0 setlinecap
0 0 m
-3.5 0 l

gsave
0.000 setgray
fill
grestore
stroke
grestore
} bind def
545.693 62.9599 o
grestore
gsave
513.224399 56.881753 translate
0.000000 rotate
0.000000 0 m /zero glyphshow
10.179688 0 m /period glyphshow
15.265625 0 m /nine glyphshow
grestore
gsave
/o {
gsave
newpath
translate
0.8 setlinewidth
1 setlinejoin
0 setlinecap
0 0 m
-3.5 0 l

gsave
0.000 setgray
fill
grestore
stroke
grestore
} bind def
545.693 103.551 o
grestore
gsave
513.224399 97.472765 translate
0.000000 rotate
0.000000 0 m /one glyphshow
10.179688 0 m /period glyphshow
15.265625 0 m /zero glyphshow
grestore
gsave
/o {
gsave
newpath
translate
0.8 setlinewidth
1 setlinejoin
0 setlinecap
0 0 m
-3.5 0 l

gsave
0.000 setgray
fill
grestore
stroke
grestore
} bind def
545.693 144.142 o
grestore
gsave
513.224399 138.063776 translate
0.000000 rotate
0.000000 0 m /one glyphshow
10.179688 0 m /period glyphshow
15.265625 0 m /one glyphshow
grestore
gsave
/o {
gsave
newpath
translate
0.8 setlinewidth
1 setlinejoin
0 setlinecap
0 0 m
-3.5 0 l

gsave
0.000 setgray
fill
grestore
stroke
grestore
} bind def
545.693 184.733 o
grestore
gsave
513.224399 178.654788 translate
0.000000 rotate
0.000000 0 m /one glyphshow
10.179688 0 m /period glyphshow
15.265625 0 m /two glyphshow
grestore
gsave
/o {
gsave
newpath
translate
0.8 setlinewidth
1 setlinejoin
0 setlinecap
0 0 m
-3.5 0 l

gsave
0.000 setgray
fill
grestore
stroke
grestore
} bind def
545.693 225.324 o
grestore
gsave
513.224399 219.245799 translate
0.000000 rotate
0.000000 0 m /one glyphshow
10.179688 0 m /period glyphshow
15.265625 0 m /three glyphshow
grestore
gsave
/o {
gsave
newpath
translate
0.8 setlinewidth
1 setlinejoin
0 setlinecap
0 0 m
-3.5 0 l

gsave
0.000 setgray
fill
grestore
stroke
grestore
} bind def
545.693 265.915 o
grestore
gsave
513.224399 259.836811 translate
0.000000 rotate
0.000000 0 m /one glyphshow
10.179688 0 m /period glyphshow
15.265625 0 m /four glyphshow
grestore
gsave
/o {
gsave
newpath
translate
0.8 setlinewidth
1 setlinejoin
0 setlinecap
0 0 m
-3.5 0 l

gsave
0.000 setgray
fill
grestore
stroke
grestore
} bind def
545.693 306.506 o
grestore
gsave
513.224399 300.427822 translate
0.000000 rotate
0.000000 0 m /one glyphshow
10.179688 0 m /period glyphshow
15.265625 0 m /five glyphshow
grestore
1.500 setlinewidth
2 setlinecap
0.122 0.467 0.706 setrgbcolor
gsave
343.7 263.4 545.7 58.28 clipbox
561.315902 293.233407 m
562.433409 293.100958 l
564.668424 296.809546 l
565.785931 295.860324 l
567.12694 295.462975 l
568.914951 296.599834 l
571.149966 296.941995 l
572.267473 296.875771 l
573.608482 297.074445 l
576.961004 296.743321 l
578.302013 296.666059 l
580.090025 293.906693 l
581.319283 286.368104 l
582.43679 282.052456 l
583.666048 291.213551 l
584.895306 292.968508 l
586.012814 290.341592 l
587.130321 286.30188 l
588.247828 285.761044 l
589.365335 289.524819 l
590.594594 292.085511 l
592.159104 288.995021 l
593.500113 289.866981 l
594.61762 289.602081 l
595.735127 289.458594 l
596.964385 289.12747 l
598.081893 289.061246 l
599.1994 288.255511 l
600.428658 288.586635 l
603.334177 288.045799 l
604.563435 287.979574 l
605.680942 287.7809 l
606.79845 287.438738 l
608.027708 287.372514 l
609.145215 287.04139 l
610.262722 287.04139 l
611.38023 286.566779 l
612.94474 286.434329 l
614.062247 287.173839 l
615.179755 292.836059 l
616.297262 299.767586 l
618.755778 287.240064 l
619.873285 287.571188 l
620.990793 293.299632 l
622.220051 295.992774 l
627.025332 298.156117 l
633.618625 300.308422 l
634.847883 298.421016 l
635.965391 295.926549 l
637.3064 296.334935 l
638.423907 295.926549 l
639.541414 296.467385 l
640.994174 296.875771 l
642.670435 296.941995 l
644.011444 300.573321 l
645.240702 300.242197 l
646.358209 296.40116 l
647.587467 299.292975 l
648.816725 304.083235 l
650.157734 301.588768 l
651.275241 298.421016 l
652.839751 302.063379 l
653.957259 306.842601 l
655.186517 305.562255 l
656.304024 302.394503 l
657.421531 300.043523 l
658.76254 305.297356 l
659.991798 308.994907 l
661.109306 301.654993 l
662.450314 298.829402 l
664.014825 303.542399 l
665.132332 307.648336 l
666.249839 306.776377 l
667.367347 304.480584 l
668.596605 302.328278 l
669.714112 302.063379 l
670.94337 308.994907 l
672.060877 309.745455 l
674.407643 298.487241 l
676.642657 307.184763 l
677.760165 307.184763 l
678.877672 301.114157 l
680.218681 298.763177 l
681.336188 301.180382 l
682.453695 306.577702 l
683.682953 297.88018 l
685.470965 296.40116 l
686.700223 299.370238 l
687.817731 299.370238 l
688.935238 296.136261 l
690.052745 294.039142 l
691.393754 297.482831 l
692.511261 295.992774 l
693.740519 292.162773 l
695.081528 297.14067 l
696.757789 291.279776 l
697.987047 285.153983 l
699.104555 287.372514 l
700.222062 290.275367 l
701.339569 288.454185 l
702.680578 289.12747 l
703.909836 285.087758 l
705.250845 283.807412 l
706.480103 285.617557 l
707.932862 277.471908 l
709.05037 275.253377 l
710.167877 275.992887 l
711.285384 275.716951 l
712.402892 272.626461 l
713.63215 266.688305 l
714.861408 265.209284 l
715.978915 263.321878 l
717.655176 263.928939 l
718.884434 261.909083 l
720.001941 258.542656 l
721.34295 260.154126 l
722.460458 260.297613 l
723.689716 256.246863 l
725.030724 249.171848 l
726.148232 247.085767 l
727.265739 243.388217 l
728.942 243.85179 l
730.171258 242.24032 l
731.400516 237.659773 l
732.629774 235.904816 l
733.747282 231.732654 l
734.97654 227.957841 l
736.094047 226.545046 l
737.323305 226.269109 l
738.440812 226.202884 l
739.55832 223.984354 l
741.12283 219.668705 l
742.240337 217.781299 l
743.357844 211.313344 l
744.587103 209.028589 l
745.70461 207.339857 l
747.939625 203.300145 l
749.168883 199.326658 l
750.398141 197.373026 l
752.186152 193.863113 l
753.30366 192.251643 l
754.421167 190.231787 l
755.538674 186.73291 l
756.767932 186.390749 l
757.88544 188.951441 l
759.002947 188.079481 l
760.120454 181.401815 l
761.573214 175.883083 l
763.137724 168.609393 l
764.478733 166.788212 l
765.59624 163.962621 l
766.713748 159.779422 l
769.172264 155.000199 l
770.289771 153.179018 l
771.519029 148.863369 l
773.865794 145.099594 l
775.318554 141.258556 l
776.547812 139.371149 l
777.665319 138.830314 l
778.782827 137.417518 l
779.900334 132.494809 l
782.470601 126.909852 l
783.588108 122.119592 l
784.929117 119.492675 l
786.493627 114.713453 l
787.722885 112.417661 l
789.063894 110.397805 l
790.293152 105.817257 l
791.52241 104.139562 l
792.639917 99.890138 l
793.757425 94.161694 l
794.986683 96.932098 l
796.886445 91.601002 l
798.115703 89.647371 l
799.233211 91.071204 l
800.350718 90.927717 l
801.803477 88.642962 l
802.920985 85.740108 l
804.038492 85.276535 l
805.155999 83.720252 l
806.385257 77.991808 l
808.173269 78.742356 l
809.290776 80.221376 l
810.408284 78.808581 l
811.525791 81.567947 l
812.755049 79.139705 l
813.984307 76.181664 l
815.101815 77.395785 l
816.219322 77.991808 l
817.783832 73.687197 l
818.901339 73.687197 l
820.130598 76.446563 l
821.471606 75.232442 l
822.589114 70.994056 l
823.706621 70.254545 l
825.04763 75.166217 l
826.165137 74.426707 l
827.282644 72.67175 l
828.847155 77.528235 l
830.076413 79.007255 l
831.19392 75.839503 l
832.64668 77.119848 l
833.764187 74.757831 l
834.881694 73.620972 l
836.110952 82.506131 l
837.34021 84.327313 l
838.904721 80.618725 l
840.133979 85.94982 l
841.363237 90.729042 l
843.933503 84.128639 l
845.051011 84.525987 l
846.280269 93.289734 l
847.509527 98.344893 l
850.303295 88.43325 l
851.420803 97.263222 l
852.53831 109.393395 l
853.655817 101.843769 l
855.108577 98.808467 l
856.226084 102.384605 l
857.455342 114.845903 l
858.572849 117.34037 l
860.360861 112.826047 l
861.70187 112.826047 l
862.819377 118.013655 l
863.936885 125.22112 l
865.054392 122.329304 l
866.171899 117.881206 l
867.289407 120.706797 l
868.406914 130.541178 l
870.083175 132.362359 l
871.200682 129.934117 l
872.318189 131.346913 l
873.770949 141.58968 l
873.770949 141.58968 l
stroke
grestore
0.800 setlinewidth
0 setlinejoin
[] 0 setdash
0.000 setgray
gsave
545.693149 58.28 m
545.693149 321.72 l
stroke
grestore
gsave
889.393701 58.28 m
889.393701 321.72 l
stroke
grestore
gsave
545.693149 58.28 m
889.393701 58.28 l
stroke
grestore
gsave
545.693149 321.72 m
889.393701 321.72 l
stroke
grestore
/DejaVuSans findfont
19.200 scalefont
setfont
gsave
652.949675 327.720000 translate
0.000000 rotate
0.000000 0 m /E glyphshow
12.123352 0 m /x glyphshow
23.478455 0 m /p glyphshow
35.658020 0 m /e glyphshow
47.462830 0 m /r glyphshow
55.351440 0 m /i glyphshow
60.682343 0 m /m glyphshow
79.373291 0 m /e glyphshow
91.178101 0 m /n glyphshow
103.338928 0 m /t glyphshow
110.862152 0 m /space glyphshow
116.961304 0 m /two glyphshow
grestore
gsave
992.356299 58.28 m
1336.056851 58.28 l
1336.056851 321.72 l
992.356299 321.72 l
cl
1.000 setgray
fill
grestore
1 setlinejoin
0 setlinecap
[] 0 setdash
gsave
/o {
gsave
newpath
translate
0.8 setlinewidth
1 setlinejoin
0 setlinecap
0 0 m
0 -3.5 l

gsave
0.000 setgray
fill
grestore
stroke
grestore
} bind def
1012.89 58.28 o
grestore
/DejaVuSans findfont
16.000 scalefont
setfont
gsave
992.517874 39.123750 translate
0.000000 rotate
0.000000 0 m /eight glyphshow
10.179688 0 m /zero glyphshow
20.359375 0 m /zero glyphshow
30.539062 0 m /zero glyphshow
grestore
gsave
/o {
gsave
newpath
translate
0.8 setlinewidth
1 setlinejoin
0 setlinecap
0 0 m
0 -3.5 l

gsave
0.000 setgray
fill
grestore
stroke
grestore
} bind def
1066.3 58.28 o
grestore
gsave
1045.928993 39.123750 translate
0.000000 rotate
0.000000 0 m /nine glyphshow
10.179688 0 m /zero glyphshow
20.359375 0 m /zero glyphshow
30.539062 0 m /zero glyphshow
grestore
gsave
/o {
gsave
newpath
translate
0.8 setlinewidth
1 setlinejoin
0 setlinecap
0 0 m
0 -3.5 l

gsave
0.000 setgray
fill
grestore
stroke
grestore
} bind def
1119.72 58.28 o
grestore
gsave
1094.246362 39.123750 translate
0.000000 rotate
0.000000 0 m /one glyphshow
10.179688 0 m /zero glyphshow
20.359375 0 m /zero glyphshow
30.539062 0 m /zero glyphshow
40.718750 0 m /zero glyphshow
grestore
gsave
/o {
gsave
newpath
translate
0.8 setlinewidth
1 setlinejoin
0 setlinecap
0 0 m
0 -3.5 l

gsave
0.000 setgray
fill
grestore
stroke
grestore
} bind def
1173.13 58.28 o
grestore
gsave
1147.657482 39.123750 translate
0.000000 rotate
0.000000 0 m /one glyphshow
10.179688 0 m /one glyphshow
20.359375 0 m /zero glyphshow
30.539062 0 m /zero glyphshow
40.718750 0 m /zero glyphshow
grestore
gsave
/o {
gsave
newpath
translate
0.8 setlinewidth
1 setlinejoin
0 setlinecap
0 0 m
0 -3.5 l

gsave
0.000 setgray
fill
grestore
stroke
grestore
} bind def
1226.54 58.28 o
grestore
gsave
1201.068601 39.123750 translate
0.000000 rotate
0.000000 0 m /one glyphshow
10.179688 0 m /two glyphshow
20.359375 0 m /zero glyphshow
30.539062 0 m /zero glyphshow
40.718750 0 m /zero glyphshow
grestore
gsave
/o {
gsave
newpath
translate
0.8 setlinewidth
1 setlinejoin
0 setlinecap
0 0 m
0 -3.5 l

gsave
0.000 setgray
fill
grestore
stroke
grestore
} bind def
1279.95 58.28 o
grestore
gsave
1254.479720 39.123750 translate
0.000000 rotate
0.000000 0 m /one glyphshow
10.179688 0 m /three glyphshow
20.359375 0 m /zero glyphshow
30.539062 0 m /zero glyphshow
40.718750 0 m /zero glyphshow
grestore
gsave
/o {
gsave
newpath
translate
0.8 setlinewidth
1 setlinejoin
0 setlinecap
0 0 m
0 -3.5 l

gsave
0.000 setgray
fill
grestore
stroke
grestore
} bind def
1333.36 58.28 o
grestore
gsave
1307.890839 39.123750 translate
0.000000 rotate
0.000000 0 m /one glyphshow
10.179688 0 m /four glyphshow
20.359375 0 m /zero glyphshow
30.539062 0 m /zero glyphshow
40.718750 0 m /zero glyphshow
grestore
gsave
1123.855012 19.639375 translate
0.000000 rotate
0.000000 0 m /T glyphshow
9.273438 0 m /i glyphshow
13.718750 0 m /m glyphshow
29.304688 0 m /e glyphshow
39.148438 0 m /space glyphshow
44.234375 0 m /bracketleft glyphshow
50.476562 0 m /m glyphshow
66.062500 0 m /s glyphshow
74.398438 0 m /bracketright glyphshow
grestore
gsave
/o {
gsave
newpath
translate
0.8 setlinewidth
1 setlinejoin
0 setlinecap
0 0 m
-3.5 0 l

gsave
0.000 setgray
fill
grestore
stroke
grestore
} bind def
992.356 84.624 o
grestore
gsave
949.700049 78.545875 translate
0.000000 rotate
0.000000 0 m /one glyphshow
10.179688 0 m /period glyphshow
15.265625 0 m /eight glyphshow
25.445312 0 m /six glyphshow
grestore
gsave
/o {
gsave
newpath
translate
0.8 setlinewidth
1 setlinejoin
0 setlinecap
0 0 m
-3.5 0 l

gsave
0.000 setgray
fill
grestore
stroke
grestore
} bind def
992.356 137.312 o
grestore
gsave
949.700049 131.233875 translate
0.000000 rotate
0.000000 0 m /one glyphshow
10.179688 0 m /period glyphshow
15.265625 0 m /eight glyphshow
25.445312 0 m /eight glyphshow
grestore
gsave
/o {
gsave
newpath
translate
0.8 setlinewidth
1 setlinejoin
0 setlinecap
0 0 m
-3.5 0 l

gsave
0.000 setgray
fill
grestore
stroke
grestore
} bind def
992.356 190 o
grestore
gsave
949.700049 183.921875 translate
0.000000 rotate
0.000000 0 m /one glyphshow
10.179688 0 m /period glyphshow
15.265625 0 m /nine glyphshow
25.445312 0 m /zero glyphshow
grestore
gsave
/o {
gsave
newpath
translate
0.8 setlinewidth
1 setlinejoin
0 setlinecap
0 0 m
-3.5 0 l

gsave
0.000 setgray
fill
grestore
stroke
grestore
} bind def
992.356 242.688 o
grestore
gsave
949.700049 236.609875 translate
0.000000 rotate
0.000000 0 m /one glyphshow
10.179688 0 m /period glyphshow
15.265625 0 m /nine glyphshow
25.445312 0 m /two glyphshow
grestore
gsave
/o {
gsave
newpath
translate
0.8 setlinewidth
1 setlinejoin
0 setlinecap
0 0 m
-3.5 0 l

gsave
0.000 setgray
fill
grestore
stroke
grestore
} bind def
992.356 295.376 o
grestore
gsave
949.700049 289.297875 translate
0.000000 rotate
0.000000 0 m /one glyphshow
10.179688 0 m /period glyphshow
15.265625 0 m /nine glyphshow
25.445312 0 m /four glyphshow
grestore
1.500 setlinewidth
2 setlinecap
0.122 0.467 0.706 setrgbcolor
gsave
343.7 263.4 992.4 58.28 clipbox
1007.979051 286.150073 m
1008.619984 283.929409 l
1009.741618 283.929409 l
1010.435962 281.780379 l
1010.970074 284.359215 l
1011.504185 283.069797 l
1012.358763 281.780379 l
1012.892874 283.069797 l
1013.480396 286.150073 l
1014.12133 282.639991 l
1014.655441 281.780379 l
1015.189552 279.989521 l
1015.723663 279.989521 l
1016.364597 281.350573 l
1016.898708 279.129909 l
1017.646464 277.410685 l
1018.233986 276.980879 l
1018.768097 276.049633 l
1019.302208 277.410685 l
1019.836319 273.900604 l
1021.598886 272.611186 l
1022.186409 271.250134 l
1023.147809 269.960716 l
1023.68192 270.390522 l
1024.269442 271.679939 l
1024.856965 268.241492 l
1026.032009 267.310246 l
1026.56612 267.310246 l
1027.207054 270.390522 l
1027.741165 266.450634 l
1028.275276 266.020828 l
1029.076443 265.161216 l
1029.610554 265.161216 l
1030.144665 267.310246 l
1030.678777 262.510746 l
1031.31971 262.08094 l
1031.907232 261.221328 l
1032.441344 261.221328 l
1032.975455 260.361716 l
1033.616388 259.93191 l
1034.470966 259.000664 l
1035.005077 259.93191 l
1035.539189 261.651134 l
1036.0733 259.502104 l
1036.607411 258.141052 l
1037.942689 258.141052 l
1039.171145 255.562216 l
1039.972311 257.28144 l
1040.506423 259.000664 l
1041.093945 258.141052 l
1041.734878 254.63097 l
1042.375812 255.992022 l
1042.909923 255.060776 l
1043.444034 255.562216 l
1044.031556 252.48194 l
1044.67249 252.911746 l
1045.420246 252.48194 l
1045.954357 254.201164 l
1046.488468 254.63097 l
1047.022579 252.48194 l
1048.251035 251.622329 l
1048.785146 252.911746 l
1049.319257 252.48194 l
1049.90678 250.691082 l
1050.814769 251.622329 l
1051.402291 253.771358 l
1051.936402 252.911746 l
1052.523924 251.192523 l
1053.218269 250.691082 l
1053.75238 251.192523 l
1054.286491 252.48194 l
1054.820603 248.971859 l
1055.354714 250.691082 l
1056.209292 251.192523 l
1056.850225 252.052134 l
1057.384336 251.622329 l
1057.918447 250.691082 l
1058.50597 250.261276 l
1059.040081 250.261276 l
1059.627603 251.622329 l
1060.161714 250.691082 l
1060.695826 250.691082 l
1061.603815 251.192523 l
1062.137926 252.911746 l
1062.725448 252.48194 l
1063.31297 250.691082 l
1063.900493 249.83147 l
1064.488015 250.691082 l
1065.075537 252.911746 l
1065.609649 251.192523 l
1066.14376 252.48194 l
1066.944927 250.691082 l
1067.532449 251.192523 l
1068.119971 252.052134 l
1068.654082 251.622329 l
1069.188194 252.052134 l
1069.775716 252.052134 l
1070.363238 255.060776 l
1070.950761 253.341552 l
1071.591694 253.341552 l
1072.33945 252.911746 l
1072.873561 254.201164 l
1073.461083 258.141052 l
1074.155428 253.771358 l
1074.689539 254.63097 l
1075.22365 255.060776 l
1075.757761 258.141052 l
1076.291872 256.851634 l
1076.879395 256.421828 l
1077.787384 256.851634 l
1078.321495 258.141052 l
1078.855606 261.221328 l
1079.389717 257.28144 l
1079.923829 258.141052 l
1080.564762 258.141052 l
1081.098873 259.000664 l
1081.632984 259.000664 l
1082.167096 260.361716 l
1083.555785 263.370358 l
1084.143307 263.871798 l
1084.677418 260.791522 l
1085.211529 262.08094 l
1085.745641 262.510746 l
1086.333163 263.370358 l
1086.867274 265.161216 l
1087.401385 262.940552 l
1088.255963 263.370358 l
1088.843485 263.871798 l
1089.377597 268.671298 l
1089.965119 265.591022 l
1090.552641 264.73141 l
1091.086752 265.161216 l
1091.620864 266.450634 l
1092.689086 267.310246 l
1093.543664 266.020828 l
1094.184597 267.310246 l
1094.77212 269.101104 l
1095.306231 268.241492 l
1095.947164 268.671298 l
1096.534687 267.310246 l
1097.068798 267.310246 l
1097.709731 269.960716 l
1098.297254 268.241492 l
1099.09842 269.53091 l
1099.632532 269.101104 l
1100.166643 271.679939 l
1100.700754 272.18138 l
1101.341687 269.53091 l
1101.875799 271.679939 l
1102.40991 270.390522 l
1102.944021 270.390522 l
1103.478132 271.250134 l
1104.279299 269.101104 l
1104.866821 270.390522 l
1105.507755 272.18138 l
1106.095277 271.679939 l
1106.682799 269.53091 l
1107.323733 269.53091 l
1107.857844 269.960716 l
1108.391955 271.250134 l
1108.979477 269.101104 l
1109.834055 269.960716 l
1110.421578 270.390522 l
1111.0091 271.250134 l
1111.543211 269.960716 l
1112.077322 269.101104 l
1112.718256 269.960716 l
1113.252367 269.960716 l
1113.8933 272.18138 l
1114.427412 268.241492 l
1115.121756 269.960716 l
1115.816101 269.53091 l
1116.510445 272.18138 l
1117.044556 271.250134 l
1117.632079 269.53091 l
1118.273012 270.820328 l
1119.448057 269.960716 l
1119.982168 269.101104 l
1121.103801 269.101104 l
1121.851557 272.18138 l
1122.385668 270.390522 l
1123.560713 269.53091 l
1124.628935 270.390522 l
1125.216458 269.53091 l
1125.750569 266.450634 l
1126.28468 266.450634 l
1127.24608 270.820328 l
1127.780191 268.241492 l
1128.367714 266.88044 l
1128.955236 266.020828 l
1129.596169 266.88044 l
1130.130281 269.960716 l
1130.664392 266.020828 l
1131.305325 267.310246 l
1131.946259 265.591022 l
1132.854248 266.88044 l
1133.44177 265.591022 l
1133.975881 263.871798 l
1134.509992 264.301604 l
1135.097515 263.871798 l
1135.685037 265.591022 l
1136.219148 262.08094 l
1136.753259 262.510746 l
1137.340782 262.510746 l
1138.19536 263.370358 l
1138.782882 261.651134 l
1139.316993 261.651134 l
1139.851104 258.141052 l
1140.438627 260.361716 l
1141.026149 261.651134 l
1141.613671 257.711246 l
1142.788716 257.711246 l
1143.643294 259.000664 l
1144.177405 256.421828 l
1144.764927 256.851634 l
1145.299038 255.992022 l
1145.83315 255.562216 l
1146.367261 257.711246 l
1146.901372 254.63097 l
1147.969594 253.771358 l
1148.770761 253.341552 l
1149.304872 255.060776 l
1149.892395 252.052134 l
1150.533328 251.192523 l
1151.067439 250.691082 l
1151.654962 250.691082 l
1152.189073 248.971859 l
1152.723184 249.401664 l
1153.310706 248.542053 l
1154.699395 248.542053 l
1155.767618 245.891583 l
1156.35514 244.172359 l
1156.942662 245.891583 l
1157.476774 245.461777 l
1158.064296 244.172359 l
1158.705229 243.742553 l
1159.506396 244.172359 l
1160.093918 243.312747 l
1160.62803 241.092083 l
1161.162141 241.092083 l
1161.696252 240.232471 l
1162.283774 240.232471 l
1162.871297 239.802665 l
1163.405408 237.582001 l
1163.939519 237.582001 l
1164.847508 238.011807 l
1165.381619 238.011807 l
1165.91573 236.292583 l
1166.503253 236.292583 l
1167.037364 235.862777 l
1167.571475 236.292583 l
1168.105586 235.003165 l
1168.639698 235.003165 l
1169.547687 232.782501 l
1170.776142 234.573359 l
1171.310254 231.922889 l
1171.951187 232.352695 l
1172.485298 231.922889 l
1173.019409 231.063277 l
1173.606932 231.063277 l
1174.247865 230.203665 l
1175.102443 231.063277 l
1175.636554 230.633471 l
1176.170665 232.352695 l
1176.704777 228.842613 l
1178.413932 228.842613 l
1178.948044 230.203665 l
1179.482155 229.272419 l
1180.443555 229.702225 l
1181.031077 229.272419 l
1181.6186 230.203665 l
1182.312944 227.983001 l
1183.968689 227.983001 l
1184.609622 227.553195 l
1185.197145 227.983001 l
1185.998311 227.123389 l
1186.585834 229.272419 l
1187.119945 231.922889 l
1187.654056 227.983001 l
1188.188167 228.842613 l
1188.775689 228.412807 l
1189.363212 228.412807 l
1189.950734 228.842613 l
1190.484845 228.412807 l
1191.392834 230.203665 l
1191.980357 230.633471 l
1192.567879 232.782501 l
1193.155401 229.702225 l
1193.689512 231.063277 l
1194.223624 231.922889 l
1194.757735 231.493083 l
1195.345257 232.782501 l
1195.879368 230.633471 l
1196.787357 232.352695 l
1197.321469 234.143553 l
1197.908991 235.003165 l
1198.496513 232.782501 l
1199.030624 231.922889 l
1199.671558 232.352695 l
1200.205669 233.642113 l
1200.73978 236.722389 l
1201.273891 234.143553 l
1202.128469 235.003165 l
1202.66258 236.292583 l
1203.196692 238.943053 l
1203.784214 234.573359 l
1204.852436 235.432971 l
1206.027481 238.011807 l
1206.93547 237.152195 l
1208.110515 238.943053 l
1208.751448 240.662277 l
1209.285559 238.943053 l
1209.873082 239.372859 l
1211.154948 241.092083 l
1211.68906 241.951695 l
1212.490226 241.521889 l
1213.024338 241.521889 l
1213.558449 241.951695 l
1214.199382 244.172359 l
1215.267605 242.381501 l
1215.801716 242.381501 l
1216.549471 245.031971 l
1217.136994 245.461777 l
1218.044983 243.742553 l
1218.579094 243.742553 l
1219.273439 245.891583 l
1219.299493 -1 l
1220.315736 -1 m
1220.341661 244.602165 l
1220.929183 246.321388 l
1221.516706 245.891583 l
1222.050817 246.321388 l
1223.225861 246.822829 l
1223.813384 248.112247 l
1224.400906 248.971859 l
1224.988428 248.971859 l
1225.575951 248.112247 l
1226.697584 248.112247 l
1227.231695 251.192523 l
1227.765807 249.83147 l
1228.673796 249.83147 l
1229.261318 248.971859 l
1229.84884 250.261276 l
1230.382951 252.052134 l
1230.970474 248.112247 l
1231.557996 249.401664 l
1232.145518 249.401664 l
1232.679629 252.911746 l
1233.373974 251.192523 l
1234.12173 250.261276 l
1234.709252 251.622329 l
1235.243363 251.192523 l
1235.884297 252.48194 l
1237.059341 250.261276 l
1237.593452 250.691082 l
1238.127564 249.83147 l
1238.715086 251.622329 l
1239.623075 250.691082 l
1240.157186 251.192523 l
1240.744708 250.691082 l
1241.27882 252.48194 l
1241.812931 248.542053 l
1242.347042 249.83147 l
1242.881153 249.401664 l
1243.415264 249.83147 l
1244.002787 252.48194 l
1244.536898 248.971859 l
1246.08582 251.192523 l
1246.619932 254.201164 l
1247.154043 250.261276 l
1247.794976 251.192523 l
1248.970021 248.542053 l
1249.610954 249.401664 l
1250.198477 248.542053 l
1251.053054 249.401664 l
1251.587166 249.401664 l
1252.28151 248.542053 l
1252.869033 249.401664 l
1253.456555 248.112247 l
1253.990666 247.682441 l
1254.524777 249.401664 l
1255.058888 243.312747 l
1255.593 174.185623 l
1256.394166 140.087685 l
1256.981689 139.657879 l
1257.569211 139.657879 l
1258.103322 134.858379 l
1258.637433 137.079043 l
1259.278367 139.228073 l
1259.865889 140.087685 l
1260.4 140.087685 l
1261.948923 137.938655 l
1262.536445 137.508849 l
1263.070556 139.228073 l
1263.658079 134.858379 l
1264.352423 135.717991 l
1264.886534 133.998767 l
1265.420646 133.998767 l
1266.11499 132.207909 l
1267.236624 133.139155 l
1267.984379 133.998767 l
1268.571902 133.998767 l
1269.106013 131.348297 l
1270.281057 131.348297 l
1270.815169 132.637715 l
1271.509513 130.488685 l
1272.097035 129.629073 l
1272.844791 128.769462 l
1273.378902 130.918491 l
1273.913013 130.488685 l
1274.500536 127.408409 l
1275.248291 127.408409 l
1275.835814 126.548797 l
1276.369925 127.408409 l
1277.010858 124.399768 l
1277.651792 123.038716 l
1278.50637 124.829574 l
1279.040481 124.829574 l
1279.574592 122.60891 l
1281.283748 121.319492 l
1281.817859 121.749298 l
1282.35197 119.95844 l
1282.886082 119.098828 l
1283.794071 117.379604 l
1284.381593 118.669022 l
1285.556637 116.949798 l
1286.14416 115.15894 l
1287.212382 116.090186 l
1287.853316 114.729134 l
1288.387427 114.729134 l
1289.188594 111.720492 l
1289.829527 113.869522 l
1290.363638 113.00991 l
1290.897749 111.720492 l
1292.019383 109.929634 l
1292.660316 112.150298 l
1293.194428 108.21041 l
1293.78195 108.640216 l
1294.689939 108.640216 l
1295.277461 110.35944 l
1295.864983 109.070022 l
1296.559328 105.989746 l
1297.14685 105.55994 l
1297.680962 105.55994 l
1298.268484 103.840717 l
1298.856006 103.410911 l
1299.443528 105.130134 l
1300.351517 102.90947 l
1300.885629 105.55994 l
1301.579973 101.190247 l
1302.114084 101.190247 l
1302.648196 100.330635 l
1303.182307 103.840717 l
1303.769829 101.190247 l
1304.30394 99.900829 l
1305.478985 99.900829 l
1306.013096 104.270522 l
1306.600618 100.760441 l
1307.13473 99.900829 l
1307.722252 99.471023 l
1308.309774 99.900829 l
1309.004119 101.620052 l
1309.53823 100.760441 l
1310.179163 99.041217 l
1311.087152 100.330635 l
1311.621264 102.479664 l
1312.155375 100.330635 l
1312.689486 99.041217 l
1313.330419 99.900829 l
1313.864531 99.471023 l
1314.398642 102.049858 l
1314.986164 99.471023 l
1315.520275 98.109971 l
1316.962376 102.90947 l
1318.13742 101.190247 l
1318.671531 100.760441 l
1319.312465 101.620052 l
1319.899987 103.840717 l
1320.434098 101.190247 l
1320.434098 101.190247 l
stroke
grestore
0.800 setlinewidth
0 setlinejoin
[] 0 setdash
0.000 setgray
gsave
992.356299 58.28 m
992.356299 321.72 l
stroke
grestore
gsave
1336.056851 58.28 m
1336.056851 321.72 l
stroke
grestore
gsave
992.356299 58.28 m
1336.056851 58.28 l
stroke
grestore
gsave
992.356299 321.72 m
1336.056851 321.72 l
stroke
grestore
/DejaVuSans findfont
19.200 scalefont
setfont
gsave
1099.612825 327.720000 translate
0.000000 rotate
0.000000 0 m /E glyphshow
12.123352 0 m /x glyphshow
23.478455 0 m /p glyphshow
35.658020 0 m /e glyphshow
47.462830 0 m /r glyphshow
55.351440 0 m /i glyphshow
60.682343 0 m /m glyphshow
79.373291 0 m /e glyphshow
91.178101 0 m /n glyphshow
103.338928 0 m /t glyphshow
110.862152 0 m /space glyphshow
116.961304 0 m /three glyphshow
grestore
gsave
1439.019448 58.28 m
1782.72 58.28 l
1782.72 321.72 l
1439.019448 321.72 l
cl
1.000 setgray
fill
grestore
1 setlinejoin
0 setlinecap
[] 0 setdash
gsave
/o {
gsave
newpath
translate
0.8 setlinewidth
1 setlinejoin
0 setlinecap
0 0 m
0 -3.5 l

gsave
0.000 setgray
fill
grestore
stroke
grestore
} bind def
1458.87 58.28 o
grestore
/DejaVuSans findfont
16.000 scalefont
setfont
gsave
1438.497307 39.123750 translate
0.000000 rotate
0.000000 0 m /eight glyphshow
10.179688 0 m /zero glyphshow
20.359375 0 m /zero glyphshow
30.539062 0 m /zero glyphshow
grestore
gsave
/o {
gsave
newpath
translate
0.8 setlinewidth
1 setlinejoin
0 setlinecap
0 0 m
0 -3.5 l

gsave
0.000 setgray
fill
grestore
stroke
grestore
} bind def
1547 58.28 o
grestore
gsave
1521.530774 39.123750 translate
0.000000 rotate
0.000000 0 m /one glyphshow
10.179688 0 m /zero glyphshow
20.359375 0 m /zero glyphshow
30.539062 0 m /zero glyphshow
40.718750 0 m /zero glyphshow
grestore
gsave
/o {
gsave
newpath
translate
0.8 setlinewidth
1 setlinejoin
0 setlinecap
0 0 m
0 -3.5 l

gsave
0.000 setgray
fill
grestore
stroke
grestore
} bind def
1635.13 58.28 o
grestore
gsave
1609.657990 39.123750 translate
0.000000 rotate
0.000000 0 m /one glyphshow
10.179688 0 m /two glyphshow
20.359375 0 m /zero glyphshow
30.539062 0 m /zero glyphshow
40.718750 0 m /zero glyphshow
grestore
gsave
/o {
gsave
newpath
translate
0.8 setlinewidth
1 setlinejoin
0 setlinecap
0 0 m
0 -3.5 l

gsave
0.000 setgray
fill
grestore
stroke
grestore
} bind def
1723.25 58.28 o
grestore
gsave
1697.785207 39.123750 translate
0.000000 rotate
0.000000 0 m /one glyphshow
10.179688 0 m /four glyphshow
20.359375 0 m /zero glyphshow
30.539062 0 m /zero glyphshow
40.718750 0 m /zero glyphshow
grestore
gsave
1570.518161 19.639375 translate
0.000000 rotate
0.000000 0 m /T glyphshow
9.273438 0 m /i glyphshow
13.718750 0 m /m glyphshow
29.304688 0 m /e glyphshow
39.148438 0 m /space glyphshow
44.234375 0 m /bracketleft glyphshow
50.476562 0 m /m glyphshow
66.062500 0 m /s glyphshow
74.398438 0 m /bracketright glyphshow
grestore
gsave
/o {
gsave
newpath
translate
0.8 setlinewidth
1 setlinejoin
0 setlinecap
0 0 m
-3.5 0 l

gsave
0.000 setgray
fill
grestore
stroke
grestore
} bind def
1439.02 65.6914 o
grestore
gsave
1375.988198 59.613250 translate
0.000000 rotate
0.000000 0 m /one glyphshow
10.179688 0 m /period glyphshow
15.265625 0 m /five glyphshow
25.445312 0 m /zero glyphshow
35.625000 0 m /five glyphshow
45.804688 0 m /zero glyphshow
grestore
gsave
/o {
gsave
newpath
translate
0.8 setlinewidth
1 setlinejoin
0 setlinecap
0 0 m
-3.5 0 l

gsave
0.000 setgray
fill
grestore
stroke
grestore
} bind def
1439.02 101.787 o
grestore
gsave
1375.988198 95.709306 translate
0.000000 rotate
0.000000 0 m /one glyphshow
10.179688 0 m /period glyphshow
15.265625 0 m /five glyphshow
25.445312 0 m /zero glyphshow
35.625000 0 m /seven glyphshow
45.804688 0 m /five glyphshow
grestore
gsave
/o {
gsave
newpath
translate
0.8 setlinewidth
1 setlinejoin
0 setlinecap
0 0 m
-3.5 0 l

gsave
0.000 setgray
fill
grestore
stroke
grestore
} bind def
1439.02 137.883 o
grestore
gsave
1375.988198 131.805362 translate
0.000000 rotate
0.000000 0 m /one glyphshow
10.179688 0 m /period glyphshow
15.265625 0 m /five glyphshow
25.445312 0 m /one glyphshow
35.625000 0 m /zero glyphshow
45.804688 0 m /zero glyphshow
grestore
gsave
/o {
gsave
newpath
translate
0.8 setlinewidth
1 setlinejoin
0 setlinecap
0 0 m
-3.5 0 l

gsave
0.000 setgray
fill
grestore
stroke
grestore
} bind def
1439.02 173.98 o
grestore
gsave
1375.988198 167.901418 translate
0.000000 rotate
0.000000 0 m /one glyphshow
10.179688 0 m /period glyphshow
15.265625 0 m /five glyphshow
25.445312 0 m /one glyphshow
35.625000 0 m /two glyphshow
45.804688 0 m /five glyphshow
grestore
gsave
/o {
gsave
newpath
translate
0.8 setlinewidth
1 setlinejoin
0 setlinecap
0 0 m
-3.5 0 l

gsave
0.000 setgray
fill
grestore
stroke
grestore
} bind def
1439.02 210.076 o
grestore
gsave
1375.988198 203.997474 translate
0.000000 rotate
0.000000 0 m /one glyphshow
10.179688 0 m /period glyphshow
15.265625 0 m /five glyphshow
25.445312 0 m /one glyphshow
35.625000 0 m /five glyphshow
45.804688 0 m /zero glyphshow
grestore
gsave
/o {
gsave
newpath
translate
0.8 setlinewidth
1 setlinejoin
0 setlinecap
0 0 m
-3.5 0 l

gsave
0.000 setgray
fill
grestore
stroke
grestore
} bind def
1439.02 246.172 o
grestore
gsave
1375.988198 240.093530 translate
0.000000 rotate
0.000000 0 m /one glyphshow
10.179688 0 m /period glyphshow
15.265625 0 m /five glyphshow
25.445312 0 m /one glyphshow
35.625000 0 m /seven glyphshow
45.804688 0 m /five glyphshow
grestore
gsave
/o {
gsave
newpath
translate
0.8 setlinewidth
1 setlinejoin
0 setlinecap
0 0 m
-3.5 0 l

gsave
0.000 setgray
fill
grestore
stroke
grestore
} bind def
1439.02 282.268 o
grestore
gsave
1375.988198 276.189586 translate
0.000000 rotate
0.000000 0 m /one glyphshow
10.179688 0 m /period glyphshow
15.265625 0 m /five glyphshow
25.445312 0 m /two glyphshow
35.625000 0 m /zero glyphshow
45.804688 0 m /zero glyphshow
grestore
gsave
/o {
gsave
newpath
translate
0.8 setlinewidth
1 setlinejoin
0 setlinecap
0 0 m
-3.5 0 l

gsave
0.000 setgray
fill
grestore
stroke
grestore
} bind def
1439.02 318.364 o
grestore
gsave
1375.988198 312.285642 translate
0.000000 rotate
0.000000 0 m /one glyphshow
10.179688 0 m /period glyphshow
15.265625 0 m /five glyphshow
25.445312 0 m /two glyphshow
35.625000 0 m /two glyphshow
45.804688 0 m /five glyphshow
grestore
1.500 setlinewidth
2 setlinecap
0.122 0.467 0.706 setrgbcolor
gsave
343.7 263.4 1439 58.28 clipbox
1454.6422 288.152012 m
1455.347218 285.796364 l
1455.875981 281.085067 l
1456.845381 285.796364 l
1457.286017 290.50766 l
1457.726653 288.152012 l
1458.29948 283.440715 l
1458.78418 283.440715 l
1459.224816 300.322861 l
1460.50266 281.085067 l
1460.943296 288.152012 l
1461.427996 290.50766 l
1461.956759 276.37377 l
1462.485523 283.440715 l
1463.454922 278.729419 l
1463.939622 295.611565 l
1464.556512 281.085067 l
1465.041212 281.085067 l
1465.481848 288.152012 l
1466.010611 293.255917 l
1466.451247 283.440715 l
1466.891883 283.440715 l
1467.905346 288.152012 l
1468.390046 297.967213 l
1469.095064 283.440715 l
1469.5357 278.729419 l
1469.976336 293.255917 l
1470.416972 297.967213 l
1470.901672 288.152012 l
1471.342308 293.255917 l
1471.782944 285.796364 l
1472.267644 295.611565 l
1472.752343 300.322861 l
1473.369234 288.152012 l
1473.897997 290.50766 l
1474.338633 288.152012 l
1474.823333 297.967213 l
1475.308033 288.152012 l
1475.792732 290.50766 l
1476.277432 285.796364 l
1476.718068 290.50766 l
1477.158704 305.034158 l
1478.128104 290.50766 l
1478.56874 290.50766 l
1479.009376 300.322861 l
1479.450012 297.967213 l
1479.934712 288.152012 l
1480.419411 293.255917 l
1480.948175 295.611565 l
1481.388811 300.322861 l
1481.829447 288.152012 l
1482.402274 293.255917 l
1483.063228 290.50766 l
1483.503864 305.034158 l
1483.988564 307.389806 l
1484.4292 293.255917 l
1485.04609 297.967213 l
1485.486726 293.255917 l
1485.927362 302.67851 l
1486.412062 297.967213 l
1486.852698 295.611565 l
1487.513652 293.255917 l
1487.954288 295.611565 l
1488.394924 302.67851 l
1488.879624 295.611565 l
1489.364324 295.611565 l
1489.849023 300.322861 l
1490.28966 309.745455 l
1490.818423 300.322861 l
1491.303123 300.322861 l
1491.964077 295.611565 l
1492.448776 300.322861 l
1492.889412 309.745455 l
1493.374112 297.967213 l
1493.858812 293.255917 l
1494.299448 300.322861 l
1494.784148 302.67851 l
1495.312911 288.152012 l
1495.753547 288.152012 l
1496.722946 302.67851 l
1497.25171 297.967213 l
1497.736409 297.967213 l
1498.265173 295.611565 l
1498.749872 300.322861 l
1499.190508 300.322861 l
1499.675208 295.611565 l
1500.159908 297.967213 l
1500.600544 293.255917 l
1501.129307 300.322861 l
1501.878389 285.796364 l
1502.407152 288.152012 l
1502.891852 300.322861 l
1503.464678 302.67851 l
1503.905315 295.611565 l
1504.390014 285.796364 l
1504.874714 293.255917 l
1505.359414 293.255917 l
1505.80005 297.967213 l
1506.549131 283.440715 l
1506.989767 283.440715 l
1507.474467 293.255917 l
1507.959167 300.322861 l
1508.443866 290.50766 l
1508.884502 285.796364 l
1509.413266 285.796364 l
1509.853902 288.152012 l
1510.294538 302.67851 l
1510.999556 281.085067 l
1511.440192 283.440715 l
1511.924891 283.440715 l
1512.365527 293.255917 l
1512.806163 283.440715 l
1513.2468 281.085067 l
1513.687436 281.085067 l
1514.260263 274.018122 l
1514.700899 288.152012 l
1515.141535 278.729419 l
1515.758425 276.37377 l
1516.199061 276.37377 l
1516.639697 283.440715 l
1517.168461 271.662474 l
1517.609097 276.37377 l
1518.049733 274.018122 l
1518.534433 268.914218 l
1519.063196 281.085067 l
1519.503832 271.662474 l
1520.385104 266.558569 l
1520.913867 266.558569 l
1521.398567 281.085067 l
1521.883267 264.202921 l
1522.367966 264.202921 l
1522.808603 259.491624 l
1523.249239 268.914218 l
1523.689875 264.202921 l
1524.174574 257.135976 l
1524.703338 257.135976 l
1525.364292 261.847273 l
1525.848992 271.662474 l
1526.289628 261.847273 l
1526.818391 259.491624 l
1527.259027 252.42468 l
1527.699663 261.847273 l
1528.140299 259.491624 l
1528.713126 259.491624 l
1529.197826 252.42468 l
1529.902844 261.847273 l
1530.34348 261.847273 l
1530.872243 257.135976 l
1531.312879 254.780328 l
1532.238215 259.491624 l
1532.766978 250.069031 l
1533.207614 244.965127 l
1533.64825 250.069031 l
1534.309204 252.42468 l
1534.74984 264.202921 l
1535.278604 244.965127 l
1535.71924 247.713383 l
1536.20394 244.965127 l
1536.688639 252.42468 l
1537.129275 240.25383 l
1537.569911 244.965127 l
1538.010547 237.898182 l
1538.495247 237.898182 l
1539.112138 252.42468 l
1539.552774 240.25383 l
1540.522173 240.25383 l
1541.006873 242.609478 l
1541.491573 235.542534 l
1541.932209 237.898182 l
1542.416908 233.186885 l
1542.857544 240.25383 l
1543.562562 247.713383 l
1544.003198 237.898182 l
1545.413234 237.898182 l
1545.941997 230.831237 l
1546.382633 228.475589 l
1546.867333 233.186885 l
1547.307969 228.475589 l
1547.924859 240.25383 l
1548.365495 230.831237 l
1548.806132 237.898182 l
1549.246768 228.475589 l
1549.731467 230.831237 l
1550.216167 235.542534 l
1550.700867 226.11994 l
1551.185566 230.831237 l
1551.626202 218.660387 l
1552.33122 237.898182 l
1552.859984 230.831237 l
1553.344683 226.11994 l
1553.873446 226.11994 l
1554.314083 228.475589 l
1554.754719 233.186885 l
1555.195355 213.949091 l
1555.680054 223.764292 l
1556.120691 221.016036 l
1556.737581 223.764292 l
1557.310408 218.660387 l
1557.751044 223.764292 l
1558.235744 216.304739 l
1558.720443 221.016036 l
1559.16108 228.475589 l
1559.645779 221.016036 l
1560.086415 216.304739 l
1560.571115 213.949091 l
1561.276133 223.764292 l
1561.760832 206.882146 l
1562.245532 221.016036 l
1562.774295 211.593443 l
1563.258995 216.304739 l
1563.831822 206.882146 l
1564.272458 206.882146 l
1564.757158 209.237794 l
1565.241857 216.304739 l
1565.990939 213.949091 l
1567.400974 213.949091 l
1568.370374 204.526498 l
1568.855073 202.170849 l
1569.824473 218.660387 l
1570.485427 204.526498 l
1571.01419 204.526498 l
1571.49889 202.170849 l
1571.939526 211.593443 l
1572.424226 213.949091 l
1572.908925 206.882146 l
1573.349561 204.526498 l
1573.922388 202.170849 l
1574.363024 211.593443 l
1575.068042 199.422593 l
1575.508678 199.422593 l
1576.478078 204.526498 l
1577.932177 197.066945 l
1578.372813 197.066945 l
1578.857512 206.882146 l
1579.474403 199.422593 l
1579.915039 192.355648 l
1580.355675 190 l
1580.928502 211.593443 l
1581.413202 199.422593 l
1581.853838 192.355648 l
1582.426665 194.711297 l
1583.352001 194.711297 l
1584.012955 202.170849 l
1584.453591 194.711297 l
1584.93829 190 l
1585.467054 194.711297 l
1585.90769 197.066945 l
1586.348326 197.066945 l
1586.833026 194.711297 l
1587.273662 194.711297 l
1587.758361 204.526498 l
1588.419315 185.288703 l
1588.859952 185.288703 l
1589.300588 192.355648 l
1589.873415 199.422593 l
1590.314051 192.355648 l
1590.79875 187.644352 l
1591.327514 187.644352 l
1591.76815 185.288703 l
1592.208786 197.066945 l
1592.825676 182.933055 l
1593.398503 190 l
1593.883203 187.644352 l
1594.323839 192.355648 l
1594.764475 178.221759 l
1595.205111 175.473502 l
1595.822002 180.577407 l
1596.262638 180.577407 l
1596.703274 190 l
1597.496419 187.644352 l
1597.981119 185.288703 l
1598.906454 185.288703 l
1599.435218 187.644352 l
1599.919917 187.644352 l
1600.360553 182.933055 l
1600.845253 194.711297 l
1601.374016 185.288703 l
1602.079034 178.221759 l
1602.563734 175.473502 l
1603.00437 202.170849 l
1603.533133 190 l
1604.017833 182.933055 l
1604.546596 182.933055 l
1605.031296 180.577407 l
1605.471932 192.355648 l
1605.912568 185.288703 l
1606.617586 182.933055 l
1607.058222 185.288703 l
1607.631049 194.711297 l
1608.115748 180.577407 l
1608.556385 187.644352 l
1610.583311 178.221759 l
1611.288328 182.933055 l
1611.773028 180.577407 l
1612.213664 202.170849 l
1612.6543 187.644352 l
1613.094936 182.933055 l
1613.579636 182.933055 l
1614.064336 187.644352 l
1614.593099 185.288703 l
1615.033735 185.288703 l
1615.650625 190 l
1616.135325 192.355648 l
1616.620025 199.422593 l
1617.192852 192.355648 l
1618.118188 187.644352 l
1618.558824 199.422593 l
1619.043523 185.288703 l
1619.528223 187.644352 l
1620.233241 187.644352 l
1620.762004 190 l
1621.290767 182.933055 l
1621.731403 182.933055 l
1622.216103 192.355648 l
1622.700803 185.288703 l
1623.27363 194.711297 l
1623.714266 185.288703 l
1624.287093 192.355648 l
1624.99211 187.644352 l
1625.47681 197.066945 l
1625.917446 192.355648 l
1626.358082 192.355648 l
1626.974973 199.422593 l
1627.415609 202.170849 l
1627.900309 187.644352 l
1628.385008 192.355648 l
1628.869708 185.288703 l
1630.015362 199.422593 l
1630.588189 199.422593 l
1631.028825 194.711297 l
1631.469461 192.355648 l
1631.954161 204.526498 l
1632.43886 194.711297 l
1632.879496 194.711297 l
1633.364196 202.170849 l
1634.02515 209.237794 l
1634.465786 209.237794 l
1634.906422 197.066945 l
1635.391122 187.644352 l
1635.831758 197.066945 l
1636.272394 194.711297 l
1636.757094 190 l
1637.19773 192.355648 l
1637.638366 190 l
1638.387447 194.711297 l
1638.828084 202.170849 l
1639.312783 192.355648 l
1639.841547 192.355648 l
1640.282183 190 l
1640.766882 202.170849 l
1641.251582 185.288703 l
1641.780345 192.355648 l
1642.265045 197.066945 l
1642.881936 194.711297 l
1643.322572 199.422593 l
1643.763208 190 l
1644.291971 185.288703 l
1644.776671 187.644352 l
1645.349498 199.422593 l
1645.790134 192.355648 l
1646.715469 187.644352 l
1647.420487 192.355648 l
1648.389887 182.933055 l
1649.315222 192.355648 l
1649.843986 194.711297 l
1650.284622 182.933055 l
1651.165894 187.644352 l
1651.782784 197.066945 l
1652.22342 197.066945 l
1652.796247 180.577407 l
1653.721583 185.288703 l
1654.162219 192.355648 l
1654.602855 185.288703 l
1655.043491 182.933055 l
1655.484128 182.933055 l
1656.321336 180.577407 l
1656.938227 175.473502 l
1657.378863 178.221759 l
1657.819499 175.473502 l
1658.304198 182.933055 l
1658.744835 182.933055 l
1659.185471 170.762206 l
1659.626107 170.762206 l
1660.066743 166.050909 l
1660.683633 178.221759 l
1661.300524 163.695261 l
1661.829287 166.050909 l
1662.313987 175.473502 l
1662.798687 178.221759 l
1663.283386 175.473502 l
1663.768086 161.339613 l
1664.340913 163.695261 l
1664.781549 163.695261 l
1665.266249 166.050909 l
1666.103457 154.272668 l
1666.588157 158.983964 l
1667.072857 158.983964 l
1667.557556 168.406557 l
1668.08632 158.983964 l
1668.526956 156.628316 l
1668.967592 156.628316 l
1669.540419 168.406557 l
1670.025118 156.628316 l
1670.730136 158.983964 l
1671.170772 154.272668 l
1671.655472 163.695261 l
1672.096108 151.524411 l
1672.580808 149.168763 l
1673.065507 156.628316 l
1673.550207 154.272668 l
1673.990843 161.339613 l
1674.475543 149.168763 l
1675.092433 144.457466 l
1675.577133 144.457466 l
1676.105896 163.695261 l
1676.546532 149.168763 l
1676.987168 149.168763 l
1677.427805 142.101818 l
1677.956568 146.813115 l
1678.441267 154.272668 l
1678.881904 146.813115 l
1679.542858 139.74617 l
1680.027557 137.390522 l
1680.556321 154.272668 l
1680.996957 139.74617 l
1681.966356 135.034873 l
1682.451056 139.74617 l
1682.891692 149.168763 l
1683.332328 137.390522 l
1683.993282 137.390522 l
1684.433918 142.101818 l
1684.918618 149.168763 l
1685.359254 132.679225 l
1685.843954 129.930969 l
1686.28459 132.679225 l
1686.769289 132.679225 l
1687.209926 144.457466 l
1687.738689 125.219672 l
1688.97247 132.679225 l
1689.413106 144.457466 l
1689.941869 137.390522 l
1690.382505 135.034873 l
1690.823141 125.219672 l
1691.263778 125.219672 l
1691.792541 135.034873 l
1692.233177 129.930969 l
1692.850067 120.508376 l
1693.334767 122.864024 l
1693.775403 135.034873 l
1694.260103 127.57532 l
1695.229502 122.864024 l
1695.714202 122.864024 l
1696.198902 137.390522 l
1696.727665 122.864024 l
1697.388619 127.57532 l
1697.873319 127.57532 l
1698.402082 135.034873 l
1698.842718 120.508376 l
1699.283354 122.864024 l
1699.72399 120.508376 l
1700.164626 120.508376 l
1700.649326 129.930969 l
1701.530598 120.508376 l
1702.27968 122.864024 l
1702.720316 132.679225 l
1703.205015 120.508376 l
1703.645652 118.152727 l
1704.086288 118.152727 l
1704.570987 111.085782 l
1705.055687 125.219672 l
1705.496323 111.085782 l
1705.936959 115.797079 l
1707.919822 108.730134 l
1710.695829 105.981878 l
1711.180529 111.085782 l
1711.797419 122.864024 l
1712.238055 108.730134 l
1712.766818 105.981878 l
1713.295582 108.730134 l
1713.780281 115.797079 l
1714.793744 105.981878 l
1715.234381 105.981878 l
1715.851271 111.085782 l
1716.335971 118.152727 l
1716.82067 103.62623 l
1717.30537 101.270581 l
1717.79007 96.559285 l
1718.230706 111.085782 l
1718.759469 105.981878 l
1719.772932 101.270581 l
1720.213568 101.270581 l
1720.698268 113.441431 l
1721.138904 101.270581 l
1721.623604 96.559285 l
1722.152367 94.203636 l
1722.593003 101.270581 l
1723.033639 105.981878 l
1723.562403 98.914933 l
1724.26742 98.914933 l
1724.708056 108.730134 l
1725.148692 108.730134 l
1725.589329 91.847988 l
1726.029965 87.136692 l
1726.470601 89.49234 l
1727.395936 98.914933 l
1727.880636 94.203636 l
1728.629717 91.847988 l
1729.202544 103.62623 l
1729.64318 105.981878 l
1730.12788 89.49234 l
1730.61258 87.136692 l
1731.053216 82.032787 l
1731.493852 94.203636 l
1731.934488 96.559285 l
1732.507315 79.677139 l
1733.520778 87.136692 l
1733.961414 91.847988 l
1734.842686 87.136692 l
1735.37145 82.032787 l
1735.812086 91.847988 l
1736.737421 82.032787 l
1737.222121 84.781043 l
1737.971202 91.847988 l
1738.411839 94.203636 l
1738.852475 91.847988 l
1739.337174 87.136692 l
1739.910001 79.677139 l
1740.791273 89.49234 l
1741.231909 77.32149 l
1741.672546 79.677139 l
1742.377563 82.032787 l
1742.906327 87.136692 l
1743.346963 82.032787 l
1743.831662 84.781043 l
1744.272298 82.032787 l
1744.712935 84.781043 l
1745.153571 84.781043 l
1745.63827 77.32149 l
1746.167034 82.032787 l
1746.651733 79.677139 l
1747.797387 79.677139 l
1748.282087 77.32149 l
1748.722723 79.677139 l
1749.207423 87.136692 l
1749.648059 87.136692 l
1750.088695 82.032787 l
1750.617458 79.677139 l
1751.278412 91.847988 l
1751.763112 87.136692 l
1752.203748 84.781043 l
1752.688448 79.677139 l
1753.305338 77.32149 l
1753.745974 82.032787 l
1754.18661 77.32149 l
1754.627246 79.677139 l
1755.067883 84.781043 l
1756.037282 82.032787 l
1756.610109 74.965842 l
1757.094809 77.32149 l
1757.535445 77.32149 l
1758.064208 87.136692 l
1758.548908 77.32149 l
1759.033607 82.032787 l
1759.474243 79.677139 l
1760.003007 79.677139 l
1760.708024 87.136692 l
1761.192724 70.254545 l
1761.677424 89.49234 l
1762.11806 84.781043 l
1762.558696 96.559285 l
1763.439968 82.032787 l
1763.924668 82.032787 l
1764.409368 84.781043 l
1766.656612 84.781043 l
1767.097248 96.559285 l
1767.097248 96.559285 l
stroke
grestore
0.800 setlinewidth
0 setlinejoin
[] 0 setdash
0.000 setgray
gsave
1439.019448 58.28 m
1439.019448 321.72 l
stroke
grestore
gsave
1782.72 58.28 m
1782.72 321.72 l
stroke
grestore
gsave
1439.019448 58.28 m
1782.72 58.28 l
stroke
grestore
gsave
1439.019448 321.72 m
1782.72 321.72 l
stroke
grestore
/DejaVuSans findfont
19.200 scalefont
setfont
gsave
1546.275974 327.720000 translate
0.000000 rotate
0.000000 0 m /E glyphshow
12.123352 0 m /x glyphshow
23.478455 0 m /p glyphshow
35.658020 0 m /e glyphshow
47.462830 0 m /r glyphshow
55.351440 0 m /i glyphshow
60.682343 0 m /m glyphshow
79.373291 0 m /e glyphshow
91.178101 0 m /n glyphshow
103.338928 0 m /t glyphshow
110.862152 0 m /space glyphshow
116.961304 0 m /five glyphshow
grestore

end
showpage
