%!PS-Adobe-3.0 EPSF-3.0
%%Title: pics\gyro_vs_motor_vs_ccs_acc_2.eps
%%Creator: matplotlib version 3.2.1, http://matplotlib.org/
%%CreationDate: Mon Mar 29 20:53:51 2021
%%Orientation: portrait
%%BoundingBox: -234.0 36.0 846.0 756.0
%%EndComments
%%BeginProlog
/mpldict 8 dict def
mpldict begin
/m { moveto } bind def
/l { lineto } bind def
/r { rlineto } bind def
/c { curveto } bind def
/cl { closepath } bind def
/box {
m
1 index 0 r
0 exch r
neg 0 r
cl
} bind def
/clipbox {
box
clip
newpath
} bind def
%!PS-Adobe-3.0 Resource-Font
%%Title: DejaVu Sans
%%Copyright: Copyright (c) 2003 by Bitstream, Inc. All Rights Reserved. Copyright (c) 2006 by Tavmjong Bah. All Rights Reserved. DejaVu changes are in public domain 
%%Creator: Converted from TrueType to type 3 by PPR
25 dict begin
/_d{bind def}bind def
/_m{moveto}_d
/_l{lineto}_d
/_cl{closepath eofill}_d
/_c{curveto}_d
/_sc{7 -1 roll{setcachedevice}{pop pop pop pop pop pop}ifelse}_d
/_e{exec}_d
/FontName /DejaVuSans def
/PaintType 0 def
/FontMatrix[.001 0 0 .001 0 0]def
/FontBBox[-1021 -463 1793 1232]def
/FontType 3 def
/Encoding [ /space /zero /one /two /three /four /five /six /seven /eight /A /C /H /M /R /S /T /Z /bracketleft /bracketright /a /b /c /e /g /h /i /l /m /n /o /p /r /s /t /u /v /x /y /z /minus ] def
/FontInfo 10 dict dup begin
/FamilyName (DejaVu Sans) def
/FullName (DejaVu Sans) def
/Notice (Copyright (c) 2003 by Bitstream, Inc. All Rights Reserved. Copyright (c) 2006 by Tavmjong Bah. All Rights Reserved. DejaVu changes are in public domain ) def
/Weight (Book) def
/Version (Version 2.35) def
/ItalicAngle 0.0 def
/isFixedPitch false def
/UnderlinePosition -130 def
/UnderlineThickness 90 def
end readonly def
/CharStrings 42 dict dup begin
/.notdef 0 def
/space{318 0 0 0 0 0 _sc
}_d
/zero{636 0 66 -13 570 742 _sc
318 664 _m
267 664 229 639 203 589 _c
177 539 165 464 165 364 _c
165 264 177 189 203 139 _c
229 89 267 64 318 64 _c
369 64 407 89 433 139 _c
458 189 471 264 471 364 _c
471 464 458 539 433 589 _c
407 639 369 664 318 664 _c
318 742 _m
399 742 461 709 505 645 _c
548 580 570 486 570 364 _c
570 241 548 147 505 83 _c
461 19 399 -13 318 -13 _c
236 -13 173 19 130 83 _c
87 147 66 241 66 364 _c
66 486 87 580 130 645 _c
173 709 236 742 318 742 _c
_cl}_d
/one{636 0 110 0 544 729 _sc
124 83 _m
285 83 _l
285 639 _l
110 604 _l
110 694 _l
284 729 _l
383 729 _l
383 83 _l
544 83 _l
544 0 _l
124 0 _l
124 83 _l
_cl}_d
/two{{636 0 73 0 536 742 _sc
192 83 _m
536 83 _l
536 0 _l
73 0 _l
73 83 _l
110 121 161 173 226 239 _c
290 304 331 346 348 365 _c
380 400 402 430 414 455 _c
426 479 433 504 433 528 _c
433 566 419 598 392 622 _c
365 646 330 659 286 659 _c
255 659 222 653 188 643 _c
154 632 117 616 78 594 _c
78 694 _l
118 710 155 722 189 730 _c
223 738 255 742 284 742 _c
}_e{359 742 419 723 464 685 _c
509 647 532 597 532 534 _c
532 504 526 475 515 449 _c
504 422 484 390 454 354 _c
446 344 420 317 376 272 _c
332 227 271 164 192 83 _c
_cl}_e}_d
/three{{636 0 76 -13 556 742 _sc
406 393 _m
453 383 490 362 516 330 _c
542 298 556 258 556 212 _c
556 140 531 84 482 45 _c
432 6 362 -13 271 -13 _c
240 -13 208 -10 176 -4 _c
144 1 110 10 76 22 _c
76 117 _l
103 101 133 89 166 81 _c
198 73 232 69 268 69 _c
330 69 377 81 409 105 _c
441 129 458 165 458 212 _c
458 254 443 288 413 312 _c
383 336 341 349 287 349 _c
}_e{202 349 _l
202 430 _l
291 430 _l
339 430 376 439 402 459 _c
428 478 441 506 441 543 _c
441 580 427 609 401 629 _c
374 649 336 659 287 659 _c
260 659 231 656 200 650 _c
169 644 135 635 98 623 _c
98 711 _l
135 721 170 729 203 734 _c
235 739 266 742 296 742 _c
370 742 429 725 473 691 _c
517 657 539 611 539 553 _c
539 513 527 479 504 451 _c
481 423 448 403 406 393 _c
_cl}_e}_d
/four{636 0 49 0 580 729 _sc
378 643 _m
129 254 _l
378 254 _l
378 643 _l
352 729 _m
476 729 _l
476 254 _l
580 254 _l
580 172 _l
476 172 _l
476 0 _l
378 0 _l
378 172 _l
49 172 _l
49 267 _l
352 729 _l
_cl}_d
/five{{636 0 77 -13 549 729 _sc
108 729 _m
495 729 _l
495 646 _l
198 646 _l
198 467 _l
212 472 227 476 241 478 _c
255 480 270 482 284 482 _c
365 482 429 459 477 415 _c
525 370 549 310 549 234 _c
549 155 524 94 475 51 _c
426 8 357 -13 269 -13 _c
238 -13 207 -10 175 -6 _c
143 -1 111 6 77 17 _c
77 116 _l
106 100 136 88 168 80 _c
199 72 232 69 267 69 _c
}_e{323 69 368 83 401 113 _c
433 143 450 183 450 234 _c
450 284 433 324 401 354 _c
368 384 323 399 267 399 _c
241 399 214 396 188 390 _c
162 384 135 375 108 363 _c
108 729 _l
_cl}_e}_d
/six{{636 0 70 -13 573 742 _sc
330 404 _m
286 404 251 388 225 358 _c
199 328 186 286 186 234 _c
186 181 199 139 225 109 _c
251 79 286 64 330 64 _c
374 64 409 79 435 109 _c
461 139 474 181 474 234 _c
474 286 461 328 435 358 _c
409 388 374 404 330 404 _c
526 713 _m
526 623 _l
501 635 476 644 451 650 _c
425 656 400 659 376 659 _c
310 659 260 637 226 593 _c
}_e{192 549 172 482 168 394 _c
187 422 211 444 240 459 _c
269 474 301 482 336 482 _c
409 482 467 459 509 415 _c
551 371 573 310 573 234 _c
573 159 550 99 506 54 _c
462 9 403 -13 330 -13 _c
246 -13 181 19 137 83 _c
92 147 70 241 70 364 _c
70 479 97 571 152 639 _c
206 707 280 742 372 742 _c
396 742 421 739 447 735 _c
472 730 498 723 526 713 _c
_cl}_e}_d
/seven{636 0 82 0 551 729 _sc
82 729 _m
551 729 _l
551 687 _l
286 0 _l
183 0 _l
432 646 _l
82 646 _l
82 729 _l
_cl}_d
/eight{{636 0 68 -13 568 742 _sc
318 346 _m
271 346 234 333 207 308 _c
180 283 167 249 167 205 _c
167 161 180 126 207 101 _c
234 76 271 64 318 64 _c
364 64 401 76 428 102 _c
455 127 469 161 469 205 _c
469 249 455 283 429 308 _c
402 333 365 346 318 346 _c
219 388 _m
177 398 144 418 120 447 _c
96 476 85 511 85 553 _c
85 611 105 657 147 691 _c
188 725 245 742 318 742 _c
}_e{390 742 447 725 489 691 _c
530 657 551 611 551 553 _c
551 511 539 476 515 447 _c
491 418 459 398 417 388 _c
464 377 501 355 528 323 _c
554 291 568 251 568 205 _c
568 134 546 80 503 43 _c
459 5 398 -13 318 -13 _c
237 -13 175 5 132 43 _c
89 80 68 134 68 205 _c
68 251 81 291 108 323 _c
134 355 171 377 219 388 _c
183 544 _m
183 506 194 476 218 455 _c
}_e{242 434 275 424 318 424 _c
360 424 393 434 417 455 _c
441 476 453 506 453 544 _c
453 582 441 611 417 632 _c
393 653 360 664 318 664 _c
275 664 242 653 218 632 _c
194 611 183 582 183 544 _c
_cl}_e}_d
/A{684 0 8 0 676 729 _sc
342 632 _m
208 269 _l
476 269 _l
342 632 _l
286 729 _m
398 729 _l
676 0 _l
573 0 _l
507 187 _l
178 187 _l
112 0 _l
8 0 _l
286 729 _l
_cl}_d
/C{{698 0 56 -13 644 742 _sc
644 673 _m
644 569 _l
610 599 575 622 537 638 _c
499 653 460 661 418 661 _c
334 661 270 635 226 584 _c
182 533 160 460 160 364 _c
160 268 182 194 226 143 _c
270 92 334 67 418 67 _c
460 67 499 74 537 90 _c
575 105 610 128 644 159 _c
644 56 _l
609 32 572 15 534 4 _c
496 -7 455 -13 412 -13 _c
302 -13 215 20 151 87 _c
}_e{87 154 56 246 56 364 _c
56 481 87 573 151 641 _c
215 708 302 742 412 742 _c
456 742 497 736 535 725 _c
573 713 610 696 644 673 _c
_cl}_e}_d
/H{752 0 98 0 654 729 _sc
98 729 _m
197 729 _l
197 430 _l
555 430 _l
555 729 _l
654 729 _l
654 0 _l
555 0 _l
555 347 _l
197 347 _l
197 0 _l
98 0 _l
98 729 _l
_cl}_d
/M{863 0 98 0 765 729 _sc
98 729 _m
245 729 _l
431 233 _l
618 729 _l
765 729 _l
765 0 _l
669 0 _l
669 640 _l
481 140 _l
382 140 _l
194 640 _l
194 0 _l
98 0 _l
98 729 _l
_cl}_d
/R{{695 0 98 0 666 729 _sc
444 342 _m
465 334 486 319 506 296 _c
526 272 546 240 566 199 _c
666 0 _l
560 0 _l
467 187 _l
443 235 419 268 397 284 _c
374 300 343 308 304 308 _c
197 308 _l
197 0 _l
98 0 _l
98 729 _l
321 729 _l
404 729 466 711 507 677 _c
548 642 569 589 569 519 _c
569 473 558 434 537 404 _c
515 374 484 353 444 342 _c
197 648 _m
197 389 _l
321 389 _l
}_e{368 389 404 400 428 422 _c
452 444 465 476 465 519 _c
465 561 452 593 428 615 _c
404 637 368 648 321 648 _c
197 648 _l
_cl}_e}_d
/S{{635 0 66 -13 579 742 _sc
535 705 _m
535 609 _l
497 627 462 640 429 649 _c
395 657 363 662 333 662 _c
279 662 237 651 208 631 _c
179 610 165 580 165 542 _c
165 510 174 485 194 469 _c
213 452 250 439 304 429 _c
364 417 _l
437 403 491 378 526 343 _c
561 307 579 260 579 201 _c
579 130 555 77 508 41 _c
460 5 391 -13 300 -13 _c
265 -13 228 -9 189 -2 _c
}_e{150 5 110 16 69 32 _c
69 134 _l
109 111 148 94 186 83 _c
224 71 262 66 300 66 _c
356 66 399 77 430 99 _c
460 121 476 152 476 194 _c
476 230 465 258 443 278 _c
421 298 385 313 335 323 _c
275 335 _l
201 349 148 372 115 404 _c
82 435 66 478 66 534 _c
66 598 88 649 134 686 _c
179 723 242 742 322 742 _c
356 742 390 739 426 733 _c
461 727 497 717 535 705 _c
}_e{_cl}_e}_d
/T{611 0 -2 0 614 729 _sc
-2 729 _m
614 729 _l
614 646 _l
355 646 _l
355 0 _l
256 0 _l
256 646 _l
-2 646 _l
-2 729 _l
_cl}_d
/Z{685 0 45 0 640 729 _sc
56 729 _m
629 729 _l
629 654 _l
168 83 _l
640 83 _l
640 0 _l
45 0 _l
45 75 _l
506 646 _l
56 646 _l
56 729 _l
_cl}_d
/bracketleft{390 0 86 -131 293 760 _sc
86 760 _m
293 760 _l
293 690 _l
176 690 _l
176 -61 _l
293 -61 _l
293 -131 _l
86 -131 _l
86 760 _l
_cl}_d
/bracketright{390 0 97 -131 304 760 _sc
304 760 _m
304 -131 _l
97 -131 _l
97 -61 _l
214 -61 _l
214 690 _l
97 690 _l
97 760 _l
304 760 _l
_cl}_d
/a{{613 0 60 -13 522 560 _sc
343 275 _m
270 275 220 266 192 250 _c
164 233 150 205 150 165 _c
150 133 160 107 181 89 _c
202 70 231 61 267 61 _c
317 61 357 78 387 114 _c
417 149 432 196 432 255 _c
432 275 _l
343 275 _l
522 312 _m
522 0 _l
432 0 _l
432 83 _l
411 49 385 25 355 10 _c
325 -5 287 -13 243 -13 _c
187 -13 142 2 109 33 _c
76 64 60 106 60 159 _c
}_e{60 220 80 266 122 298 _c
163 329 224 345 306 345 _c
432 345 _l
432 354 _l
432 395 418 427 391 450 _c
364 472 326 484 277 484 _c
245 484 215 480 185 472 _c
155 464 127 453 100 439 _c
100 522 _l
132 534 164 544 195 550 _c
226 556 256 560 286 560 _c
365 560 424 539 463 498 _c
502 457 522 395 522 312 _c
_cl}_e}_d
/b{{635 0 91 -13 580 760 _sc
487 273 _m
487 339 473 390 446 428 _c
418 466 381 485 334 485 _c
286 485 249 466 222 428 _c
194 390 181 339 181 273 _c
181 207 194 155 222 117 _c
249 79 286 61 334 61 _c
381 61 418 79 446 117 _c
473 155 487 207 487 273 _c
181 464 _m
199 496 223 520 252 536 _c
281 552 316 560 356 560 _c
422 560 476 533 518 481 _c
559 428 580 359 580 273 _c
}_e{580 187 559 117 518 65 _c
476 13 422 -13 356 -13 _c
316 -13 281 -5 252 10 _c
223 25 199 49 181 82 _c
181 0 _l
91 0 _l
91 760 _l
181 760 _l
181 464 _l
_cl}_e}_d
/c{{550 0 55 -13 488 560 _sc
488 526 _m
488 442 _l
462 456 437 466 411 473 _c
385 480 360 484 334 484 _c
276 484 230 465 198 428 _c
166 391 150 339 150 273 _c
150 206 166 154 198 117 _c
230 80 276 62 334 62 _c
360 62 385 65 411 72 _c
437 79 462 90 488 104 _c
488 21 _l
462 9 436 0 410 -5 _c
383 -10 354 -13 324 -13 _c
242 -13 176 12 128 64 _c
}_e{79 115 55 185 55 273 _c
55 362 79 432 128 483 _c
177 534 244 560 330 560 _c
358 560 385 557 411 551 _c
437 545 463 537 488 526 _c
_cl}_e}_d
/e{{615 0 55 -13 562 560 _sc
562 296 _m
562 252 _l
149 252 _l
153 190 171 142 205 110 _c
238 78 284 62 344 62 _c
378 62 412 66 444 74 _c
476 82 509 95 541 113 _c
541 28 _l
509 14 476 3 442 -3 _c
408 -9 373 -13 339 -13 _c
251 -13 182 12 131 62 _c
80 112 55 181 55 268 _c
55 357 79 428 127 481 _c
175 533 241 560 323 560 _c
397 560 455 536 498 489 _c
}_e{540 441 562 377 562 296 _c
472 322 _m
471 371 457 410 431 440 _c
404 469 368 484 324 484 _c
274 484 234 469 204 441 _c
174 413 156 373 152 322 _c
472 322 _l
_cl}_e}_d
/g{{635 0 55 -207 544 560 _sc
454 280 _m
454 344 440 395 414 431 _c
387 467 349 485 301 485 _c
253 485 215 467 188 431 _c
161 395 148 344 148 280 _c
148 215 161 165 188 129 _c
215 93 253 75 301 75 _c
349 75 387 93 414 129 _c
440 165 454 215 454 280 _c
544 68 _m
544 -24 523 -93 482 -139 _c
440 -184 377 -207 292 -207 _c
260 -207 231 -204 203 -200 _c
175 -195 147 -188 121 -178 _c
}_e{121 -91 _l
147 -105 173 -115 199 -122 _c
225 -129 251 -133 278 -133 _c
336 -133 380 -117 410 -87 _c
439 -56 454 -10 454 52 _c
454 96 _l
435 64 411 40 382 24 _c
353 8 319 0 279 0 _c
211 0 157 25 116 76 _c
75 127 55 195 55 280 _c
55 364 75 432 116 483 _c
157 534 211 560 279 560 _c
319 560 353 552 382 536 _c
411 520 435 496 454 464 _c
454 547 _l
544 547 _l
}_e{544 68 _l
_cl}_e}_d
/h{634 0 91 0 549 760 _sc
549 330 _m
549 0 _l
459 0 _l
459 327 _l
459 379 448 417 428 443 _c
408 469 378 482 338 482 _c
289 482 251 466 223 435 _c
195 404 181 362 181 309 _c
181 0 _l
91 0 _l
91 760 _l
181 760 _l
181 462 _l
202 494 227 519 257 535 _c
286 551 320 560 358 560 _c
420 560 468 540 500 501 _c
532 462 549 405 549 330 _c
_cl}_d
/i{278 0 94 0 184 760 _sc
94 547 _m
184 547 _l
184 0 _l
94 0 _l
94 547 _l
94 760 _m
184 760 _l
184 646 _l
94 646 _l
94 760 _l
_cl}_d
/l{278 0 94 0 184 760 _sc
94 760 _m
184 760 _l
184 0 _l
94 0 _l
94 760 _l
_cl}_d
/m{{974 0 91 0 889 560 _sc
520 442 _m
542 482 569 511 600 531 _c
631 550 668 560 711 560 _c
767 560 811 540 842 500 _c
873 460 889 403 889 330 _c
889 0 _l
799 0 _l
799 327 _l
799 379 789 418 771 444 _c
752 469 724 482 686 482 _c
639 482 602 466 575 435 _c
548 404 535 362 535 309 _c
535 0 _l
445 0 _l
445 327 _l
445 379 435 418 417 444 _c
398 469 369 482 331 482 _c
}_e{285 482 248 466 221 435 _c
194 404 181 362 181 309 _c
181 0 _l
91 0 _l
91 547 _l
181 547 _l
181 462 _l
201 495 226 520 255 536 _c
283 552 317 560 357 560 _c
397 560 430 550 458 530 _c
486 510 506 480 520 442 _c
_cl}_e}_d
/n{634 0 91 0 549 560 _sc
549 330 _m
549 0 _l
459 0 _l
459 327 _l
459 379 448 417 428 443 _c
408 469 378 482 338 482 _c
289 482 251 466 223 435 _c
195 404 181 362 181 309 _c
181 0 _l
91 0 _l
91 547 _l
181 547 _l
181 462 _l
202 494 227 519 257 535 _c
286 551 320 560 358 560 _c
420 560 468 540 500 501 _c
532 462 549 405 549 330 _c
_cl}_d
/o{612 0 55 -13 557 560 _sc
306 484 _m
258 484 220 465 192 427 _c
164 389 150 338 150 273 _c
150 207 163 156 191 118 _c
219 80 257 62 306 62 _c
354 62 392 80 420 118 _c
448 156 462 207 462 273 _c
462 337 448 389 420 427 _c
392 465 354 484 306 484 _c
306 560 _m
384 560 445 534 490 484 _c
534 433 557 363 557 273 _c
557 183 534 113 490 63 _c
445 12 384 -13 306 -13 _c
227 -13 165 12 121 63 _c
77 113 55 183 55 273 _c
55 363 77 433 121 484 _c
165 534 227 560 306 560 _c
_cl}_d
/p{{635 0 91 -207 580 560 _sc
181 82 _m
181 -207 _l
91 -207 _l
91 547 _l
181 547 _l
181 464 _l
199 496 223 520 252 536 _c
281 552 316 560 356 560 _c
422 560 476 533 518 481 _c
559 428 580 359 580 273 _c
580 187 559 117 518 65 _c
476 13 422 -13 356 -13 _c
316 -13 281 -5 252 10 _c
223 25 199 49 181 82 _c
487 273 _m
487 339 473 390 446 428 _c
418 466 381 485 334 485 _c
}_e{286 485 249 466 222 428 _c
194 390 181 339 181 273 _c
181 207 194 155 222 117 _c
249 79 286 61 334 61 _c
381 61 418 79 446 117 _c
473 155 487 207 487 273 _c
_cl}_e}_d
/r{411 0 91 0 411 560 _sc
411 463 _m
401 469 390 473 378 476 _c
366 478 353 480 339 480 _c
288 480 249 463 222 430 _c
194 397 181 350 181 288 _c
181 0 _l
91 0 _l
91 547 _l
181 547 _l
181 462 _l
199 495 224 520 254 536 _c
284 552 321 560 365 560 _c
371 560 378 559 386 559 _c
393 558 401 557 411 555 _c
411 463 _l
_cl}_d
/s{{521 0 54 -13 472 560 _sc
443 531 _m
443 446 _l
417 458 391 468 364 475 _c
336 481 308 485 279 485 _c
234 485 200 478 178 464 _c
156 450 145 430 145 403 _c
145 382 153 366 169 354 _c
185 342 217 330 265 320 _c
296 313 _l
360 299 405 279 432 255 _c
458 230 472 195 472 151 _c
472 100 452 60 412 31 _c
372 1 316 -13 246 -13 _c
216 -13 186 -10 154 -5 _c
}_e{122 0 89 8 54 20 _c
54 113 _l
87 95 120 82 152 74 _c
184 65 216 61 248 61 _c
290 61 323 68 346 82 _c
368 96 380 117 380 144 _c
380 168 371 187 355 200 _c
339 213 303 226 247 238 _c
216 245 _l
160 257 119 275 95 299 _c
70 323 58 356 58 399 _c
58 450 76 490 112 518 _c
148 546 200 560 268 560 _c
301 560 332 557 362 552 _c
391 547 418 540 443 531 _c
}_e{_cl}_e}_d
/t{392 0 27 0 368 702 _sc
183 702 _m
183 547 _l
368 547 _l
368 477 _l
183 477 _l
183 180 _l
183 135 189 106 201 94 _c
213 81 238 75 276 75 _c
368 75 _l
368 0 _l
276 0 _l
206 0 158 13 132 39 _c
106 65 93 112 93 180 _c
93 477 _l
27 477 _l
27 547 _l
93 547 _l
93 702 _l
183 702 _l
_cl}_d
/u{634 0 85 -13 543 560 _sc
85 216 _m
85 547 _l
175 547 _l
175 219 _l
175 167 185 129 205 103 _c
225 77 255 64 296 64 _c
344 64 383 79 411 110 _c
439 141 453 183 453 237 _c
453 547 _l
543 547 _l
543 0 _l
453 0 _l
453 84 _l
431 50 405 26 377 10 _c
348 -5 315 -13 277 -13 _c
214 -13 166 6 134 45 _c
101 83 85 140 85 216 _c
311 560 _m
311 560 _l
_cl}_d
/v{592 0 30 0 562 547 _sc
30 547 _m
125 547 _l
296 88 _l
467 547 _l
562 547 _l
357 0 _l
235 0 _l
30 547 _l
_cl}_d
/x{592 0 29 0 559 547 _sc
549 547 _m
351 281 _l
559 0 _l
453 0 _l
294 215 _l
135 0 _l
29 0 _l
241 286 _l
47 547 _l
153 547 _l
298 352 _l
443 547 _l
549 547 _l
_cl}_d
/y{592 0 30 -207 562 547 _sc
322 -50 _m
296 -114 271 -157 247 -177 _c
223 -197 191 -207 151 -207 _c
79 -207 _l
79 -132 _l
132 -132 _l
156 -132 175 -126 189 -114 _c
203 -102 218 -75 235 -31 _c
251 9 _l
30 547 _l
125 547 _l
296 119 _l
467 547 _l
562 547 _l
322 -50 _l
_cl}_d
/z{525 0 43 0 482 547 _sc
55 547 _m
482 547 _l
482 465 _l
144 72 _l
482 72 _l
482 0 _l
43 0 _l
43 82 _l
381 475 _l
55 475 _l
55 547 _l
_cl}_d
/minus{838 0 106 272 732 355 _sc
106 355 _m
732 355 _l
732 272 _l
106 272 _l
106 355 _l
_cl}_d
end readonly def

/BuildGlyph
 {exch begin
 CharStrings exch
 2 copy known not{pop /.notdef}if
 true 3 1 roll get exec
 end}_d

/BuildChar {
 1 index /Encoding get exch get
 1 index /BuildGlyph get exec
}_d

FontName currentdict end definefont pop
end
%%EndProlog
mpldict begin
-234 36 translate
1080 720 0 0 clipbox
gsave
0 0 m
1080 0 l
1080 720 l
0 720 l
cl
1.000 setgray
fill
grestore
gsave
135 90 m
972 90 l
972 633.6 l
135 633.6 l
cl
1.000 setgray
fill
grestore
0.800 setlinewidth
1 setlinejoin
0 setlinecap
[] 0 setdash
0.000 setgray
gsave
/o {
gsave
newpath
translate
0.8 setlinewidth
1 setlinejoin
0 setlinecap
0 0 m
0 -3.5 l

gsave
0.000 setgray
fill
grestore
stroke
grestore
} bind def
135 90 o
grestore
/DejaVuSans findfont
16.000 scalefont
setfont
gsave
129.906250 70.843750 translate
0.000000 rotate
0.000000 0 m /zero glyphshow
grestore
gsave
/o {
gsave
newpath
translate
0.8 setlinewidth
1 setlinejoin
0 setlinecap
0 0 m
0 -3.5 l

gsave
0.000 setgray
fill
grestore
stroke
grestore
} bind def
263.769 90 o
grestore
gsave
243.394231 70.843750 translate
0.000000 rotate
0.000000 0 m /two glyphshow
10.179688 0 m /zero glyphshow
20.359375 0 m /zero glyphshow
30.539062 0 m /zero glyphshow
grestore
gsave
/o {
gsave
newpath
translate
0.8 setlinewidth
1 setlinejoin
0 setlinecap
0 0 m
0 -3.5 l

gsave
0.000 setgray
fill
grestore
stroke
grestore
} bind def
392.538 90 o
grestore
gsave
372.163462 70.843750 translate
0.000000 rotate
0.000000 0 m /four glyphshow
10.179688 0 m /zero glyphshow
20.359375 0 m /zero glyphshow
30.539062 0 m /zero glyphshow
grestore
gsave
/o {
gsave
newpath
translate
0.8 setlinewidth
1 setlinejoin
0 setlinecap
0 0 m
0 -3.5 l

gsave
0.000 setgray
fill
grestore
stroke
grestore
} bind def
521.308 90 o
grestore
gsave
500.932692 70.843750 translate
0.000000 rotate
0.000000 0 m /six glyphshow
10.179688 0 m /zero glyphshow
20.359375 0 m /zero glyphshow
30.539062 0 m /zero glyphshow
grestore
gsave
/o {
gsave
newpath
translate
0.8 setlinewidth
1 setlinejoin
0 setlinecap
0 0 m
0 -3.5 l

gsave
0.000 setgray
fill
grestore
stroke
grestore
} bind def
650.077 90 o
grestore
gsave
629.701923 70.843750 translate
0.000000 rotate
0.000000 0 m /eight glyphshow
10.179688 0 m /zero glyphshow
20.359375 0 m /zero glyphshow
30.539062 0 m /zero glyphshow
grestore
gsave
/o {
gsave
newpath
translate
0.8 setlinewidth
1 setlinejoin
0 setlinecap
0 0 m
0 -3.5 l

gsave
0.000 setgray
fill
grestore
stroke
grestore
} bind def
778.846 90 o
grestore
gsave
753.377404 70.843750 translate
0.000000 rotate
0.000000 0 m /one glyphshow
10.179688 0 m /zero glyphshow
20.359375 0 m /zero glyphshow
30.539062 0 m /zero glyphshow
40.718750 0 m /zero glyphshow
grestore
gsave
/o {
gsave
newpath
translate
0.8 setlinewidth
1 setlinejoin
0 setlinecap
0 0 m
0 -3.5 l

gsave
0.000 setgray
fill
grestore
stroke
grestore
} bind def
907.615 90 o
grestore
gsave
882.146635 70.843750 translate
0.000000 rotate
0.000000 0 m /one glyphshow
10.179688 0 m /two glyphshow
20.359375 0 m /zero glyphshow
30.539062 0 m /zero glyphshow
40.718750 0 m /zero glyphshow
grestore
gsave
513.148438 51.359375 translate
0.000000 rotate
0.000000 0 m /T glyphshow
9.273438 0 m /i glyphshow
13.718750 0 m /m glyphshow
29.304688 0 m /e glyphshow
39.148438 0 m /space glyphshow
44.234375 0 m /bracketleft glyphshow
50.476562 0 m /m glyphshow
66.062500 0 m /s glyphshow
74.398438 0 m /bracketright glyphshow
grestore
gsave
/o {
gsave
newpath
translate
0.8 setlinewidth
1 setlinejoin
0 setlinecap
0 0 m
-3.5 0 l

gsave
0.000 setgray
fill
grestore
stroke
grestore
} bind def
135 126.24 o
grestore
gsave
104.406250 120.161875 translate
0.000000 rotate
0.000000 0 m /minus glyphshow
13.406250 0 m /two glyphshow
grestore
gsave
/o {
gsave
newpath
translate
0.8 setlinewidth
1 setlinejoin
0 setlinecap
0 0 m
-3.5 0 l

gsave
0.000 setgray
fill
grestore
stroke
grestore
} bind def
135 198.72 o
grestore
gsave
104.406250 192.641875 translate
0.000000 rotate
0.000000 0 m /minus glyphshow
13.406250 0 m /one glyphshow
grestore
gsave
/o {
gsave
newpath
translate
0.8 setlinewidth
1 setlinejoin
0 setlinecap
0 0 m
-3.5 0 l

gsave
0.000 setgray
fill
grestore
stroke
grestore
} bind def
135 271.2 o
grestore
gsave
117.812500 265.121875 translate
0.000000 rotate
0.000000 0 m /zero glyphshow
grestore
gsave
/o {
gsave
newpath
translate
0.8 setlinewidth
1 setlinejoin
0 setlinecap
0 0 m
-3.5 0 l

gsave
0.000 setgray
fill
grestore
stroke
grestore
} bind def
135 343.68 o
grestore
gsave
117.812500 337.601875 translate
0.000000 rotate
0.000000 0 m /one glyphshow
grestore
gsave
/o {
gsave
newpath
translate
0.8 setlinewidth
1 setlinejoin
0 setlinecap
0 0 m
-3.5 0 l

gsave
0.000 setgray
fill
grestore
stroke
grestore
} bind def
135 416.16 o
grestore
gsave
117.812500 410.081875 translate
0.000000 rotate
0.000000 0 m /two glyphshow
grestore
gsave
/o {
gsave
newpath
translate
0.8 setlinewidth
1 setlinejoin
0 setlinecap
0 0 m
-3.5 0 l

gsave
0.000 setgray
fill
grestore
stroke
grestore
} bind def
135 488.64 o
grestore
gsave
117.812500 482.561875 translate
0.000000 rotate
0.000000 0 m /three glyphshow
grestore
gsave
/o {
gsave
newpath
translate
0.8 setlinewidth
1 setlinejoin
0 setlinecap
0 0 m
-3.5 0 l

gsave
0.000 setgray
fill
grestore
stroke
grestore
} bind def
135 561.12 o
grestore
gsave
117.812500 555.041875 translate
0.000000 rotate
0.000000 0 m /four glyphshow
grestore
gsave
/o {
gsave
newpath
translate
0.8 setlinewidth
1 setlinejoin
0 setlinecap
0 0 m
-3.5 0 l

gsave
0.000 setgray
fill
grestore
stroke
grestore
} bind def
135 633.6 o
grestore
gsave
117.812500 627.521875 translate
0.000000 rotate
0.000000 0 m /five glyphshow
grestore
gsave
97.078125 277.839063 translate
90.000000 rotate
0.000000 0 m /A glyphshow
10.945312 0 m /n glyphshow
21.085938 0 m /g glyphshow
31.242188 0 m /u glyphshow
41.382812 0 m /l glyphshow
45.828125 0 m /a glyphshow
55.632812 0 m /r glyphshow
62.210938 0 m /space glyphshow
67.296875 0 m /v glyphshow
76.765625 0 m /e glyphshow
86.609375 0 m /l glyphshow
91.054688 0 m /o glyphshow
100.843750 0 m /c glyphshow
109.640625 0 m /i glyphshow
114.085938 0 m /t glyphshow
120.359375 0 m /y glyphshow
129.828125 0 m /space glyphshow
134.914062 0 m /bracketleft glyphshow
141.156250 0 m /H glyphshow
153.187500 0 m /z glyphshow
161.585938 0 m /bracketright glyphshow
grestore
2.000 setlinewidth
2 setlinecap
0.122 0.467 0.706 setrgbcolor
gsave
837 543.6 135 90 clipbox
134.742462 271.273342 m
138.734308 271.22839 l
139.378154 271.287537 l
141.824769 271.256781 l
145.881 271.256781 l
151.160538 271.22839 l
153.929077 271.242586 l
161.333308 271.256781 l
168.351231 271.242586 l
253.725231 271.301733 l
254.369077 271.386904 l
255.012923 271.61876 l
257.266385 274.218854 l
257.910231 275.82055 l
260.099308 278.463231 l
260.936308 280.455296 l
262.288385 282.854292 l
263.125385 285.494606 l
264.413077 287.42989 l
266.344615 289.942448 l
267.052846 290.621453 l
267.696692 291.473168 l
269.306308 294.016481 l
270.014538 294.593754 l
270.658385 296.715943 l
272.203615 298.11654 l
272.847462 299.748992 l
274.199538 300.917734 l
275.551615 302.550186 l
276.581769 305.003597 l
277.225615 305.003597 l
277.869462 306.418389 l
279.414692 307.733814 l
280.058538 310.042907 l
281.990077 312.167461 l
284.372308 315.299877 l
285.080538 316.629498 l
285.853154 317.206771 l
286.497 317.85502 l
287.784692 319.863646 l
288.621692 321.668808 l
290.360077 323.833582 l
291.068308 324.238146 l
291.712154 325.913184 l
292.613538 326.708118 l
293.257385 327.616613 l
293.965615 329.495116 l
294.738231 330.216708 l
296.154692 332.095211 l
297.828692 334.794672 l
299.953385 337.075374 l
300.597231 338.447581 l
302.142462 340.340279 l
302.850692 342.086294 l
304.782231 343.863064 l
305.490462 344.859097 l
306.134308 346.650063 l
307.679538 348.022269 l
308.387769 349.292743 l
310.705615 352.439355 l
311.349462 352.945652 l
311.993308 353.596267 l
312.701538 354.476372 l
313.474154 356.714488 l
314.182385 357.334347 l
314.826231 357.653739 l
315.534462 358.99519 l
316.307077 360.121345 l
317.272846 362.158362 l
318.689308 363.154395 l
319.397538 365.248192 l
320.105769 366.433495 l
321.522231 367.443723 l
322.166077 368.960248 l
323.003077 370.157379 l
324.033231 371.255145 l
324.741462 371.832418 l
325.385308 372.613156 l
326.029154 373.609188 l
326.673 375.833109 l
328.089462 377.089388 l
328.733308 377.83937 l
329.441538 379.16899 l
330.664846 380.396879 l
333.369 384.250886 l
334.012846 385.608897 l
334.656692 386.678272 l
335.300538 387.312326 l
335.944385 387.790233 l
336.910154 389.680565 l
339.678692 393.219912 l
340.386923 393.522743 l
341.867769 395.862592 l
343.606154 397.594411 l
344.25 398.864885 l
344.958231 400.82856 l
345.666462 401.507565 l
346.310308 402.822991 l
346.954154 403.875805 l
347.598 404.237783 l
349.143231 406.490094 l
350.173385 408.467965 l
350.817231 409.407216 l
351.461077 410.055465 l
353.457 413.218638 l
354.744692 414.791944 l
355.517308 416.062418 l
356.547462 418.042653 l
358.092692 418.461413 l
358.800923 420.365941 l
359.509154 420.914824 l
360.217385 421.319388 l
360.99 422.980231 l
361.633846 423.602456 l
363.372231 426.633139 l
364.016077 427.09685 l
364.659923 428.395715 l
366.655846 431.528131 l
367.364077 432.006037 l
368.007923 432.685043 l
368.716154 434.402667 l
369.617538 436.278804 l
370.261385 436.278804 l
370.905231 438.083966 l
371.742231 439.269268 l
372.386077 439.702223 l
373.029923 439.903322 l
373.673769 441.665898 l
374.510769 442.084657 l
376.893 445.188683 l
377.536846 446.416571 l
378.373846 447.412604 l
379.082077 448.467783 l
379.725923 448.841591 l
380.369769 450.821827 l
381.786231 452.366742 l
383.395846 453.289433 l
384.039692 453.391165 l
384.683538 453.37697 l
385.327385 453.708192 l
386.228769 453.623021 l
386.872615 453.679802 l
387.516462 453.045748 l
388.160308 452.726355 l
389.190462 452.395133 l
390.027462 452.553646 l
390.671308 452.250814 l
391.315154 452.250814 l
392.667231 451.962178 l
393.439846 452.106496 l
394.148077 451.990568 l
394.791923 452.279205 l
395.950846 452.352547 l
396.723462 452.641183 l
397.367308 452.451914 l
398.719385 452.423523 l
400.135846 452.539451 l
400.779692 452.2934 l
401.552308 452.51106 l
402.582462 452.626988 l
403.290692 452.944015 l
403.934538 452.870673 l
404.642769 453.088334 l
405.930462 452.409328 l
406.638692 452.177472 l
407.346923 451.701932 l
408.055154 451.557614 l
409.020923 452.307595 l
409.664769 452.423523 l
410.501769 452.352547 l
411.145615 452.567841 l
413.270308 452.395133 l
413.914154 452.236619 l
415.652538 452.813892 l
418.614231 452.669574 l
419.386846 452.726355 l
420.095077 452.610427 l
420.803308 452.683769 l
421.575923 452.2934 l
422.606077 452.018959 l
423.378692 452.047349 l
424.795154 452.553646 l
426.082846 452.395133 l
426.791077 452.525256 l
427.563692 451.990568 l
428.336308 451.614395 l
429.237692 451.543418 l
431.941846 453.419556 l
434.002154 452.683769 l
434.646 452.279205 l
435.869308 452.163277 l
436.706308 452.655379 l
437.350154 452.813892 l
438.122769 452.451914 l
438.766615 452.366742 l
439.474846 452.033154 l
440.183077 452.222424 l
440.955692 451.903031 l
441.599538 452.018959 l
443.917385 452.307595 l
444.561231 452.986601 l
445.848923 452.596232 l
446.557154 452.785502 l
447.844846 452.307595 l
449.325692 452.335986 l
450.355846 452.726355 l
450.999692 452.669574 l
451.707923 452.813892 l
452.416154 452.423523 l
453.06 452.380937 l
454.412077 451.888836 l
456.021692 451.730322 l
457.695692 452.149082 l
458.339538 452.321791 l
458.983385 452.71216 l
459.949154 452.813892 l
460.657385 452.525256 l
462.782077 452.771307 l
463.747846 452.466109 l
464.456077 452.74055 l
465.099923 452.395133 l
465.743769 452.51106 l
466.387615 452.785502 l
468.383538 452.033154 l
469.027385 452.191668 l
470.894538 452.321791 l
474.435692 452.222424 l
475.143923 452.683769 l
475.852154 452.641183 l
476.882308 452.915625 l
477.590538 452.90143 l
478.234385 452.596232 l
479.650846 452.250814 l
480.938538 451.730322 l
481.582385 451.933787 l
482.290615 453.045748 l
483.900231 452.610427 l
485.960538 451.962178 l
486.668769 451.62859 l
487.441385 451.687737 l
488.085231 451.990568 l
489.759231 453.204261 l
490.403077 453.000796 l
491.111308 452.596232 l
493.236 452.106496 l
493.944231 452.2934 l
495.425077 452.842283 l
497.163462 452.813892 l
497.807308 452.567841 l
499.159385 452.352547 l
499.803231 452.409328 l
501.155308 451.976373 l
502.829308 452.683769 l
504.117 452.596232 l
504.760846 452.525256 l
506.048538 451.933787 l
507.658154 451.62859 l
508.302 451.947983 l
509.332154 452.870673 l
510.040385 452.986601 l
510.748615 452.92982 l
511.392462 453.102529 l
512.100692 453.088334 l
512.744538 452.582037 l
513.452769 452.26501 l
514.096615 452.120691 l
515.899385 452.335986 l
516.607615 452.74055 l
517.251462 452.525256 l
517.895308 452.120691 l
518.539154 452.078106 l
519.183 452.335986 l
519.826846 452.437718 l
520.470692 452.352547 l
521.307692 452.092301 l
522.273462 452.307595 l
523.110462 452.279205 l
523.818692 452.641183 l
525.235154 452.496865 l
527.295462 452.90143 l
528.003692 452.757111 l
529.033846 452.395133 l
530.321538 452.48267 l
531.029769 452.177472 l
532.510615 452.423523 l
533.798308 451.903031 l
534.635308 451.789469 l
535.601077 452.120691 l
536.244923 452.120691 l
536.888769 452.496865 l
540.365538 452.958211 l
541.138154 452.669574 l
542.103923 452.669574 l
544.293 452.120691 l
545.001231 452.409328 l
545.645077 452.380937 l
547.769769 452.525256 l
549.894462 452.395133 l
550.538308 452.092301 l
551.954769 452.321791 l
552.598615 452.149082 l
553.306846 452.48267 l
554.079462 452.437718 l
554.787692 452.785502 l
555.431538 452.785502 l
556.526077 452.669574 l
557.942538 452.352547 l
558.650769 452.307595 l
559.423385 452.033154 l
560.839846 451.84625 l
562.320692 452.915625 l
565.089231 452.106496 l
569.338615 452.771307 l
571.463308 452.380937 l
572.879769 452.279205 l
573.523615 452.380937 l
574.489385 452.409328 l
575.262 452.596232 l
575.905846 452.395133 l
577.322308 452.683769 l
578.674385 452.409328 l
579.447 452.134887 l
580.090846 452.134887 l
582.923769 452.539451 l
584.275846 452.451914 l
585.048462 451.673541 l
585.692308 441.13121 l
586.400538 426.273526 l
587.237538 431.168518 l
587.945769 440.539742 l
588.911538 455.094594 l
590.263615 455.816185 l
590.971846 452.856478 l
592.388308 451.84625 l
593.676 452.48267 l
594.770538 452.496865 l
596.251385 453.289433 l
596.895231 454.200294 l
597.539077 454.474735 l
598.182923 454.344612 l
598.955538 454.545711 l
599.663769 455.094594 l
600.500769 455.383231 l
601.466538 454.805957 l
602.239154 457.635542 l
602.883 467.427891 l
603.526846 473.825212 l
604.170692 475.514446 l
604.943308 475.774692 l
605.651538 475.70135 l
606.939231 472.249541 l
607.969385 471.052409 l
608.613231 470.763772 l
609.257077 469.419956 l
609.900923 468.466509 l
611.317385 466.791471 l
612.025615 462.733999 l
612.669462 459.890219 l
614.279077 450.748485 l
614.922923 450.329725 l
615.631154 449.506401 l
616.339385 430.820735 l
617.047615 419.500031 l
617.755846 415.847123 l
618.464077 415.371583 l
619.172308 413.999376 l
619.816154 408.598088 l
620.910692 401.147953 l
621.618923 401.060415 l
622.327154 402.172376 l
622.971 402.692868 l
623.614846 402.633721 l
624.323077 402.80643 l
626.512154 402.113229 l
627.542308 402.489403 l
629.538231 401.666079 l
630.182077 402.345085 l
632.435538 401.436589 l
640.483615 401.680274 l
644.282308 401.91213 l
644.926154 401.796202 l
645.634385 401.869544 l
646.407 402.084839 l
651.107077 401.985472 l
653.360538 402.013862 l
654.970154 401.824592 l
656.515385 401.926325 l
659.155154 401.711031 l
659.927769 401.796202 l
660.893538 401.694469 l
663.018231 401.753616 l
668.877231 401.49337 l
670.293692 401.46498 l
681.303462 401.088806 l
682.719923 401.060415 l
685.424077 400.972878 l
690.510462 400.85695 l
694.953 400.684242 l
695.596846 400.613265 l
697.013308 400.670046 l
698.429769 400.539923 l
701.584615 400.454752 l
703.001077 400.454752 l
703.644923 400.454752 l
704.932615 400.310434 l
712.465615 400.180311 l
713.753308 400.180311 l
717.165692 400.050188 l
720.256154 400.064383 l
720.9 399.948455 l
722.895923 400.019431 l
738.155077 399.804137 l
741.825 399.789942 l
745.366154 399.74499 l
746.782615 399.860918 l
748.778538 399.804137 l
752.512846 399.789942 l
753.156692 399.891674 l
754.573154 399.818332 l
757.921154 399.875113 l
759.208846 399.846722 l
759.852692 399.93426 l
762.299308 399.891674 l
764.617154 399.948455 l
766.162385 399.976846 l
766.806231 400.019431 l
767.450077 399.905869 l
769.961077 400.050188 l
771.313154 400.005236 l
772.794 400.035992 l
775.111846 400.064383 l
778.266692 400.106969 l
780.906462 399.356987 l
781.743462 399.283645 l
783.353077 399.371182 l
784.640769 400.423996 l
785.284615 400.064383 l
785.992846 399.442158 l
789.598385 393.17496 l
790.306615 392.7562 l
791.079231 394.821608 l
793.139538 390.880063 l
793.912154 390.257838 l
794.684769 389.912421 l
795.714923 389.753907 l
796.358769 390.387961 l
797.260154 386.735053 l
797.904 387.962941 l
798.612231 395.573955 l
799.320462 400.712632 l
800.028692 401.405833 l
800.672538 401.391638 l
801.573923 402.274108 l
802.926 402.243352 l
804.406846 401.782007 l
805.050692 401.810397 l
805.758923 401.535956 l
806.467154 401.623493 l
807.175385 400.901902 l
808.269923 399.212668 l
808.913769 398.734762 l
809.622 398.995008 l
810.459 400.395605 l
811.102846 402.172376 l
811.746692 402.404231 l
812.390538 402.158181 l
813.742615 402.042253 l
814.837154 400.729193 l
815.481 400.59907 l
816.124846 400.729193 l
818.249538 400.584875 l
818.893385 400.800169 l
819.537231 400.729193 l
820.245462 400.468947 l
821.275615 401.27571 l
823.335923 401.190538 l
823.979769 400.842755 l
824.688 400.785974 l
827.778462 401.233124 l
829.130538 401.261515 l
829.838769 401.405833 l
831.126462 401.405833 l
831.770308 401.292271 l
835.569 401.535956 l
839.754 401.521761 l
841.492385 401.377442 l
842.844462 401.422394 l
843.617077 401.479175 l
844.969154 401.405833 l
862.353 401.074611 l
863.769462 401.162148 l
865.443462 401.117196 l
870.980538 401.01783 l
872.590154 400.987073 l
873.298385 401.060415 l
873.942231 400.944488 l
887.720538 400.627461 l
889.137 400.554119 l
889.845231 400.59907 l
891.454846 400.497338 l
894.223385 400.454752 l
895.833 400.367215 l
896.798769 400.4098 l
898.215231 400.324629 l
900.404308 400.293873 l
908.194846 400.064383 l
912.766154 399.96265 l
914.053846 399.920065 l
923.067692 399.804137 l
924.548538 399.761551 l
934.463769 399.572281 l
937.167923 399.572281 l
943.026923 399.543891 l
943.670769 399.600672 l
944.379 399.501305 l
945.731077 399.529695 l
949.272231 399.48711 l
949.980462 399.572281 l
950.624308 399.48711 l
952.620231 399.529695 l
955.903846 399.529695 l
958.028538 399.543891 l
959.573769 399.501305 l
961.827231 399.501305 l
968.394462 399.558086 l
972.708231 399.572281 l
972.708231 399.572281 l
stroke
grestore
1.000 0.498 0.055 setrgbcolor
gsave
837 543.6 135 90 clipbox
136.995923 271.2 m
254.433462 271.2755 l
255.012923 271.5775 l
256.171846 272.71 l
257.330769 274.371 l
259.069154 277.3155 l
264.413077 285.0165 l
265.572 286.9795 l
266.151462 287.8855 l
267.889846 289.8485 l
268.469308 290.528 l
269.628231 292.7175 l
270.207692 293.4725 l
270.787154 293.9255 l
271.366615 294.605 l
271.946077 295.813 l
273.105 297.474 l
273.684462 298.0025 l
275.422846 300.796 l
276.581769 302.2305 l
277.161231 303.514 l
278.448923 304.873 l
279.028385 306.0055 l
279.607846 306.7605 l
280.187308 307.2135 l
281.346231 309.252 l
281.925692 309.856 l
283.213385 311.819 l
283.792846 312.272 l
286.110692 315.896 l
287.269615 317.1795 l
287.849077 318.3875 l
288.428538 318.9915 l
289.587462 320.879 l
290.166923 321.483 l
290.746385 322.54 l
291.325846 323.0685 l
291.905308 324.1255 l
293.064231 325.6355 l
294.802615 328.2025 l
295.382077 328.731 l
296.541 330.543 l
297.120462 331.449 l
297.699923 332.053 l
298.279385 333.1855 l
298.858846 333.714 l
299.438308 334.8465 l
300.017769 335.4505 l
302.464385 338.848 l
303.043846 339.5275 l
303.623308 340.811 l
304.202769 341.3395 l
306.520615 344.586 l
307.100077 345.2655 l
307.679538 346.398 l
310.576846 350.2485 l
311.156308 351.23 l
312.315231 352.891 l
312.894692 353.7215 l
313.474154 354.3255 l
315.212538 356.968 l
317.530385 360.139 l
320.427692 364.1405 l
321.135923 364.971 l
321.715385 366.1035 l
322.294846 366.8585 l
322.874308 367.387 l
324.033231 369.35 l
326.930538 373.5025 l
327.51 374.5595 l
329.248385 376.8245 l
329.956615 377.504 l
330.536077 378.6365 l
331.244308 379.3915 l
333.562154 382.8645 l
334.141615 383.4685 l
334.721077 384.45 l
335.300538 385.1295 l
335.88 386.3375 l
336.459462 386.866 l
338.777308 390.339 l
339.356769 390.8675 l
339.936231 392.0755 l
340.515692 392.604 l
341.095154 393.661 l
341.674615 394.1895 l
342.254077 395.02 l
342.833538 396.1525 l
343.541769 396.6055 l
344.121231 397.8135 l
344.700692 398.342 l
345.859615 400.3805 l
346.439077 400.6825 l
347.598 402.721 l
348.177462 403.2495 l
349.465154 405.3635 l
350.173385 405.9675 l
350.752846 407.251 l
352.040538 408.6855 l
352.62 409.8935 l
353.778923 411.1015 l
354.937846 413.291 l
356.225538 414.499 l
356.805 415.858 l
357.384462 416.915 l
358.543385 417.8965 l
359.702308 420.1615 l
360.861231 421.2185 l
361.440692 421.9735 l
362.599615 424.163 l
363.758538 425.5975 l
364.338 426.126 l
365.625692 428.1645 l
366.205154 429.297 l
367.364077 430.7315 l
368.523 431.864 l
369.102462 432.9965 l
369.810692 433.827 l
370.390154 435.035 l
370.969615 435.7145 l
372.128538 437.602 l
372.708 438.206 l
373.287462 439.0365 l
373.866923 439.565 l
374.897077 440.6975 l
375.476538 441.7545 l
377.150538 444.095 l
377.73 445.2275 l
378.888923 446.7375 l
381.464308 450.588 l
382.752 451.796 l
384.619154 452.4 l
385.906846 452.4755 l
386.486308 452.6265 l
387.065769 452.4755 l
387.645231 452.551 l
388.804154 452.3245 l
389.963077 452.098 l
393.697385 452.1735 l
396.015231 452.4 l
396.594692 452.4 l
397.174154 452.551 l
397.753615 452.4755 l
399.041308 452.6265 l
401.359154 452.3245 l
402.646846 452.4 l
403.805769 452.3245 l
406.703077 452.249 l
408.570231 452.098 l
409.149692 452.098 l
409.729154 452.249 l
412.047 452.3245 l
413.785385 452.4755 l
419.129308 452.551 l
420.288231 452.6265 l
421.447154 452.4 l
422.734846 452.249 l
424.022538 452.3245 l
424.602 452.249 l
425.760923 452.3245 l
426.919846 452.249 l
428.078769 452.3245 l
428.658231 452.3245 l
429.817154 452.098 l
434.581615 452.702 l
436.32 452.551 l
439.217308 452.4755 l
442.114615 452.098 l
443.273538 452.249 l
443.981769 452.098 l
447.716077 452.4755 l
449.583231 452.3245 l
450.291462 452.4755 l
452.029846 452.551 l
452.609308 452.6265 l
453.188769 452.4755 l
453.768231 452.551 l
454.347692 452.4755 l
455.506615 452.551 l
456.086077 452.4 l
456.665538 452.4 l
457.824462 452.1735 l
463.747846 452.1735 l
464.327308 452.3245 l
465.486231 452.3245 l
466.065692 452.4755 l
473.856231 452.4 l
476.302846 452.249 l
482.934462 452.249 l
484.093385 452.551 l
485.252308 452.6265 l
485.831769 452.702 l
488.149615 452.4755 l
491.175692 452.4755 l
491.755154 452.249 l
493.493538 452.249 l
494.073 452.098 l
495.231923 452.1735 l
497.099077 452.249 l
498.258 452.4 l
498.837462 452.3245 l
500.575846 452.551 l
501.734769 452.4755 l
507.078692 452.4755 l
507.658154 452.3245 l
508.237615 452.3245 l
508.817077 452.1735 l
509.976 452.3245 l
511.134923 452.249 l
511.714385 452.249 l
512.293846 452.4 l
513.452769 452.249 l
514.032231 452.3245 l
514.611692 452.249 l
515.191154 452.3245 l
516.478846 452.1735 l
520.084385 452.551 l
521.951538 452.4755 l
522.531 452.4 l
523.110462 452.4755 l
524.269385 452.4 l
524.848846 452.551 l
525.428308 452.4 l
528.583154 452.3245 l
529.291385 452.1735 l
530.450308 452.249 l
531.029769 452.098 l
532.768154 452.1735 l
533.927077 452.4 l
534.506538 452.3245 l
535.665462 452.551 l
536.244923 452.4 l
536.824385 452.4 l
537.532615 452.551 l
538.112077 452.4755 l
538.691538 452.6265 l
539.850462 452.4755 l
541.009385 452.551 l
542.297077 452.4 l
542.876538 452.4755 l
545.773846 452.1735 l
550.409538 452.1735 l
551.568462 452.551 l
552.727385 452.4755 l
553.306846 452.551 l
554.465769 452.3245 l
555.624692 452.551 l
559.230231 452.4755 l
559.809692 452.3245 l
561.097385 452.249 l
561.676846 452.1735 l
562.256308 452.249 l
563.415231 452.1735 l
563.994692 452.249 l
564.702923 452.1735 l
565.282385 452.249 l
566.441308 452.1735 l
567.729 452.249 l
571.334538 452.6265 l
572.493462 452.551 l
577.257923 452.4755 l
580.863462 452.098 l
581.442923 452.249 l
582.601846 452.098 l
584.340231 452.4 l
584.919692 453.608 l
585.499154 453.759 l
586.658077 450.0595 l
587.237538 449.7575 l
587.945769 450.3615 l
589.104692 452.7775 l
589.684154 453.155 l
590.263615 453.3815 l
591.551308 453.004 l
592.710231 452.551 l
594.448615 452.4 l
595.028077 452.4755 l
596.766462 452.249 l
598.054154 452.3245 l
599.213077 452.249 l
600.372 452.3245 l
600.951462 452.3245 l
602.110385 451.041 l
603.269308 452.702 l
603.848769 453.0795 l
604.428231 448.2475 l
605.007692 409.7425 l
605.587154 339.2255 l
606.166615 283.9595 l
607.325538 204.76 l
608.484462 164.443 l
609.063923 152.7405 l
609.643385 143.756 l
610.222846 138.32 l
611.381769 131.978 l
611.961231 130.015 l
612.540692 129.562 l
613.120154 128.807 l
613.828385 127.297 l
614.407846 126.391 l
614.987308 127.0705 l
615.566769 128.4295 l
616.146231 127.9765 l
616.725692 126.844 l
618.592846 125.032 l
619.751769 126.9195 l
620.910692 125.183 l
621.490154 125.4095 l
622.069615 126.1645 l
622.649077 125.938 l
623.228538 125.5605 l
624.387462 126.6175 l
625.546385 125.8625 l
626.125846 126.391 l
626.705308 126.6175 l
627.864231 125.7115 l
629.023154 126.693 l
629.602615 126.24 l
630.182077 125.636 l
630.761538 126.391 l
631.341 126.844 l
631.920462 126.24 l
632.499923 125.8625 l
633.079385 126.4665 l
633.787615 126.844 l
634.367077 126.0135 l
634.946538 125.938 l
635.526 126.6175 l
636.105462 126.693 l
636.684923 126.089 l
637.264385 125.938 l
637.972615 126.6175 l
638.552077 126.4665 l
639.131538 125.787 l
639.711 125.8625 l
640.290462 126.693 l
640.869923 126.542 l
641.449385 125.787 l
642.028846 126.0135 l
642.608308 126.6175 l
643.187769 126.3155 l
643.767231 125.787 l
644.346692 126.1645 l
644.926154 126.693 l
645.505615 126.391 l
646.085077 125.7115 l
646.664538 126.089 l
647.244 126.844 l
647.823462 126.4665 l
648.531692 125.8625 l
649.690615 126.844 l
650.270077 126.0135 l
650.978308 125.8625 l
651.879692 126.693 l
653.167385 125.938 l
653.746846 126.6175 l
654.455077 126.693 l
655.034538 125.938 l
655.614 126.0135 l
656.322231 126.7685 l
656.901692 126.4665 l
657.481154 125.8625 l
658.768846 126.7685 l
659.477077 126.1645 l
660.056538 125.8625 l
660.636 126.542 l
661.344231 126.4665 l
661.923692 125.787 l
662.503154 125.938 l
663.082615 126.6175 l
663.662077 126.542 l
664.241538 125.8625 l
664.821 126.1645 l
665.400462 126.9195 l
666.688154 125.8625 l
667.847077 126.7685 l
668.555308 126.089 l
669.134769 125.787 l
669.714231 126.391 l
670.293692 126.6175 l
670.873154 126.0135 l
671.452615 125.787 l
672.032077 126.542 l
672.611538 126.693 l
673.191 126.0135 l
673.770462 125.8625 l
674.349923 126.542 l
674.929385 126.6175 l
675.508846 125.938 l
676.088308 125.787 l
676.667769 126.542 l
677.247231 126.542 l
677.826692 125.8625 l
678.406154 125.938 l
678.985615 126.6175 l
679.565077 126.6175 l
680.144538 125.938 l
680.724 126.0135 l
681.303462 126.693 l
682.011692 126.693 l
682.591154 125.8625 l
683.878846 126.9195 l
684.458308 126.089 l
685.037769 125.787 l
685.617231 126.4665 l
686.196692 126.693 l
686.776154 125.938 l
687.355615 125.7115 l
687.935077 126.391 l
688.514538 127.5235 l
688.514538 127.5235 l
stroke
grestore
0.800 setlinewidth
0 setlinejoin
[] 0 setdash
0.000 setgray
gsave
135 90 m
135 633.6 l
stroke
grestore
gsave
972 90 m
972 633.6 l
stroke
grestore
gsave
135 90 m
972 90 l
stroke
grestore
gsave
135 633.6 m
972 633.6 l
stroke
grestore
1 setlinejoin
0 setlinecap
[] 0 setdash
gsave
/o {
gsave
newpath
translate
0.8 setlinewidth
1 setlinejoin
0 setlinecap
0 0 m
3.5 0 l

gsave
0.000 setgray
fill
grestore
stroke
grestore
} bind def
972 141.771 o
grestore
gsave
979.000000 135.693304 translate
0.000000 rotate
0.000000 0 m /minus glyphshow
13.406250 0 m /one glyphshow
23.585938 0 m /five glyphshow
33.765625 0 m /zero glyphshow
grestore
gsave
/o {
gsave
newpath
translate
0.8 setlinewidth
1 setlinejoin
0 setlinecap
0 0 m
3.5 0 l

gsave
0.000 setgray
fill
grestore
stroke
grestore
} bind def
972 206.486 o
grestore
gsave
979.000000 200.407589 translate
0.000000 rotate
0.000000 0 m /minus glyphshow
13.406250 0 m /one glyphshow
23.585938 0 m /two glyphshow
33.765625 0 m /five glyphshow
grestore
gsave
/o {
gsave
newpath
translate
0.8 setlinewidth
1 setlinejoin
0 setlinecap
0 0 m
3.5 0 l

gsave
0.000 setgray
fill
grestore
stroke
grestore
} bind def
972 271.2 o
grestore
gsave
979.000000 265.121875 translate
0.000000 rotate
0.000000 0 m /minus glyphshow
13.406250 0 m /one glyphshow
23.585938 0 m /zero glyphshow
33.765625 0 m /zero glyphshow
grestore
gsave
/o {
gsave
newpath
translate
0.8 setlinewidth
1 setlinejoin
0 setlinecap
0 0 m
3.5 0 l

gsave
0.000 setgray
fill
grestore
stroke
grestore
} bind def
972 335.914 o
grestore
gsave
979.000000 329.836161 translate
0.000000 rotate
0.000000 0 m /minus glyphshow
13.406250 0 m /seven glyphshow
23.585938 0 m /five glyphshow
grestore
gsave
/o {
gsave
newpath
translate
0.8 setlinewidth
1 setlinejoin
0 setlinecap
0 0 m
3.5 0 l

gsave
0.000 setgray
fill
grestore
stroke
grestore
} bind def
972 400.629 o
grestore
gsave
979.000000 394.550446 translate
0.000000 rotate
0.000000 0 m /minus glyphshow
13.406250 0 m /five glyphshow
23.585938 0 m /zero glyphshow
grestore
gsave
/o {
gsave
newpath
translate
0.8 setlinewidth
1 setlinejoin
0 setlinecap
0 0 m
3.5 0 l

gsave
0.000 setgray
fill
grestore
stroke
grestore
} bind def
972 465.343 o
grestore
gsave
979.000000 459.264732 translate
0.000000 rotate
0.000000 0 m /minus glyphshow
13.406250 0 m /two glyphshow
23.585938 0 m /five glyphshow
grestore
gsave
/o {
gsave
newpath
translate
0.8 setlinewidth
1 setlinejoin
0 setlinecap
0 0 m
3.5 0 l

gsave
0.000 setgray
fill
grestore
stroke
grestore
} bind def
972 530.057 o
grestore
gsave
979.000000 523.979018 translate
0.000000 rotate
0.000000 0 m /zero glyphshow
grestore
gsave
/o {
gsave
newpath
translate
0.8 setlinewidth
1 setlinejoin
0 setlinecap
0 0 m
3.5 0 l

gsave
0.000 setgray
fill
grestore
stroke
grestore
} bind def
972 594.771 o
grestore
gsave
979.000000 588.693304 translate
0.000000 rotate
0.000000 0 m /two glyphshow
10.179688 0 m /five glyphshow
grestore
0.000 0.500 0.000 setrgbcolor
gsave
1039.125000 298.175000 translate
90.000000 rotate
0.000000 0 m /A glyphshow
10.695312 0 m /c glyphshow
19.492188 0 m /c glyphshow
28.289062 0 m /e glyphshow
38.132812 0 m /l glyphshow
42.578125 0 m /e glyphshow
52.421875 0 m /r glyphshow
59.000000 0 m /a glyphshow
68.804688 0 m /t glyphshow
75.078125 0 m /i glyphshow
79.523438 0 m /o glyphshow
89.312500 0 m /n glyphshow
99.453125 0 m /space glyphshow
104.539062 0 m /bracketleft glyphshow
110.781250 0 m /g glyphshow
120.937500 0 m /bracketright glyphshow
grestore
2.000 setlinewidth
2 setlinecap
gsave
837 543.6 135 90 clipbox
126.308077 532.645714 m
460.140762 532.630123 l
460.303656 532.762274 l
460.46436 532.522618 l
460.625707 532.674435 l
461.108528 532.599834 l
461.429421 532.666195 l
461.752245 532.629194 l
462.556666 532.629254 l
462.878976 532.71949 l
463.040066 532.538248 l
463.201414 532.669919 l
463.361603 532.612165 l
463.522951 532.706173 l
463.68314 532.626765 l
463.84423 532.692473 l
464.166475 532.649632 l
464.810192 532.639213 l
465.132244 532.661993 l
465.776541 532.620664 l
466.098335 532.69051 l
466.259104 532.612745 l
466.74186 532.682581 l
467.063847 532.656309 l
468.512179 532.607269 l
468.673462 532.701108 l
468.995128 532.642367 l
469.317695 532.67209 l
469.478463 532.585089 l
469.800129 532.705402 l
470.121859 532.628422 l
470.604808 532.720293 l
470.765769 532.606108 l
471.248654 532.663166 l
473.018844 532.613443 l
473.180385 532.722306 l
473.341154 532.600015 l
473.662948 532.631818 l
473.985515 532.632676 l
474.950319 532.610206 l
475.112246 532.691218 l
475.272821 532.584595 l
475.43404 532.676192 l
475.916732 532.596806 l
476.238783 532.692367 l
476.560835 532.639047 l
477.687309 532.638265 l
478.169485 532.628702 l
478.331348 532.707613 l
478.491859 532.59583 l
478.814168 532.660851 l
479.135898 532.636274 l
479.618718 532.684498 l
479.779615 532.611192 l
479.941285 532.676166 l
480.101925 532.591781 l
480.263144 532.681176 l
480.585131 532.64898 l
482.194425 532.716895 l
482.355258 532.56782 l
482.516605 532.661153 l
482.677245 532.613237 l
482.838335 532.687498 l
483.320125 532.635801 l
483.48186 532.732357 l
483.804169 532.597879 l
484.125963 532.634029 l
484.447758 532.669909 l
485.25263 532.617738 l
485.413591 532.699008 l
485.895381 532.616073 l
486.057373 532.713354 l
486.379682 532.612838 l
486.701734 532.649115 l
494.910129 532.602173 l
495.071348 532.721071 l
495.393722 532.621683 l
496.359169 532.686888 l
496.52013 532.610813 l
497.003401 532.653266 l
497.163977 532.608303 l
497.325389 532.681582 l
497.485771 532.609691 l
497.646797 532.692428 l
498.129488 532.622587 l
498.451991 532.647871 l
498.773141 532.667086 l
499.417309 532.649491 l
501.348397 532.630587 l
501.509938 532.722284 l
501.670835 532.6068 l
501.992887 532.655702 l
502.314488 532.574947 l
502.475901 532.741793 l
502.636025 532.61687 l
502.79763 532.700937 l
502.958463 532.610009 l
503.601794 532.67571 l
504.568143 532.605583 l
504.890195 532.625023 l
505.373015 532.697415 l
505.533783 532.594795 l
505.856415 532.635321 l
506.498844 532.612209 l
506.660321 532.7133 l
506.821476 532.610269 l
507.626605 532.648975 l
510.360634 532.678985 l
510.52372 532.728967 l
510.684424 532.535953 l
511.006669 532.644641 l
511.97173 532.568529 l
512.133528 532.68662 l
512.293589 532.586988 l
512.453971 532.711502 l
513.420641 532.622601 l
514.064423 532.714708 l
514.22429 532.591602 l
514.386217 532.711494 l
514.547243 532.588653 l
515.030385 532.693242 l
515.190446 532.627386 l
515.352309 532.695246 l
515.51224 532.600171 l
515.674038 532.696538 l
515.835 532.604995 l
516.317563 532.670824 l
517.605062 532.637408 l
517.766474 532.690363 l
517.927178 532.600483 l
518.249616 532.664126 l
518.570895 532.648864 l
518.893076 532.633293 l
527.262754 532.731685 l
527.423844 532.602095 l
528.067948 532.699467 l
528.228588 532.608127 l
528.55006 532.693772 l
529.033653 532.57631 l
529.19455 532.686397 l
529.676211 532.661404 l
529.837624 532.714971 l
530.160448 532.618526 l
531.126346 532.701296 l
531.286599 532.563313 l
531.448012 532.680494 l
531.770321 532.630367 l
532.413781 532.735915 l
532.574678 532.58239 l
532.896794 532.654318 l
533.539417 532.656037 l
533.701344 532.716604 l
533.86237 532.577576 l
534.183843 532.642392 l
534.666985 532.715526 l
534.827238 532.629815 l
535.150063 532.62682 l
535.95442 532.622648 l
536.2766 532.676799 l
536.437755 532.589566 l
536.920704 532.688292 l
537.242176 532.663733 l
538.69038 532.590165 l
538.852307 532.730738 l
539.013011 532.580161 l
539.174101 532.681841 l
539.656728 532.640526 l
540.783588 532.665115 l
541.265764 532.584579 l
541.427112 532.685234 l
541.910061 532.623381 l
542.231727 532.662246 l
543.519741 532.627283 l
544.002625 532.693378 l
544.324935 532.648939 l
544.968459 532.623413 l
545.290189 532.675472 l
545.77288 532.629024 l
545.934936 532.664651 l
546.095061 532.570713 l
546.256473 532.714303 l
546.416662 532.617495 l
546.578074 532.702968 l
546.89974 532.653487 l
548.509742 532.660295 l
548.670703 532.601399 l
549.15391 532.712549 l
549.314099 532.565909 l
549.475318 532.699172 l
549.797498 532.646775 l
550.60089 532.619109 l
550.76301 532.716866 l
550.9241 532.56111 l
551.24583 532.651094 l
551.729037 532.712655 l
551.889161 532.589066 l
552.050767 532.700693 l
552.372883 532.638987 l
553.339167 532.624491 l
553.499614 532.590793 l
553.660897 532.681974 l
553.982627 532.642491 l
554.304679 532.721087 l
554.465576 532.58094 l
555.109165 532.664064 l
556.71775 532.620498 l
556.879484 532.73858 l
557.201922 532.585462 l
557.52436 532.668678 l
557.84564 532.667683 l
560.580441 532.682771 l
560.743334 532.723986 l
560.903844 532.517447 l
561.065128 532.685014 l
561.386729 532.65339 l
563.318396 532.721217 l
563.479551 532.579907 l
563.962564 532.661494 l
564.122818 532.610551 l
564.444934 532.64474 l
565.731854 532.596251 l
565.893588 532.714587 l
566.054549 532.598066 l
566.376215 532.644022 l
567.181602 532.672709 l
567.342435 532.595104 l
567.664487 532.657639 l
568.307431 532.603669 l
568.469037 532.726901 l
568.630063 532.598166 l
568.951921 532.632911 l
569.435128 532.63714 l
570.078008 532.64005 l
570.239485 532.705739 l
570.560829 532.630681 l
570.722691 532.691503 l
570.883009 532.60178 l
571.044421 532.687683 l
571.526791 532.604199 l
571.688396 532.713221 l
572.010255 532.633103 l
572.332436 532.712262 l
572.493075 532.571978 l
572.653715 532.680985 l
573.297819 532.653486 l
580.057624 532.736202 l
580.21865 532.582676 l
580.701663 532.657505 l
582.633266 532.649753 l
583.116279 532.596913 l
583.277434 532.693295 l
583.759095 532.659475 l
584.081791 532.629958 l
584.243074 532.57692 l
584.402941 532.682657 l
584.564804 532.560513 l
584.726217 532.852677 l
584.887371 532.243068 l
585.048462 536.527323 l
585.532248 564.821361 l
585.693789 567.036238 l
586.015197 575.823801 l
586.175901 579.560417 l
586.658013 604.798225 l
586.980451 609.082218 l
587.302245 600.514972 l
587.623524 594.113974 l
587.784679 592.872172 l
588.107117 598.469145 l
588.26795 600.031698 l
588.428461 600.09488 l
588.751478 596.58281 l
589.072951 590.529696 l
589.555063 591.963426 l
589.876986 594.080254 l
590.19878 592.166736 l
590.521991 588.344658 l
590.843399 588.132494 l
591.165064 589.068961 l
591.326348 588.628362 l
591.485957 587.764075 l
591.648078 585.979054 l
591.808589 586.066994 l
591.969486 584.85367 l
592.13122 584.786692 l
592.292053 585.533962 l
592.45295 584.759486 l
592.614233 584.888727 l
592.774551 584.649039 l
592.935706 583.215925 l
593.096796 582.931005 l
593.418783 581.595832 l
593.579487 581.265136 l
593.740256 581.364321 l
593.901153 581.217327 l
594.38436 579.308927 l
594.545643 578.316775 l
594.706476 578.358677 l
595.028592 577.082168 l
595.18936 577.333408 l
595.672181 574.751166 l
595.833013 575.049994 l
595.994039 574.261305 l
596.154615 572.809714 l
596.315769 573.953161 l
596.637499 571.956112 l
596.799105 571.910957 l
596.959873 571.24231 l
597.282182 570.859235 l
597.442951 570.309964 l
597.603912 568.827415 l
597.764938 568.563074 l
597.924548 569.737583 l
598.086024 567.284314 l
598.247952 568.342442 l
598.408591 566.136233 l
598.569939 565.547686 l
598.73045 565.795451 l
598.891605 564.502567 l
599.052824 564.284295 l
599.213463 562.769049 l
599.374554 563.465241 l
599.535322 562.231985 l
599.697056 563.019564 l
600.018786 559.874496 l
600.179039 559.948323 l
600.340709 559.219919 l
600.500962 560.464928 l
600.66231 558.892798 l
600.823722 558.909941 l
600.984555 559.133054 l
601.145066 557.700703 l
601.306221 557.756291 l
601.467054 557.671118 l
601.628144 557.204386 l
601.949874 555.258227 l
602.110513 556.728518 l
602.272054 555.010317 l
602.432952 555.103007 l
602.755518 529.383616 l
602.916029 535.229807 l
603.076347 531.855471 l
603.238596 525.16443 l
603.3993 533.340729 l
603.560584 526.641738 l
603.720193 534.070204 l
603.882056 526.893832 l
604.043275 533.270332 l
604.204172 528.273849 l
604.363975 529.066829 l
604.526417 531.569733 l
604.686156 529.034374 l
604.847568 530.68354 l
605.169362 529.684514 l
605.330259 530.514525 l
605.491156 529.472165 l
605.65186 530.446252 l
605.812951 530.12469 l
605.974234 529.49705 l
606.13526 530.834034 l
606.296608 529.330794 l
606.457183 530.670235 l
606.61763 529.550597 l
606.777883 530.38329 l
606.939231 530.331884 l
607.100836 529.242627 l
607.261733 531.022302 l
607.42263 529.494743 l
607.744232 530.317887 l
607.905644 529.508194 l
608.067314 530.48746 l
608.388207 529.62973 l
608.548975 530.620515 l
608.710645 529.56349 l
608.870769 530.333539 l
609.032053 530.169761 l
609.19295 529.685506 l
609.354426 530.392265 l
609.514422 529.716693 l
609.675899 530.43136 l
609.837182 529.880548 l
609.997886 529.955052 l
610.159234 530.229104 l
610.319938 529.913999 l
610.481093 530.211424 l
610.801599 529.882539 l
610.963527 530.398284 l
611.124746 529.763306 l
611.285965 530.119706 l
611.446089 530.166426 l
611.608274 529.812263 l
611.768077 530.286721 l
611.929618 529.964174 l
612.250962 530.247763 l
612.412309 529.73558 l
612.573335 530.391364 l
612.734168 529.736937 l
612.89558 530.243937 l
613.21731 529.903729 l
613.377757 530.356411 l
613.538976 529.831641 l
613.70013 530.217471 l
613.860834 529.957511 l
614.02186 529.971416 l
614.183208 530.283771 l
614.34359 529.822006 l
614.505067 530.253609 l
614.665642 529.970681 l
614.826539 529.985338 l
614.986986 530.243679 l
615.149042 529.99557 l
615.309295 529.987128 l
615.470901 530.117764 l
615.63154 529.953618 l
615.792244 530.185165 l
615.952948 530.020376 l
616.113974 530.155798 l
616.275386 530.003853 l
617.402181 530.206716 l
617.563014 529.890079 l
617.724298 530.107683 l
618.046285 530.036862 l
618.368015 530.097967 l
618.528397 529.954274 l
618.689809 530.165966 l
618.850771 529.942402 l
619.011604 530.159942 l
619.333977 530.018682 l
619.816025 530.121854 l
619.977695 529.976734 l
620.299811 530.08345 l
620.460515 529.934213 l
620.621541 530.197095 l
620.782438 529.929298 l
620.943722 530.15479 l
621.103782 529.977232 l
621.265387 530.166597 l
621.587375 530.009025 l
621.909233 530.068144 l
622.391023 530.015451 l
622.552822 530.219663 l
622.713397 529.910103 l
622.874294 530.150946 l
623.196732 529.942631 l
623.357565 530.107923 l
623.678844 530.080309 l
623.840643 530.147553 l
624.001605 529.932155 l
624.162309 530.092864 l
626.898848 529.977478 l
627.059938 530.141926 l
627.220642 529.991232 l
627.381539 530.130942 l
627.54205 530.013991 l
627.703462 530.114453 l
628.026158 529.998655 l
628.508656 530.078619 l
628.669232 529.994096 l
628.991155 530.146849 l
629.152309 529.989453 l
629.635387 530.10431 l
629.796477 530.000652 l
630.279233 530.062089 l
630.439809 529.977452 l
630.761667 530.086126 l
631.083719 530.016295 l
631.244874 530.138127 l
631.404934 529.984531 l
631.566797 530.156531 l
631.727501 529.979199 l
631.888913 530.094436 l
632.210514 530.048708 l
632.371605 530.109376 l
632.692755 530.029012 l
632.854425 530.163096 l
633.015386 530.002349 l
633.498207 530.130083 l
633.98064 529.991197 l
634.141988 530.183171 l
634.464426 529.974023 l
634.624937 530.114651 l
634.946667 530.087148 l
635.267946 530.017958 l
635.429552 530.193277 l
635.5909 529.930524 l
635.91263 530.09192 l
636.234553 530.023914 l
636.716987 530.147875 l
637.039167 530.030162 l
637.361734 530.059562 l
637.522245 529.97216 l
637.683271 530.131943 l
638.005323 530.095341 l
638.165834 530.024346 l
638.487885 530.035289 l
639.615067 530.074114 l
639.775707 529.991458 l
639.936797 530.125613 l
640.258784 530.051603 l
641.546219 530.050591 l
641.868013 530.121463 l
642.029232 530.001652 l
643.156092 530.127014 l
643.316732 529.953409 l
643.478079 530.109039 l
643.639363 530.007545 l
644.443656 530.1157 l
644.60436 530.011077 l
644.926926 530.063936 l
645.087759 529.978874 l
645.248399 530.116116 l
645.569807 530.007983 l
645.731541 530.178297 l
645.892438 529.960031 l
646.053593 530.084514 l
646.37513 530.070967 l
646.697761 530.055539 l
646.857242 529.997356 l
647.018911 530.185728 l
647.180002 530.011055 l
651.204426 530.065394 l
651.686732 530.066649 l
652.492183 530.08585 l
652.652952 529.98541 l
652.974102 530.064452 l
653.135836 530.103652 l
653.295961 530.022753 l
653.457566 530.127174 l
653.77936 530.023832 l
654.101348 530.081123 l
654.262696 530.003521 l
654.745645 530.162845 l
654.90622 529.933245 l
655.067503 530.085827 l
655.55013 530.026781 l
656.033273 530.115216 l
656.194105 529.969319 l
656.515964 530.097263 l
656.837823 530.057227 l
657.642952 530.094431 l
657.804043 530.005312 l
658.28667 530.053491 l
658.446987 530.026048 l
658.6084 530.149263 l
658.769297 530.000216 l
659.091284 530.05527 l
661.183977 530.107967 l
661.344681 529.997908 l
661.666605 530.057179 l
663.11558 530.059816 l
664.242311 530.072404 l
664.885642 530.050759 l
665.046926 530.126582 l
665.369493 530.031989 l
667.46064 530.049877 l
667.622697 530.110937 l
667.783014 529.963001 l
667.944169 530.099789 l
668.42686 530.02592 l
668.587822 530.103709 l
668.74814 530.034522 l
668.909874 530.135648 l
669.070578 529.972917 l
669.231732 530.098917 l
669.55372 530.059922 l
670.035574 530.016242 l
670.197437 530.185929 l
670.35827 529.994607 l
670.841155 530.094886 l
671.323395 530.005363 l
671.485001 530.171069 l
671.646349 530.001439 l
672.772758 530.110703 l
672.934234 529.975853 l
673.41699 530.073191 l
673.89878 530.053641 l
674.060772 530.139649 l
674.22154 529.976022 l
674.543463 530.049764 l
675.348271 530.149404 l
675.509297 529.981666 l
675.83122 530.044493 l
676.314555 530.072777 l
676.474551 530.014321 l
676.636092 530.148381 l
676.796989 530.00931 l
676.95853 530.066582 l
677.119041 529.985905 l
677.280453 530.129956 l
677.440964 530.000561 l
677.602119 530.10194 l
677.761857 530.037387 l
677.924106 530.179721 l
678.084617 529.947203 l
678.245965 530.077906 l
678.728656 529.989727 l
678.890133 530.126914 l
679.049871 530.011468 l
679.211283 530.176058 l
679.372567 529.996961 l
679.855452 530.067282 l
680.337306 530.05389 l
680.49904 530.123973 l
680.659937 530.003504 l
681.143466 530.07421 l
681.303977 529.996699 l
681.464809 530.117816 l
681.625191 530.043209 l
681.786539 530.140117 l
681.947179 530.01006 l
682.10872 530.082294 l
682.430772 530.059163 l
684.362181 530.148693 l
684.523336 529.989891 l
685.006285 530.125566 l
685.328079 530.067311 l
686.132694 530.027095 l
686.455261 530.036947 l
686.775961 530.104774 l
686.937888 530.131672 l
687.098528 529.976541 l
687.259747 530.097047 l
687.420708 530.022517 l
687.903464 530.089688 l
688.386284 530.005203 l
688.708916 530.030878 l
689.35141 530.040054 l
689.512951 530.156432 l
689.673977 529.997938 l
689.996093 530.035979 l
690.479106 530.068129 l
691.283592 530.090729 l
691.92673 530.059759 l
692.088335 530.13819 l
692.249812 529.98477 l
692.732697 530.080807 l
692.893272 530.017975 l
693.376156 530.132709 l
693.536925 530.009065 l
693.859041 530.032164 l
694.663656 530.133115 l
694.824681 530.012752 l
695.629554 530.090652 l
695.79 530.022033 l
695.951477 530.127748 l
696.112438 529.995505 l
696.273915 530.073931 l
696.434361 530.003737 l
696.595323 530.111727 l
697.077435 530.065048 l
697.238911 530.13814 l
697.561221 530.024317 l
698.204938 530.062796 l
698.365191 530.035788 l
698.527119 530.139605 l
698.68763 529.960898 l
698.848849 530.092022 l
699.33154 530.029148 l
699.81494 530.114014 l
699.975451 529.942206 l
700.136541 530.108026 l
700.458528 530.055818 l
702.389809 530.148278 l
702.550642 529.998278 l
702.872501 530.037786 l
703.356158 530.050835 l
703.515832 530.011324 l
703.677309 530.169038 l
703.999489 530.025838 l
704.643335 530.069479 l
704.803395 530.047052 l
704.965323 530.152323 l
705.126349 529.978273 l
705.60962 530.063722 l
705.770002 529.999493 l
705.930834 530.113833 l
706.574745 530.050264 l
708.827949 530.139917 l
708.988846 530.015496 l
709.150709 530.069414 l
709.310962 529.974113 l
709.472181 530.130938 l
709.79404 530.023417 l
710.115706 530.134046 l
710.276732 530.001358 l
710.759745 530.088781 l
711.081861 530.058425 l
712.529678 530.060645 l
712.691605 530.116924 l
712.852309 529.964547 l
713.013335 530.092106 l
713.335452 530.044956 l
713.97904 530.125736 l
714.139809 530.000675 l
714.462182 530.056957 l
715.105191 530.02209 l
715.266861 530.166936 l
715.42808 529.995876 l
716.071798 530.0497 l
716.392626 530.053615 l
716.554296 530.169742 l
716.715579 529.985675 l
717.198786 530.059302 l
717.359168 530.021236 l
717.520452 530.11219 l
717.680319 530.039504 l
717.84231 530.1486 l
718.003079 529.981866 l
718.325002 530.060816 l
721.543717 530.022956 l
721.705194 530.148518 l
721.86622 530.008105 l
722.349362 530.090657 l
722.671543 530.017742 l
722.993208 530.13659 l
723.154234 530.011563 l
723.637312 530.09747 l
723.798209 530.01189 l
724.281416 530.126436 l
724.44212 529.946665 l
724.60321 530.095606 l
724.925133 530.050693 l
725.56885 530.111495 l
725.72949 530.000269 l
725.890838 530.097316 l
726.21289 530.043811 l
727.017247 530.03283 l
727.982308 530.006773 l
728.144171 530.176431 l
728.305068 529.99183 l
728.787759 530.059345 l
729.431605 530.147009 l
729.592567 529.973683 l
729.914426 530.03581 l
730.397568 530.085635 l
730.557564 530.04107 l
730.719362 530.134156 l
730.880388 529.993281 l
731.524041 530.077085 l
731.845385 530.057036 l
732.006861 530.126154 l
732.167694 529.996067 l
732.650901 530.108017 l
732.972952 530.062273 l
733.132948 530.036804 l
733.294554 530.140678 l
733.455515 530.001948 l
733.938528 530.125359 l
734.260773 530.053581 l
738.283589 530.042256 l
738.445258 530.153215 l
738.606091 529.990697 l
738.767503 530.06934 l
738.928014 530.019509 l
739.089233 530.100065 l
739.571345 529.999478 l
739.732951 530.186117 l
739.894363 529.984341 l
740.537694 530.05059 l
741.020643 530.147931 l
741.181669 529.969106 l
741.664747 530.085963 l
741.825515 530.023352 l
742.308078 530.105793 l
742.630065 530.054193 l
747.458976 530.147619 l
747.619744 529.978386 l
747.780899 530.082595 l
748.263783 530.053233 l
749.712888 530.069276 l
749.872819 530.027634 l
750.034296 530.146325 l
750.195193 530.009431 l
750.678271 530.085235 l
751.160383 530.02029 l
751.322181 530.174669 l
751.483143 529.978349 l
751.965963 530.079229 l
752.931797 530.002742 l
753.254106 530.081978 l
753.414617 530.008782 l
753.735703 530.079344 l
753.897502 530.11381 l
754.058334 529.985807 l
754.380193 530.084186 l
754.702052 530.030733 l
755.023782 530.057779 l
755.507503 530.086885 l
755.66795 529.994315 l
755.82904 530.10102 l
756.311088 530.035167 l
756.472693 530.144656 l
756.633783 530.006316 l
757.27763 530.065063 l
759.048142 530.095875 l
759.370258 530.017236 l
759.692439 530.075273 l
760.1741 530.039448 l
760.335834 530.15186 l
760.496925 529.97872 l
760.818783 530.057541 l
762.267695 530.113382 l
762.428334 530.023637 l
762.911026 530.12238 l
763.072116 530.017668 l
763.716542 530.034628 l
764.037242 530.068121 l
764.198847 530.16041 l
764.359809 529.998552 l
764.842758 530.091632 l
765.324998 530.064574 l
765.486926 530.133568 l
765.647565 529.964038 l
765.808849 530.093906 l
765.96936 530.026382 l
766.130836 530.103455 l
766.291605 530.01348 l
766.774875 530.135786 l
766.935386 529.945385 l
767.096477 530.109278 l
767.418528 530.069938 l
767.900447 530.050082 l
768.062246 530.146365 l
768.223014 529.981763 l
768.384298 530.073964 l
768.706221 530.027313 l
769.028208 530.071895 l
769.188333 530.048112 l
769.349874 530.140755 l
769.5109 530.004794 l
769.993784 530.064475 l
779.652378 530.12503 l
779.812631 529.924619 l
779.973786 530.122781 l
780.29558 530.067291 l
782.065449 530.040413 l
782.227054 530.146462 l
782.388016 529.986245 l
782.709875 530.053316 l
783.514489 530.151646 l
783.675966 529.996616 l
784.802568 530.130856 l
784.963401 529.971377 l
785.285259 530.052703 l
786.090196 530.092533 l
786.412312 530.055204 l
788.504232 530.03746 l
788.66558 530.126412 l
788.826606 530.020863 l
789.309684 530.117808 l
789.631607 530.053362 l
790.597376 530.10823 l
790.919235 530.040222 l
791.241544 530.115108 l
791.402248 529.976891 l
791.563467 530.082956 l
792.046159 530.050287 l
792.529301 530.132935 l
792.690005 529.964447 l
792.851224 530.087886 l
793.173212 530.034692 l
793.495392 530.092176 l
793.655259 530.004619 l
793.816478 530.14789 l
794.138852 530.051279 l
794.942758 530.013925 l
795.104364 530.162117 l
795.265776 529.999229 l
796.392056 530.163829 l
796.553018 529.976874 l
796.875134 530.053787 l
797.518014 530.043652 l
797.67962 530.138654 l
797.840774 530.009963 l
798.645775 530.107864 l
798.806222 530.049446 l
798.967763 530.114044 l
799.128402 530.005032 l
799.450454 530.046702 l
801.060069 530.073277 l
802.025646 530.010551 l
802.1868 530.107184 l
802.508723 530.024141 l
802.830518 530.129448 l
802.991415 529.989326 l
803.313402 530.038124 l
803.79648 530.063876 l
806.53186 530.042287 l
806.69353 530.152136 l
806.854234 529.998818 l
807.015775 530.086734 l
807.17635 530.010257 l
807.337505 530.087055 l
807.659493 530.075628 l
807.819553 530.042879 l
807.981287 530.143727 l
808.142699 529.988807 l
809.268786 530.146663 l
809.430134 529.990326 l
809.913276 530.063077 l
810.394744 530.050371 l
810.556607 530.136718 l
810.717697 529.980316 l
811.20084 530.082421 l
811.36135 530.016331 l
811.522376 530.103612 l
812.005261 530.026218 l
812.488274 530.054266 l
814.257821 530.047367 l
814.419426 530.139504 l
814.580517 530.000372 l
815.063595 530.123163 l
815.385582 530.041304 l
815.707248 530.150276 l
815.868016 529.999953 l
816.029364 530.083467 l
816.190003 530.018492 l
816.351287 530.090858 l
816.673017 530.025126 l
816.995262 530.133711 l
817.155901 529.960699 l
817.31712 530.095364 l
817.638979 530.078138 l
818.121091 530.059848 l
818.282761 530.125223 l
818.443851 529.985809 l
818.765903 530.058623 l
819.408783 530.04793 l
819.570324 530.133667 l
819.731286 529.991175 l
819.892569 530.067459 l
820.214364 530.077077 l
820.696669 529.973669 l
820.858017 530.160053 l
821.019043 530.019198 l
821.662953 530.066947 l
827.134873 530.035605 l
827.296221 530.137472 l
827.457375 530.015484 l
828.10135 530.046369 l
829.87212 530.115458 l
830.032631 529.950286 l
830.193722 530.093768 l
830.676349 530.04897 l
831.159426 530.128028 l
831.320259 529.978883 l
831.642504 530.066259 l
831.964105 530.069334 l
832.446797 530.144126 l
832.607887 530.014675 l
833.251798 530.0532 l
833.573013 530.010744 l
833.734747 530.191324 l
833.896095 529.986538 l
834.700645 530.068363 l
835.827375 530.020526 l
835.988337 530.112575 l
836.148333 530.060157 l
836.310324 530.150198 l
836.471222 529.961097 l
836.793016 530.063783 l
840.011345 530.066332 l
840.173079 530.145871 l
840.334299 529.986291 l
840.977887 530.066446 l
842.586537 530.038464 l
842.748464 530.164742 l
842.909168 529.959703 l
843.23122 530.057856 l
846.449678 530.035519 l
846.611155 530.126925 l
846.772245 530.013698 l
847.416156 530.048326 l
849.18699 530.129686 l
849.34763 529.940133 l
849.508462 530.085548 l
851.60019 530.018291 l
851.761731 530.160857 l
851.922628 530.010153 l
852.40577 530.068635 l
854.175639 530.041797 l
854.337373 530.148199 l
854.659425 529.995437 l
854.820322 530.105025 l
855.142181 530.021808 l
855.303271 530.105918 l
855.463331 530.046739 l
855.625001 530.13417 l
855.785962 529.994367 l
856.269491 530.059076 l
856.429744 530.000256 l
856.590899 530.119552 l
856.751281 530.04611 l
856.912758 530.101679 l
857.073655 530.013492 l
857.556604 530.054356 l
891.518651 530.018837 l
891.680192 530.16552 l
891.841283 530.014058 l
892.485129 530.055487 l
897.313846 530.022649 l
897.475001 530.112878 l
897.796795 530.070927 l
898.601603 530.014405 l
898.762693 530.100051 l
899.084552 530.024669 l
899.406282 530.134729 l
899.567372 530.014056 l
900.211733 530.029045 l
900.532369 530.091744 l
900.694232 530.149023 l
900.855064 529.983028 l
901.176859 530.050547 l
901.982246 530.111949 l
902.142692 529.953695 l
902.303718 530.102735 l
902.786474 530.08116 l
904.39551 530.014831 l
904.556922 530.150757 l
904.879167 530.029301 l
905.361987 530.06656 l
905.683009 530.046684 l
905.844808 530.165046 l
906.006027 529.990621 l
906.489105 530.075632 l
906.64968 530.015338 l
907.132629 530.131102 l
907.293462 529.991833 l
907.615449 530.053944 l
909.386283 530.08117 l
909.868975 530.037073 l
910.67404 530.087966 l
910.834229 530.04365 l
910.99577 530.12544 l
911.318337 530.037334 l
911.961668 530.051468 l
912.605836 530.044189 l
913.24936 530.029289 l
913.571734 530.139009 l
913.732245 529.943445 l
913.893271 530.095647 l
914.53686 530.058888 l
915.342054 530.040235 l
915.663526 530.09409 l
915.98487 530.016634 l
916.146217 530.159167 l
916.307115 530.026742 l
916.951025 530.064409 l
917.434682 530.148247 l
917.595129 529.946761 l
917.756541 530.103482 l
917.917116 530.022112 l
918.078464 530.091498 l
918.238975 530.026607 l
918.400194 530.104621 l
918.56019 530.032007 l
918.722246 530.148441 l
918.88295 529.949367 l
919.044233 530.095363 l
919.204615 530.021078 l
919.365963 530.121105 l
919.526281 530.019947 l
919.688079 530.107618 l
919.84756 529.990184 l
920.009487 530.199961 l
920.170256 529.960056 l
920.492179 530.06602 l
921.13551 530.053228 l
921.29718 530.117416 l
921.458077 529.992843 l
921.780322 530.102441 l
921.940962 529.995237 l
922.26282 530.08692 l
922.423074 530.03731 l
922.584808 530.130489 l
922.745512 529.993367 l
922.906988 530.084898 l
923.067564 530.019899 l
923.389487 530.049426 l
923.872436 530.181087 l
924.194681 529.986755 l
924.516475 530.086568 l
924.998329 530.052762 l
925.160192 530.15963 l
925.321733 529.966817 l
925.804618 530.105975 l
925.965064 529.993026 l
926.126026 530.119615 l
926.28615 530.050492 l
926.447949 530.140675 l
926.608846 529.977981 l
926.93064 530.05567 l
927.09231 530.082652 l
927.252757 529.992884 l
927.413783 530.111277 l
927.574229 530.050531 l
927.735834 530.112906 l
927.896732 529.996418 l
928.218655 530.052964 l
928.701604 530.085098 l
928.862179 530.029402 l
929.023527 530.109319 l
929.184424 530.017889 l
929.346094 530.073507 l
929.506411 529.989094 l
929.667566 530.120342 l
929.989554 530.074431 l
930.149678 530.0448 l
930.311026 530.148629 l
930.472181 530.015288 l
930.955194 530.074912 l
931.277246 530.035038 l
931.599491 530.137724 l
931.759937 529.948229 l
931.921092 530.108428 l
932.403783 530.014364 l
932.886732 530.140424 l
933.04763 529.973577 l
933.208913 530.069566 l
933.530836 530.063412 l
944.476285 530.145133 l
944.637054 529.9675 l
944.959363 530.050955 l
945.441732 530.080562 l
947.051541 530.160173 l
947.212438 529.999724 l
947.37385 530.073518 l
947.534554 530.018737 l
947.856477 530.055328 l
948.339169 530.144682 l
948.500259 529.997165 l
948.983144 530.092549 l
949.465256 530.040134 l
949.627183 530.160095 l
949.78808 529.972364 l
950.110068 530.053067 l
950.914747 530.122443 l
951.075708 529.999171 l
951.397631 530.067749 l
952.685517 530.026319 l
953.168401 530.068149 l
953.32859 530.031543 l
953.489938 530.127292 l
953.812634 530.054506 l
953.97308 530.000636 l
954.134299 530.103908 l
954.456222 530.05341 l
955.583275 530.039778 l
955.743786 530.015162 l
956.065645 530.145666 l
956.226477 529.979972 l
956.548401 530.05146 l
957.353466 530.115605 l
957.514234 529.979029 l
957.675324 530.081543 l
958.319042 530.060686 l
962.341857 530.03579 l
962.503656 530.161545 l
962.664488 529.981574 l
962.98654 530.052365 l
963.791348 530.112333 l
963.952245 530.00735 l
964.435258 530.081112 l
964.595834 530.029783 l
964.757181 530.10768 l
964.91737 530.019368 l
965.078847 530.141461 l
965.23968 530.00632 l
965.401156 530.075233 l
965.561538 530.010213 l
965.723015 530.112488 l
965.884234 530.006766 l
966.366604 530.134263 l
966.527565 530.007443 l
967.010772 530.094379 l
967.332566 530.035275 l
967.654554 530.129999 l
967.815258 529.969823 l
967.976477 530.089486 l
968.459297 530.050456 l
968.942375 530.141387 l
969.103079 529.95362 l
969.264169 530.09432 l
969.746925 530.062089 l
971.355832 529.995348 l
971.517502 530.186303 l
971.67885 529.993265 l
971.839618 530.023531 l
971.839618 530.023531 l
stroke
grestore
0.800 setlinewidth
0 setlinejoin
[] 0 setdash
0.000 setgray
gsave
135 90 m
135 633.6 l
stroke
grestore
gsave
972 90 m
972 633.6 l
stroke
grestore
gsave
135 90 m
972 90 l
stroke
grestore
gsave
135 633.6 m
972 633.6 l
stroke
grestore
1.000 setlinewidth
0 setlinecap
0.800 setgray
gsave
579.1625 507.146875 m
798.8 507.146875 l
800.933333 507.146875 802 508.213542 802 510.346875 c
802 579.2 l
802 581.333333 800.933333 582.4 798.8 582.4 c
579.1625 582.4 l
577.029167 582.4 575.9625 581.333333 575.9625 579.2 c
575.9625 510.346875 l
575.9625 508.213542 577.029167 507.146875 579.1625 507.146875 c
cl
gsave
1.000 setgray
fill
grestore
stroke
grestore
2.000 setlinewidth
1 setlinejoin
2 setlinecap
[] 0 setdash
0.122 0.467 0.706 setrgbcolor
gsave
582.3625 569.44375 m
614.3625 569.44375 l
stroke
grestore
0.000 setgray
gsave
627.162500 563.843750 translate
0.000000 rotate
0.000000 0 m /S glyphshow
10.156250 0 m /p glyphshow
20.312500 0 m /h glyphshow
30.453125 0 m /e glyphshow
40.296875 0 m /r glyphshow
46.500000 0 m /e glyphshow
56.343750 0 m /space glyphshow
61.429688 0 m /a glyphshow
71.234375 0 m /b glyphshow
81.390625 0 m /o glyphshow
91.179688 0 m /u glyphshow
101.320312 0 m /t glyphshow
107.593750 0 m /space glyphshow
112.679688 0 m /Z glyphshow
123.640625 0 m /space glyphshow
128.726562 0 m /a glyphshow
138.531250 0 m /x glyphshow
148.000000 0 m /i glyphshow
152.445312 0 m /s glyphshow
grestore
1.000 0.498 0.055 setrgbcolor
gsave
582.3625 545.959375 m
614.3625 545.959375 l
stroke
grestore
0.000 setgray
gsave
627.162500 540.359375 translate
0.000000 rotate
0.000000 0 m /R glyphshow
10.367188 0 m /e glyphshow
20.210938 0 m /l glyphshow
24.656250 0 m /e glyphshow
34.500000 0 m /a glyphshow
44.304688 0 m /s glyphshow
52.640625 0 m /e glyphshow
62.484375 0 m /space glyphshow
67.570312 0 m /M glyphshow
81.375000 0 m /e glyphshow
91.218750 0 m /c glyphshow
100.015625 0 m /h glyphshow
110.156250 0 m /a glyphshow
119.960938 0 m /n glyphshow
130.101562 0 m /i glyphshow
134.546875 0 m /s glyphshow
142.882812 0 m /m glyphshow
grestore
0.000 0.500 0.000 setrgbcolor
gsave
582.3625 522.475 m
614.3625 522.475 l
stroke
grestore
0.000 setgray
gsave
627.162500 516.875000 translate
0.000000 rotate
0.000000 0 m /C glyphshow
11.171875 0 m /a glyphshow
20.976562 0 m /p glyphshow
31.132812 0 m /s glyphshow
39.468750 0 m /u glyphshow
49.609375 0 m /l glyphshow
54.054688 0 m /e glyphshow
63.898438 0 m /space glyphshow
68.984375 0 m /a glyphshow
78.789062 0 m /b glyphshow
88.945312 0 m /o glyphshow
98.734375 0 m /u glyphshow
108.875000 0 m /t glyphshow
115.148438 0 m /space glyphshow
120.234375 0 m /Z glyphshow
131.195312 0 m /space glyphshow
136.281250 0 m /a glyphshow
146.085938 0 m /x glyphshow
155.554688 0 m /i glyphshow
160.000000 0 m /s glyphshow
grestore

end
showpage
