Time[ms],acc_x,acc_y,acc_z,gyro_x,gyro_y,gyro_z
3,-0.03,0.01,1.0,3.54,1.53,-0.24
46,-0.03,0.01,0.99,3.54,1.65,-0.37
59,-0.03,0.01,0.99,3.48,1.59,-0.31
69,-0.03,0.01,1.0,3.36,1.65,-0.18
79,-0.03,0.01,0.99,3.54,1.59,-0.12
89,-0.03,0.01,1.0,3.54,1.65,-0.24
101,-0.03,0.01,1.0,3.48,1.59,-0.18
111,-0.03,0.01,0.99,3.48,1.65,-0.12
122,-0.03,0.01,0.99,3.54,1.46,-0.24
133,-0.03,0.01,0.99,3.6,1.65,-0.31
165,-0.03,0.01,1.0,3.54,1.53,-0.43
175,-0.03,0.01,0.99,3.42,1.46,-0.18
185,-0.03,0.01,0.99,3.48,1.4,-0.31
196,-0.03,0.01,0.99,3.48,1.4,-0.31
208,-0.03,0.01,0.99,3.48,1.4,-0.18
220,-0.03,0.01,0.99,3.54,1.65,-0.31
230,-0.03,0.01,1.0,3.54,1.71,-0.31
242,-0.03,0.01,0.99,3.66,1.4,-0.37
254,-0.03,0.01,0.99,3.6,1.46,-0.18
265,-0.03,0.01,1.0,3.42,1.46,-0.24
281,-0.03,0.01,0.99,3.42,1.59,-0.43
292,-0.03,0.01,0.99,3.42,1.53,-0.31
303,-0.03,0.01,0.99,3.66,1.4,-0.31
313,-0.03,0.01,1.0,3.48,1.46,-0.31
323,-0.03,0.01,0.99,3.48,1.53,-0.18
334,-0.03,0.01,0.99,3.54,1.46,-0.37
344,-0.03,0.01,0.99,3.36,1.46,-0.31
354,-0.03,0.01,0.99,3.6,1.46,-0.24
364,-0.03,0.01,0.99,3.54,1.46,-0.43
376,-0.03,0.01,1.0,3.66,1.34,-0.31
390,-0.03,0.01,0.99,3.54,1.34,-0.43
401,-0.03,0.01,1.0,3.42,1.46,-0.24
411,-0.03,0.01,1.0,3.42,1.4,-0.37
422,-0.03,0.01,1.0,3.54,1.59,-0.24
432,-0.03,0.01,0.99,3.54,1.65,-0.31
442,-0.03,0.01,1.0,3.6,1.59,-0.12
453,-0.03,0.01,0.99,3.54,1.59,-0.18
464,-0.03,0.01,1.0,3.42,1.46,-0.31
476,-0.03,0.01,1.0,3.42,1.53,-0.24
486,-0.03,0.01,0.99,3.48,1.71,-0.18
506,-0.03,0.01,0.99,3.42,1.65,-0.43
518,-0.03,0.01,0.99,3.42,1.59,-0.31
528,-0.03,0.01,0.99,3.42,1.65,-0.24
539,-0.03,0.01,0.99,3.54,1.46,-0.31
550,-0.03,0.01,0.99,3.54,1.4,-0.31
563,-0.03,0.01,0.99,3.42,1.65,-0.37
574,-0.03,0.01,1.0,3.6,1.59,-0.43
585,-0.03,0.01,0.99,3.78,1.65,-0.24
595,-0.03,0.01,0.99,3.66,1.59,-0.31
605,-0.03,0.01,1.0,3.42,1.53,-0.31
616,-0.03,0.01,0.99,3.42,1.65,-0.24
633,-0.03,0.01,0.99,3.6,1.53,-0.31
643,-0.03,0.01,0.99,3.6,1.53,-0.31
657,-0.03,0.01,1.0,3.78,1.53,-0.31
667,-0.03,0.01,0.99,3.54,1.46,-0.31
677,-0.03,0.01,0.99,3.54,1.4,-0.12
690,-0.03,0.01,1.0,3.6,1.46,-0.24
700,-0.03,0.01,0.99,3.66,1.59,-0.18
711,-0.03,0.01,1.0,3.48,1.53,-0.18
724,-0.03,0.01,0.99,3.54,1.4,-0.37
734,-0.03,0.01,0.99,3.54,1.4,-0.31
751,-0.03,0.01,0.99,3.48,1.53,-0.24
761,-0.03,0.01,1.0,3.48,1.53,-0.24
771,-0.03,0.01,0.99,3.54,1.65,-0.12
782,-0.03,0.01,0.99,3.6,1.46,-0.31
795,-0.03,0.01,0.99,3.42,1.46,-0.31
805,-0.03,0.01,0.99,3.42,1.59,-0.31
816,-0.03,0.01,1.0,3.54,1.59,-0.31
827,-0.03,0.01,0.99,3.66,1.71,-0.18
837,-0.03,0.01,1.0,3.48,1.71,-0.24
847,-0.03,0.01,0.99,3.48,1.46,-0.31
865,-0.03,0.01,1.0,3.54,1.4,-0.37
876,-0.03,0.01,0.99,3.54,1.59,-0.24
886,-0.03,0.01,0.99,3.48,1.65,-0.18
896,-0.03,0.01,0.99,3.36,1.53,-0.24
907,-0.03,0.01,1.0,3.54,1.71,-0.31
921,-0.03,0.01,1.0,3.48,1.53,-0.12
931,-0.03,0.01,0.99,3.6,1.59,-0.37
942,-0.03,0.01,0.99,3.48,1.53,-0.24
952,-0.03,0.01,1.0,3.48,1.53,-0.31
962,-0.03,0.01,0.99,3.42,1.53,-0.31
977,-0.03,0.01,1.0,3.48,1.4,-0.37
988,-0.03,0.01,0.99,3.48,1.28,-0.31
999,-0.03,0.01,0.99,3.6,1.59,-0.18
1010,-0.03,0.01,1.0,3.54,1.53,-0.37
1022,-0.03,0.01,0.99,3.54,1.59,-0.24
1032,-0.03,0.01,1.0,3.6,1.59,-0.24
1042,-0.03,0.01,0.99,3.66,1.65,-0.31
1052,-0.03,0.01,0.99,3.66,1.71,-0.18
1063,-0.03,0.01,0.99,3.6,1.59,-0.12
1074,-0.03,0.01,0.99,3.54,1.53,-0.18
1090,-0.03,0.01,0.99,3.6,1.59,-0.24
1103,-0.03,0.01,1.0,3.48,1.4,-0.18
1116,-0.03,0.01,1.0,3.6,1.4,-0.37
1126,-0.03,0.01,0.99,3.66,1.53,-0.43
1136,-0.03,0.01,0.99,3.6,1.53,-0.24
1146,-0.03,0.01,1.0,3.48,1.59,-0.24
1156,-0.03,0.01,0.99,3.6,1.53,-0.37
1167,-0.03,0.01,0.99,3.54,1.46,-0.31
1177,-0.03,0.01,1.0,3.42,1.53,-0.31
1188,-0.03,0.01,0.99,3.54,1.59,-0.31
1203,-0.03,0.01,0.99,3.48,1.65,-0.24
1215,-0.03,0.01,0.99,3.48,1.46,-0.24
1226,-0.03,0.01,1.0,3.54,1.59,-0.18
1237,-0.03,0.01,0.99,3.6,1.59,-0.31
1248,-0.03,0.01,1.0,3.48,1.59,-0.31
1260,-0.03,0.01,1.0,3.72,1.71,-0.24
1272,-0.03,0.01,0.99,3.48,1.46,-0.24
1284,-0.03,0.01,0.99,3.6,1.46,-0.31
1294,-0.03,0.01,0.99,3.54,1.65,-0.18
1305,-0.03,0.01,0.99,3.48,1.53,-0.31
1319,-0.03,0.01,0.99,3.54,1.46,-0.24
1330,-0.03,0.01,0.99,3.6,1.71,-0.24
1341,-0.03,0.01,0.99,3.48,1.59,-0.24
1351,-0.03,0.01,0.99,3.6,1.65,-0.37
1363,-0.03,0.01,1.0,3.72,1.59,-0.24
1374,-0.03,0.01,1.0,3.54,1.65,-0.24
1384,-0.03,0.01,0.99,3.6,1.65,-0.18
1395,-0.03,0.01,0.99,3.6,1.53,-0.43
1405,-0.03,0.01,0.99,3.54,1.59,-0.31
1416,-0.03,0.01,0.99,3.42,1.59,-0.37
1431,-0.03,0.01,0.99,3.72,1.59,-0.24
1441,-0.03,0.01,1.0,3.54,1.65,-0.24
1451,-0.03,0.01,0.99,3.6,1.59,-0.31
1461,-0.03,0.01,0.99,3.54,1.46,-0.37
1473,-0.03,0.01,1.0,3.36,1.46,-0.24
1483,-0.03,0.01,0.99,3.48,1.53,-0.49
1494,-0.03,0.01,0.99,3.48,1.59,-0.37
1507,-0.03,0.01,0.99,3.54,1.4,-0.18
1517,-0.03,0.01,0.99,3.54,1.4,-0.31
1527,-0.03,0.01,1.0,3.42,1.46,-0.24
1542,-0.03,0.01,0.99,3.6,1.4,-0.31
1553,-0.03,0.01,0.99,3.54,1.4,-0.12
1564,-0.03,0.01,0.99,3.6,1.53,-0.31
1575,-0.03,0.01,0.99,3.66,1.46,-0.31
1586,-0.03,0.01,1.0,3.66,1.59,-0.24
1596,-0.03,0.01,0.99,3.54,1.59,-0.12
1606,-0.03,0.01,0.99,3.6,1.65,-0.18
1616,-0.03,0.01,1.0,3.6,1.53,-0.24
1626,-0.03,0.01,0.99,3.6,1.46,-0.06
1636,-0.03,0.01,1.0,3.48,1.53,-0.18
1651,-0.03,0.01,1.0,3.54,1.53,-0.31
1662,-0.03,0.01,0.99,3.6,1.46,-0.31
1672,-0.03,0.01,1.0,3.6,1.53,-0.37
1683,-0.03,0.01,1.0,3.42,1.53,-0.24
1693,-0.03,0.01,0.99,3.6,1.46,-0.24
1703,-0.03,0.01,0.99,3.6,1.53,-0.31
1713,-0.03,0.01,0.99,3.6,1.65,-0.31
1723,-0.03,0.01,1.0,3.6,1.59,-0.43
1733,-0.03,0.01,0.99,3.48,1.59,-0.18
1746,-0.03,0.01,1.0,3.6,1.65,-0.37
1761,-0.03,0.01,0.99,3.48,1.53,-0.31
1773,-0.03,0.01,1.0,3.48,1.59,-0.18
1783,-0.03,0.01,1.0,3.3,1.65,-0.18
1795,-0.03,0.01,1.0,3.54,1.46,-0.37
1805,-0.03,0.01,0.99,3.66,1.46,-0.31
1816,-0.03,0.01,1.0,3.48,1.53,-0.24
1826,-0.03,0.01,0.99,3.54,1.46,-0.24
1836,-0.03,0.01,0.99,3.54,1.53,-0.31
1846,-0.03,0.01,1.0,3.54,1.65,-0.37
1858,-0.03,0.01,0.99,3.6,1.53,-0.31
1873,-0.03,0.01,0.99,3.42,1.34,-0.31
1883,-0.03,0.01,1.0,3.48,1.46,-0.31
1894,-0.03,0.01,0.99,3.54,1.46,-0.24
1905,-0.03,0.01,0.99,3.66,1.53,-0.31
1917,-0.03,0.01,1.0,3.6,1.59,-0.31
1927,-0.03,0.01,0.99,3.42,1.46,-0.31
1938,-0.03,0.01,0.99,3.6,1.59,-0.24
1950,-0.03,0.01,0.99,3.54,1.53,-0.31
1961,-0.03,0.01,0.99,3.54,1.59,-0.37
1971,-0.03,0.01,0.99,3.66,1.46,-0.24
1986,-0.03,0.01,0.99,3.48,1.59,-0.31
1997,-0.03,0.01,1.0,3.48,1.4,-0.37
2010,-0.03,0.01,0.99,3.48,1.53,-0.12
2021,-0.03,0.01,0.99,3.6,1.53,0.85
2032,-0.03,0.01,0.99,3.42,1.83,8.3
2042,-0.03,0.01,1.0,3.42,1.89,12.7
2054,-0.03,0.01,0.99,3.3,1.95,16.72
2064,-0.03,0.01,1.0,3.17,1.95,20.69
2074,-0.03,0.01,1.0,2.93,2.14,27.65
2086,-0.03,0.01,0.99,3.23,2.38,31.31
2101,-0.03,0.01,0.99,3.17,2.38,38.7
2114,-0.03,0.01,1.0,2.99,2.44,43.09
2124,-0.03,0.01,0.99,2.93,2.44,45.72
2134,-0.03,0.01,0.99,2.81,2.56,49.01
2144,-0.03,0.01,0.99,2.75,2.75,52.12
2154,-0.03,0.01,0.99,2.93,2.87,56.46
2166,-0.03,0.01,0.99,2.87,2.99,60.24
2176,-0.03,0.01,1.0,2.62,2.75,67.38
2188,-0.03,0.01,1.0,2.44,2.87,70.8
2198,-0.03,0.01,0.99,2.5,2.99,74.16
2213,-0.03,0.01,0.99,2.62,3.36,80.75
2224,-0.03,0.01,1.0,2.62,3.42,83.62
2234,-0.03,0.01,0.99,2.26,3.48,87.1
2245,-0.03,0.01,0.99,2.2,3.48,93.99
2256,-0.03,0.01,1.0,2.2,3.36,97.72
2267,-0.03,0.01,0.99,2.14,3.66,100.22
2277,-0.03,0.01,0.99,2.26,3.78,103.09
2287,-0.03,0.01,0.99,2.01,4.03,109.62
2299,-0.03,0.01,0.99,2.01,4.03,112.79
2309,-0.03,0.01,1.0,2.08,4.03,115.36
2324,-0.03,0.01,0.99,1.83,4.03,122.38
2336,-0.03,0.01,0.99,1.95,4.15,126.04
2347,-0.03,0.01,0.99,1.83,4.52,132.08
2357,-0.03,0.01,1.0,1.77,4.52,136.66
2367,-0.03,0.01,0.99,1.77,4.58,139.89
2377,-0.03,0.01,0.99,1.53,4.7,142.82
2388,-0.03,0.01,1.0,1.53,4.82,150.02
2398,-0.03,0.01,0.99,1.65,4.94,151.49
2408,-0.03,0.01,0.99,1.65,5.13,155.33
2420,-0.03,0.01,1.0,1.4,5.07,158.81
2434,-0.03,0.01,1.0,1.28,5.13,165.41
2446,-0.03,0.01,0.99,1.34,5.13,167.79
2457,-0.03,0.01,1.0,1.34,5.49,175.35
2470,-0.03,0.01,0.99,1.16,5.55,178.41
2481,-0.03,0.01,0.99,1.16,5.49,182.98
2491,-0.03,0.02,0.99,1.04,5.68,189.64
2502,-0.03,0.01,0.99,1.16,5.8,192.87
2512,-0.03,0.01,0.99,1.16,5.98,195.62
2523,-0.03,0.01,1.0,1.04,6.1,197.02
2545,-0.04,0.01,0.99,0.67,6.04,205.69
2557,-0.03,0.01,0.99,0.92,6.29,209.9
2567,-0.03,0.01,0.99,0.73,6.47,214.9
2577,-0.04,0.01,1.0,0.79,6.53,222.9
2589,-0.03,0.01,0.99,0.73,6.65,225.22
2600,-0.03,0.01,1.0,0.73,6.65,227.48
2612,-0.03,0.02,1.0,0.61,6.65,232.73
2623,-0.03,0.01,0.99,0.55,6.77,236.15
2633,-0.04,0.01,1.0,0.55,6.84,239.07
2644,-0.03,0.01,0.99,0.43,7.02,243.35
2658,-0.03,0.02,0.99,0.55,7.39,254.15
2668,-0.03,0.01,1.0,0.55,7.39,254.15
2678,-0.03,0.01,0.99,0.49,7.2,256.47
2691,-0.03,0.01,0.99,0.24,7.32,261.6
2701,-0.03,0.02,0.99,0.24,7.45,264.59
2711,-0.03,0.01,0.99,0.24,7.63,266.66
2721,-0.03,0.01,1.0,0.0,7.39,274.54
2733,-0.03,0.01,1.0,-0.06,7.57,279.48
2744,-0.04,0.02,0.99,-0.18,7.57,283.39
2755,-0.03,0.01,0.99,-0.18,8.06,288.94
2771,-0.03,0.01,0.99,-0.24,8.12,293.95
2782,-0.03,0.01,0.99,-0.31,8.18,296.94
2792,-0.04,0.02,1.0,-0.49,8.18,301.21
2803,-0.04,0.02,0.99,-0.43,8.24,306.09
2813,-0.04,0.02,0.99,-0.49,8.42,310.85
2823,-0.03,0.01,0.99,-0.24,8.79,312.62
2837,-0.03,0.01,0.99,-0.37,8.73,315.8
2847,-0.04,0.02,1.0,-0.85,8.67,319.95
2857,-0.04,0.02,0.99,-0.67,9.09,328.92
2879,-0.03,0.01,0.99,-0.73,9.22,334.96
2889,-0.03,0.02,0.99,-0.67,9.09,336.3
2899,-0.03,0.02,1.0,-0.85,8.97,342.35
2910,-0.04,0.02,1.0,-0.85,9.28,346.13
2923,-0.03,0.02,0.99,-0.98,9.4,349.49
2933,-0.03,0.02,1.0,-1.1,9.7,352.11
2943,-0.03,0.01,1.0,-1.22,9.46,357.73
2955,-0.03,0.02,0.99,-1.28,9.64,360.29
2965,-0.03,0.02,1.0,-1.46,9.58,363.16
2976,-0.03,0.02,0.99,-1.28,9.83,371.95
2993,-0.0,0.02,0.99,-1.53,10.07,380.49
3006,-0.03,0.02,0.99,-1.4,10.07,383.73
3016,-0.03,0.02,0.99,-1.46,10.07,387.08
3026,-0.03,0.02,1.0,-1.65,10.19,390.81
3036,-0.03,0.02,0.99,-1.65,10.5,394.71
3046,-0.03,0.02,0.99,-1.65,10.38,398.62
3057,-0.03,0.02,1.0,-1.59,10.31,403.5
3068,-0.03,0.02,0.99,-1.95,10.56,408.39
3078,-0.03,0.02,0.99,-2.01,10.86,411.5
3094,-0.03,0.02,1.0,-1.71,10.74,415.04
3105,-0.03,0.02,1.0,-1.65,10.62,420.23
3116,-0.03,0.02,0.99,-1.65,10.74,424.5
3127,-0.03,0.02,1.0,-1.89,11.11,427.12
3137,-0.03,0.03,0.99,-2.2,11.23,429.99
3147,-0.03,0.03,0.99,-2.01,11.35,439.09
3160,-0.03,0.02,0.99,-2.08,11.54,443.79
3172,-0.03,0.02,0.99,-2.2,11.6,446.17
3183,-0.02,0.03,0.99,-2.56,11.6,450.01
3193,-0.03,0.03,0.99,-2.56,11.47,454.47
3208,-0.03,0.02,0.99,-2.5,11.6,460.33
3219,-0.03,0.03,0.99,-2.81,11.78,461.73
3229,-0.03,0.03,0.99,-2.81,11.84,464.9
3240,-0.03,0.03,0.99,-2.75,11.78,468.75
3250,-0.03,0.03,1.0,-2.93,11.96,478.94
3262,-0.03,0.03,0.99,-2.87,12.21,480.29
3272,-0.03,0.03,1.0,-2.87,12.51,482.18
3282,-0.03,0.03,0.99,-2.99,12.33,486.15
3293,-0.03,0.02,0.99,-2.87,12.63,490.48
3310,-0.03,0.03,0.99,-3.05,12.57,498.17
3322,-0.03,0.03,1.0,-3.17,12.76,502.93
3332,-0.03,0.03,0.99,-3.11,13.06,506.65
3342,-0.02,0.03,1.0,-3.17,13.31,508.85
3353,-0.03,0.03,0.99,-3.36,12.76,514.1
3364,-0.03,0.03,1.0,-3.23,12.94,517.33
3375,-0.03,0.04,0.99,-3.23,13.31,519.59
3385,-0.03,0.04,1.0,-3.36,13.37,528.56
3397,-0.03,0.04,0.99,-3.48,13.49,532.9
3407,-0.03,0.03,0.99,-3.42,13.55,534.42
3423,-0.03,0.04,0.99,-3.48,13.49,538.57
3433,-0.04,0.04,1.0,-3.48,13.49,544.37
3443,-0.03,0.04,0.99,-3.6,13.92,548.71
3453,-0.03,0.03,1.0,-3.85,14.04,553.77
3463,-0.03,0.04,0.99,-3.85,13.85,557.25
3473,-0.03,0.04,0.99,-3.78,13.92,560.24
3484,-0.03,0.03,0.99,-3.66,14.1,561.65
3494,-0.03,0.04,0.99,-4.03,14.22,565.19
3505,-0.04,0.04,1.0,-4.03,14.53,576.23
3523,-0.03,0.03,0.99,-3.85,14.71,580.63
3535,-0.04,0.04,0.99,-4.33,14.47,585.45
3545,-0.04,0.04,0.99,-4.33,14.65,589.66
3555,-0.03,0.04,1.0,-4.03,14.83,593.38
3568,-0.03,0.04,1.0,-4.33,14.77,597.17
3578,-0.03,0.04,0.99,-4.27,14.89,599.49
3588,-0.03,0.04,1.0,-4.09,14.95,601.62
3599,-0.03,0.04,0.99,-4.46,15.2,611.94
3611,-0.03,0.04,1.0,-4.46,15.44,612.37
3627,-0.03,0.04,1.0,-4.21,15.5,619.14
3637,-0.03,0.04,0.99,-4.39,15.38,622.19
3648,-0.03,0.04,1.0,-4.52,15.62,623.47
3658,-0.03,0.04,0.99,-4.64,15.44,629.94
3671,-0.03,0.04,0.99,-4.58,15.69,632.51
3681,-0.03,0.05,0.99,-4.7,15.69,636.6
3691,-0.03,0.05,1.0,-4.88,15.69,642.82
3704,-0.02,0.04,0.99,-4.7,16.3,649.05
3714,-0.02,0.04,0.99,-4.33,16.54,651.37
3725,-0.02,0.04,0.99,-4.64,16.24,653.93
3741,-0.03,0.05,0.99,-5.37,15.81,665.95
3751,-0.04,0.05,0.99,-5.37,16.54,667.79
3764,-0.02,0.05,0.99,-5.37,16.91,668.46
3774,-0.02,0.05,0.99,-5.13,16.48,672.73
3784,-0.03,0.05,0.99,-5.25,16.3,677.37
3794,-0.03,0.05,0.99,-5.55,16.36,682.07
3805,-0.03,0.05,0.99,-5.68,16.54,688.11
3817,-0.03,0.05,0.99,-5.74,17.03,691.65
3827,-0.02,0.06,1.0,-5.74,17.4,694.76
3843,-0.03,0.06,1.0,-5.49,17.46,703.31
3854,-0.02,0.05,0.99,-5.86,17.4,706.05
3866,-0.03,0.05,0.99,-5.8,17.09,710.33
3876,-0.03,0.06,0.99,-5.86,17.21,713.44
3887,-0.03,0.06,0.99,-5.74,17.58,716.61
3900,-0.02,0.05,0.99,-5.86,17.7,721.5
3911,-0.03,0.06,0.99,-5.86,17.7,724.61
3922,-0.03,0.06,0.99,-6.04,17.58,727.54
3934,-0.03,0.06,0.99,-6.04,17.58,731.2
3944,-0.03,0.06,1.0,-6.35,17.82,736.94
3961,-0.03,0.07,0.99,-6.41,18.31,747.25
3971,-0.03,0.06,0.99,-6.04,18.62,750.31
3983,-0.03,0.06,0.99,-6.59,18.25,755.19
3994,-0.03,0.06,0.99,-6.65,18.31,759.03
4004,-0.03,0.06,0.99,-6.41,18.55,759.34
4014,-0.03,0.06,0.99,-6.35,18.86,759.28
4024,-0.02,0.06,1.0,-6.41,18.43,758.85
4037,-0.03,0.06,1.0,-6.59,18.25,760.56
4048,-0.03,0.06,0.99,-6.59,18.37,761.54
4063,-0.03,0.06,0.99,-6.77,18.55,765.08
4073,-0.03,0.06,1.0,-6.53,18.55,765.62
4084,-0.03,0.06,0.99,-5.98,19.47,762.15
4094,-0.02,0.06,0.99,-6.16,19.17,760.74
4106,-0.02,0.06,0.99,-6.35,18.8,759.7
4116,-0.02,0.06,1.0,-6.16,18.43,760.38
4126,-0.03,0.06,0.99,-5.86,18.19,758.3
4137,-0.03,0.05,1.0,-5.55,18.55,757.08
4147,-0.02,0.05,0.99,-5.62,18.55,757.2
4164,-0.02,0.06,1.0,-6.35,18.49,758.0
4175,-0.02,0.06,0.99,-6.29,18.07,758.24
4185,-0.02,0.06,1.0,-6.41,18.07,759.58
4195,-0.03,0.05,1.0,-6.16,17.88,760.93
4206,-0.03,0.06,1.0,-6.41,18.25,760.56
4217,-0.03,0.06,1.0,-6.65,18.37,761.29
4227,-0.03,0.06,0.98,-6.29,18.43,760.5
4237,-0.02,0.07,1.0,-6.23,18.62,759.4
4251,-0.02,0.06,0.99,-6.16,18.37,758.61
4262,-0.02,0.06,0.99,-6.41,18.07,758.06
4278,-0.03,0.06,0.99,-6.35,18.31,759.22
4290,-0.03,0.06,0.99,-6.35,18.31,762.15
4302,-0.03,0.06,1.0,-6.35,18.37,763.79
4312,-0.03,0.06,0.99,-6.47,18.55,763.18
4322,-0.03,0.06,1.0,-6.16,18.62,759.22
4333,-0.03,0.06,0.99,-6.04,18.74,757.2
4343,-0.02,0.06,0.99,-6.1,18.74,757.14
4354,-0.02,0.06,1.0,-6.16,18.31,758.12
4365,-0.03,0.06,0.99,-6.23,18.01,757.63
4383,-0.03,0.06,0.99,-6.53,18.43,759.58
4394,-0.03,0.06,1.0,-6.47,18.62,760.44
4405,-0.03,0.06,0.99,-6.35,18.62,760.25
4416,-0.03,0.06,1.0,-6.29,18.62,761.23
4431,-0.03,0.06,1.0,-6.16,18.31,759.64
4441,-0.03,0.06,0.99,-6.04,18.43,757.93
4452,-0.03,0.06,0.99,-6.29,18.37,756.16
4464,-0.03,0.06,1.0,-6.29,18.25,757.69
4474,-0.03,0.06,0.99,-6.23,18.25,758.54
4484,-0.02,0.06,0.99,-6.23,18.43,761.6
4502,-0.03,0.06,0.99,-6.16,18.25,761.6
4515,-0.02,0.06,0.99,-6.16,18.55,761.17
4525,-0.03,0.06,1.0,-6.1,18.62,761.05
4535,-0.02,0.06,0.99,-6.04,18.49,759.58
4547,-0.03,0.06,1.0,-5.68,18.43,759.52
4557,-0.02,0.05,0.99,-5.62,18.37,758.91
4567,-0.02,0.05,0.99,-5.92,18.43,759.52
4577,-0.02,0.06,0.99,-6.35,18.55,760.31
4589,-0.02,0.06,1.0,-6.23,18.37,759.16
4605,-0.02,0.06,1.0,-6.29,18.31,758.79
4615,-0.02,0.06,1.0,-6.29,18.25,760.38
4626,-0.03,0.06,0.99,-6.35,18.19,760.38
4637,-0.03,0.06,0.99,-6.23,18.31,759.03
4651,-0.03,0.06,0.99,-6.04,18.62,758.48
4661,-0.02,0.06,1.0,-6.29,18.68,758.61
4671,-0.02,0.06,0.98,-6.59,18.43,759.28
4684,-0.02,0.06,0.99,-5.92,18.31,758.24
4694,-0.03,0.06,0.99,-5.92,18.31,759.7
4707,-0.03,0.06,1.0,-6.29,18.31,760.13
4718,-0.03,0.06,0.99,-6.41,18.49,760.38
4728,-0.03,0.06,0.99,-6.29,18.55,760.31
4739,-0.02,0.06,0.99,-6.16,18.37,758.67
4750,-0.03,0.06,1.0,-6.04,18.37,758.12
4762,-0.03,0.06,0.99,-6.16,18.43,758.61
4772,-0.03,0.06,0.99,-6.35,18.49,760.56
4782,-0.03,0.06,1.0,-6.41,18.49,759.89
4796,-0.03,0.06,0.99,-6.23,18.49,760.01
4806,-0.03,0.06,1.0,-6.16,18.55,759.95
4821,-0.03,0.06,1.0,-6.23,18.49,760.01
4831,-0.03,0.06,0.99,-6.1,18.37,758.73
4842,-0.03,0.06,0.99,-6.29,18.49,759.95
4852,-0.03,0.06,0.99,-6.23,18.43,760.5
4864,-0.02,0.06,0.99,-6.41,18.55,760.86
4875,-0.03,0.06,1.0,-6.41,18.37,760.01
4886,-0.03,0.06,0.99,-6.53,18.43,761.11
4897,-0.03,0.06,0.99,-6.41,18.13,760.31
4908,-0.03,0.06,0.99,-6.04,18.43,758.24
4922,-0.02,0.06,1.0,-5.98,18.68,756.47
4933,-0.02,0.06,0.99,-6.16,18.55,755.31
4943,-0.02,0.06,0.99,-5.92,18.49,755.92
4955,-0.03,0.06,0.99,-5.8,18.07,760.74
4965,-0.03,0.05,0.99,-5.74,18.19,763.67
4976,-0.03,0.05,0.99,-5.92,18.49,763.79
4987,-0.02,0.06,0.99,-6.53,18.98,760.74
4999,-0.02,0.07,1.0,-6.65,18.62,760.38
5010,-0.02,0.06,0.99,-6.29,18.19,759.89
5032,-0.03,0.05,0.99,-6.1,18.07,759.28
5043,-0.03,0.06,1.0,-6.41,18.13,760.01
5054,-0.03,0.06,0.99,-6.71,18.19,759.46
5064,-0.02,0.07,1.0,-6.35,18.74,759.34
5074,-0.02,0.06,0.98,-6.04,18.8,759.77
5085,-0.02,0.06,1.0,-5.86,18.68,760.01
5095,-0.02,0.06,1.0,-5.92,18.43,760.68
5105,-0.02,0.06,0.98,-6.1,18.07,759.95
5117,-0.03,0.06,0.99,-6.35,18.01,760.01
5127,-0.03,0.06,0.99,-6.47,18.25,759.46
5144,-0.03,0.06,0.99,-6.23,18.43,758.61
5154,-0.03,0.06,0.99,-6.16,18.62,757.75
5164,-0.02,0.06,1.0,-6.1,18.62,756.84
5174,-0.03,0.06,0.99,-6.04,18.13,757.75
5184,-0.03,0.06,0.99,-6.16,18.13,759.03
5195,-0.03,0.06,1.0,-6.35,18.25,761.41
5205,-0.03,0.06,1.0,-6.29,18.19,761.84
5216,-0.03,0.06,0.99,-6.29,18.19,761.23
5229,-0.03,0.06,0.99,-6.29,18.62,759.64
5244,-0.03,0.06,1.0,-6.1,18.49,758.18
5254,-0.03,0.06,0.99,-6.16,18.37,757.51
5264,-0.03,0.06,0.99,-6.16,18.37,756.65
5274,-0.03,0.06,1.0,-6.16,18.31,757.69
5285,-0.02,0.06,0.98,-6.23,18.43,760.86
5297,-0.03,0.06,1.0,-6.29,18.19,762.57
5307,-0.03,0.06,0.99,-6.16,18.07,762.76
5318,-0.03,0.06,0.99,-6.23,18.25,762.94
5332,-0.03,0.06,1.0,-6.35,18.55,759.95
5343,-0.02,0.06,0.99,-6.16,19.04,758.36
5359,-0.02,0.06,0.99,-5.8,18.49,757.45
5369,-0.02,0.05,1.0,-5.49,18.01,758.91
5383,-0.03,0.05,0.99,-5.86,18.13,758.91
5393,-0.02,0.05,0.99,-6.04,18.25,759.89
5403,-0.02,0.05,0.99,-6.41,18.25,760.31
5415,-0.02,0.07,0.99,-6.65,18.37,760.13
5425,-0.02,0.06,1.0,-5.98,18.19,760.38
5437,-0.02,0.06,0.99,-5.8,18.31,759.64
5449,-0.03,0.06,0.99,-6.29,18.01,759.46
5467,-0.03,0.06,1.0,-6.41,18.31,758.3
5478,-0.03,0.06,0.99,-6.29,18.37,759.22
5488,-0.02,0.06,0.99,-6.35,18.43,759.09
5498,-0.02,0.06,0.98,-6.23,18.43,759.7
5508,-0.02,0.06,1.0,-6.41,18.37,760.86
5521,-0.02,0.06,0.99,-6.29,18.43,761.84
5531,-0.03,0.06,0.99,-6.23,18.19,762.21
5542,-0.03,0.06,1.0,-6.23,18.37,759.89
5553,-0.03,0.06,0.98,-6.16,18.37,758.67
5568,-0.03,0.06,1.0,-6.16,18.68,756.23
5580,-0.02,0.06,0.99,-6.1,18.49,757.32
5590,-0.03,0.06,1.0,-6.1,18.31,756.96
5600,-0.03,0.06,1.0,-6.04,18.07,758.91
5613,-0.03,0.06,0.99,-6.29,18.07,759.34
5623,-0.03,0.06,0.99,-6.41,18.31,760.62
5634,-0.03,0.06,0.99,-6.23,18.43,760.38
5644,-0.03,0.06,0.99,-6.1,18.62,760.56
5655,-0.02,0.06,1.0,-6.1,18.43,760.8
5666,-0.02,0.06,0.99,-5.92,18.43,759.64
5681,-0.03,0.06,1.0,-6.23,18.13,758.42
5691,-0.03,0.06,0.99,-6.23,18.19,758.24
5702,-0.03,0.06,0.99,-6.1,18.49,758.91
5716,-0.02,0.06,0.99,-6.16,18.68,759.89
5726,-0.02,0.06,1.0,-6.1,18.37,760.8
5736,-0.02,0.06,1.0,-6.1,18.19,761.41
5748,-0.03,0.06,0.99,-6.16,18.25,760.5
5758,-0.03,0.06,1.0,-6.23,18.43,758.73
5768,-0.02,0.06,0.99,-5.92,18.8,758.61
5784,-0.02,0.06,1.0,-5.98,18.62,759.4
5794,-0.02,0.05,0.99,-5.68,18.62,759.28
5804,-0.02,0.05,1.0,-5.74,18.19,759.95
5816,-0.02,0.06,0.99,-6.29,18.25,760.07
5828,-0.03,0.06,0.99,-6.29,17.82,759.58
5839,-0.02,0.06,0.99,-6.1,18.31,758.24
5849,-0.02,0.06,1.0,-5.98,18.31,758.42
5861,-0.02,0.06,0.99,-6.23,18.31,759.22
5871,-0.02,0.06,0.99,-6.23,18.49,759.83
5881,-0.03,0.06,0.99,-6.41,18.43,760.01
5899,-0.02,0.06,1.0,-6.16,18.49,759.58
5912,-0.03,0.06,0.99,-6.04,18.55,758.73
5922,-0.02,0.06,1.0,-6.16,18.49,758.54
5933,-0.02,0.06,0.99,-6.35,18.25,759.16
5944,-0.03,0.06,0.99,-6.1,18.07,759.16
5955,-0.03,0.06,0.99,-5.98,18.01,758.97
5965,-0.03,0.06,0.99,-6.1,18.19,758.61
5975,-0.03,0.06,0.99,-6.23,18.19,760.25
5985,-0.03,0.06,1.0,-6.29,18.31,760.62
6003,-0.03,0.06,0.99,-6.16,18.43,760.8
6014,-0.03,0.06,1.0,-6.16,18.62,760.62
6025,-0.03,0.06,0.99,-6.16,18.62,761.29
6035,-0.03,0.06,0.99,-6.1,18.37,758.73
6045,-0.03,0.06,0.99,-6.1,18.25,757.51
6055,-0.03,0.06,0.99,-6.1,18.31,756.65
6065,-0.03,0.06,0.99,-6.04,18.55,756.71
6076,-0.03,0.06,0.99,-6.1,18.25,757.87
6086,-0.02,0.06,0.99,-6.35,18.13,761.66
6103,-0.04,0.06,1.0,-6.41,17.76,762.39
6113,-0.03,0.06,0.99,-6.41,18.68,761.05
6124,-0.03,0.06,0.99,-6.29,19.17,760.13
6135,-0.02,0.06,1.0,-6.29,19.17,759.03
6145,-0.02,0.07,0.99,-5.98,18.55,758.67
6157,-0.02,0.06,1.0,-5.74,18.19,757.87
6168,-0.02,0.05,0.99,-5.86,17.94,758.18
6179,-0.03,0.05,0.99,-6.1,18.19,759.16
6192,-0.03,0.06,0.99,-6.29,18.62,760.31
6202,-0.02,0.06,0.99,-6.1,18.8,760.13
6216,-0.02,0.06,0.99,-6.1,18.62,759.58
6226,-0.02,0.05,0.99,-6.04,18.19,759.64
6236,-0.02,0.06,0.99,-6.04,18.01,759.09
6248,-0.03,0.06,0.99,-6.23,17.7,758.54
6258,-0.03,0.06,0.99,-6.35,17.94,758.42
6268,-0.03,0.06,0.99,-6.1,18.13,759.77
6279,-0.03,0.06,1.0,-6.29,17.94,760.56
6289,-0.03,0.06,0.99,-6.59,18.74,759.7
6301,-0.02,0.06,0.99,-6.59,18.8,759.03
6317,-0.02,0.07,1.0,-6.16,18.62,759.46
6328,-0.02,0.06,0.99,-5.98,18.13,760.62
6338,-0.03,0.06,0.99,-6.04,18.01,761.17
6348,-0.03,0.06,1.0,-6.41,18.01,759.16
6359,-0.03,0.06,0.99,-6.41,18.31,758.48
6371,-0.03,0.06,1.0,-6.29,18.55,758.42
6381,-0.03,0.06,0.99,-6.1,18.68,757.81
6391,-0.02,0.06,0.99,-6.04,18.74,757.02
6403,-0.02,0.06,0.99,-6.04,18.31,756.77
6416,-0.03,0.06,0.99,-6.1,18.01,758.36
6430,-0.03,0.06,0.99,-6.41,18.13,760.74
6441,-0.03,0.06,1.0,-6.35,18.43,761.96
6451,-0.03,0.06,0.99,-6.47,18.55,762.21
6461,-0.03,0.06,1.0,-6.23,18.68,760.93
6474,-0.03,0.06,0.99,-6.1,18.62,759.58
6484,-0.03,0.06,0.99,-6.1,18.49,757.57
6494,-0.03,0.06,1.0,-6.04,18.55,757.75
6506,-0.02,0.06,0.99,-6.1,18.55,758.18
6516,-0.02,0.06,0.99,-6.16,18.25,759.22
6533,-0.03,0.06,1.0,-6.23,17.7,760.68
6543,-0.03,0.06,1.0,-5.98,18.19,760.56
6555,-0.03,0.06,1.0,-6.47,18.55,760.74
6566,-0.02,0.06,1.0,-6.41,18.8,759.77
6576,-0.02,0.06,0.98,-6.16,18.62,758.97
6586,-0.02,0.06,1.0,-6.1,18.49,757.87
6596,-0.02,0.06,0.99,-5.8,18.43,758.73
6608,-0.02,0.06,0.99,-5.98,18.31,759.52
6618,-0.02,0.06,0.99,-6.23,18.13,759.46
6633,-0.02,0.06,1.0,-6.35,18.31,759.4
6644,-0.02,0.06,0.99,-6.23,18.25,760.38
6655,-0.02,0.06,1.0,-6.23,18.19,760.31
6668,-0.02,0.06,0.99,-6.16,18.19,759.58
6678,-0.03,0.06,0.99,-5.92,17.82,759.58
6688,-0.03,0.06,1.0,-6.1,17.76,758.42
6698,-0.03,0.06,0.99,-6.71,18.49,758.85
6712,-0.03,0.07,0.99,-6.53,18.55,758.54
6723,-0.02,0.07,0.99,-6.29,18.68,759.09
6733,-0.02,0.06,0.99,-5.92,18.49,760.68
6752,-0.03,0.06,1.0,-6.23,18.25,761.78
6762,-0.03,0.06,0.99,-6.23,18.25,760.56
6772,-0.03,0.06,1.0,-6.41,18.25,759.46
6783,-0.03,0.06,0.99,-6.35,18.31,758.12
6794,-0.02,0.06,1.0,-5.98,18.62,758.06
6804,-0.02,0.06,0.99,-6.04,18.49,758.48
6814,-0.02,0.06,0.99,-6.35,18.49,758.0
6825,-0.03,0.06,1.0,-6.23,18.25,757.57
6835,-0.03,0.06,0.99,-6.04,18.13,759.03
6853,-0.03,0.06,0.99,-6.35,18.55,760.19
6865,-0.03,0.06,1.0,-6.35,18.49,759.7
6875,-0.03,0.06,0.99,-6.29,18.62,760.07
6886,-0.03,0.06,1.0,-6.16,18.31,760.5
6898,-0.03,0.06,0.99,-6.23,18.31,760.8
6909,-0.03,0.06,1.0,-6.35,18.25,759.77
6920,-0.03,0.06,0.99,-6.47,18.19,759.4
6933,-0.03,0.06,0.99,-6.35,18.31,758.36
6944,-0.02,0.06,1.0,-6.04,18.74,758.91
6963,-0.02,0.05,1.0,-5.98,18.25,758.85
6974,-0.02,0.06,0.99,-6.1,18.19,759.58
6985,-0.03,0.06,0.99,-6.29,18.25,760.5
6995,-0.03,0.06,1.0,-6.04,18.25,759.7
7005,-0.03,0.06,0.99,-5.8,18.86,759.34
7017,-0.02,0.06,0.99,-5.92,18.92,759.22
7027,-0.02,0.05,0.99,-6.1,18.74,760.13
7037,-0.02,0.06,0.99,-6.35,18.19,760.38
7048,-0.03,0.06,0.99,-6.35,17.88,759.77
7059,-0.03,0.06,1.0,-6.35,18.07,758.48
7075,-0.02,0.06,1.0,-6.16,18.37,758.54
7088,-0.02,0.06,0.99,-6.23,18.43,758.0
7098,-0.02,0.06,0.99,-6.1,18.37,759.64
7108,-0.03,0.06,0.99,-6.16,18.19,760.25
7118,-0.03,0.06,0.98,-6.47,18.31,760.93
7128,-0.03,0.06,1.0,-6.47,18.37,760.99
7138,-0.03,0.06,0.99,-6.29,18.43,760.38
7148,-0.02,0.06,0.98,-6.04,18.49,761.05
7158,-0.02,0.06,1.0,-6.04,18.49,761.05
7201,-0.03,0.06,1.0,-6.23,18.43,756.71
7261,-0.95,0.34,4.0,-2.56,-0.43,651.55
7274,-0.76,-0.04,4.0,-1.16,14.71,669.68
7284,-0.53,0.51,4.0,-14.83,25.51,698.91
7294,-0.36,0.62,4.0,-12.94,21.97,740.78
7305,-0.51,-0.02,4.0,0.92,7.45,774.11
7316,-0.66,0.25,4.0,-12.51,9.52,770.81
7327,-0.58,0.49,4.0,-17.64,21.12,765.93
7337,-0.19,0.29,4.0,-5.8,20.94,758.85
7351,-0.37,0.17,4.0,-6.23,12.82,758.06
7366,-0.39,0.34,4.0,-13.49,17.03,761.6
7376,-0.25,0.29,4.0,-10.8,19.96,763.37
7386,-0.25,0.28,4.0,-8.97,18.92,760.38
7397,-0.27,0.22,4.0,-10.68,15.69,762.88
7409,-0.31,0.29,4.0,-11.47,16.48,760.99
7419,-0.25,0.34,4.0,-9.46,18.37,760.5
7430,-0.27,0.22,4.0,-9.64,18.31,764.16
7440,-0.21,0.23,4.0,-9.03,18.19,765.69
7451,-0.24,0.25,4.0,-9.16,16.91,768.55
7467,-0.15,0.26,4.0,-9.58,18.68,766.6
7478,-0.2,0.13,4.0,-6.65,18.98,764.47
7488,-0.18,0.22,4.0,-8.54,19.29,762.76
7499,-0.16,0.17,4.0,-11.54,17.15,761.29
7512,-0.13,-0.13,-0.88,-13.43,21.97,777.77
7522,-0.05,0.13,-0.44,-15.81,24.78,814.21
7534,0.05,0.13,-0.34,-10.99,28.44,837.28
7545,0.05,0.14,0.22,-6.77,25.27,838.07
7555,0.03,0.12,1.29,-2.87,20.45,838.32
7572,0.02,-0.04,-0.44,2.56,15.75,826.05
7582,0.03,0.02,-0.1,-4.15,12.45,820.8
7592,0.05,-0.0,-0.03,-6.41,10.31,799.01
7602,-0.05,-0.09,0.01,-16.78,11.41,778.14
7612,-0.03,0.05,0.06,-25.82,12.88,764.34
7624,-0.03,0.03,-0.11,-24.41,11.17,759.52
7634,0.0,0.07,0.07,-27.16,10.8,756.84
7645,-0.08,0.06,-0.11,-22.89,5.86,752.5
7656,-0.07,0.08,-0.14,-19.47,9.64,751.22
7671,-0.29,0.06,0.04,-12.63,21.12,736.69
7683,-0.06,0.08,-0.05,-10.86,34.55,723.57
7693,-0.01,0.1,-0.03,-11.23,38.02,718.02
7703,0.0,0.1,-0.02,-11.41,35.52,718.08
7715,-0.0,0.09,-0.03,-9.64,35.58,717.35
7725,0.0,0.1,0.03,-5.74,32.65,716.92
7736,-0.0,0.09,-0.02,-6.29,30.52,716.37
7746,0.0,0.09,-0.0,-4.15,28.56,715.33
7758,0.01,0.09,-0.0,-2.93,27.71,715.76
7768,0.0,0.09,0.06,-2.26,26.25,715.58
7785,0.01,0.08,0.0,-0.31,25.33,713.5
7795,0.01,0.08,-0.0,-2.01,23.74,712.71
7805,0.01,0.08,-0.01,-2.5,24.78,712.71
7815,0.0,0.08,-0.01,-3.72,26.55,712.59
7827,0.0,0.08,-0.01,-4.09,27.59,712.4
7837,0.0,0.08,-0.01,-4.64,28.38,712.34
7847,0.0,0.08,-0.01,-5.19,29.11,712.16
7857,0.0,0.08,-0.01,-6.29,30.58,712.34
7871,0.0,0.08,-0.01,-6.84,31.31,712.1
7885,0.0,0.08,-0.01,-8.18,32.47,711.61
7897,0.0,0.08,-0.01,-8.85,33.14,711.98
7908,-0.0,0.08,-0.01,-9.77,34.73,712.16
7920,-0.0,0.08,-0.01,-10.31,35.46,711.85
7931,-0.0,0.08,-0.01,-10.99,36.07,711.85
7941,-0.0,0.08,-0.01,-11.54,36.68,711.85
7954,-0.0,0.08,-0.01,-12.76,37.66,711.55
7964,-0.0,0.08,-0.01,-13.37,38.27,711.91
7974,-0.01,0.08,-0.01,-13.98,38.76,711.73
7990,-0.01,0.09,-0.01,-14.83,39.79,711.55
8000,-0.01,0.08,-0.01,-15.32,40.1,711.73
8011,-0.01,0.09,-0.01,-16.72,40.89,712.16
8023,-0.01,0.09,-0.01,-17.15,41.2,711.67
8033,-0.01,0.09,-0.01,-17.82,41.44,711.55
8043,-0.01,0.09,-0.01,-18.37,41.69,711.3
8053,-0.01,0.09,-0.01,-19.84,42.11,711.3
8065,-0.01,0.09,-0.01,-20.69,42.3,711.49
8075,-0.01,0.09,-0.01,-21.61,42.6,711.18
8089,-0.01,0.09,-0.01,-23.25,42.91,710.94
8100,-0.01,0.09,-0.01,-24.11,43.21,710.88
8110,-0.01,0.09,-0.01,-24.78,43.21,710.75
8120,-0.02,0.09,-0.01,-25.57,43.4,710.94
8130,-0.02,0.09,-0.01,-27.28,44.01,710.45
8140,-0.02,0.09,-0.01,-28.08,44.07,710.39
8153,-0.02,0.09,-0.01,-28.99,44.13,710.33
8163,-0.02,0.09,-0.01,-30.82,44.49,710.27
8174,-0.02,0.09,-0.01,-31.56,44.62,710.08
8192,-0.02,0.09,-0.01,-33.08,44.68,709.9
8202,-0.02,0.09,-0.01,-33.87,44.74,709.96
8213,-0.02,0.09,-0.01,-34.73,44.8,710.14
8224,-0.02,0.09,-0.01,-36.07,44.8,709.66
8236,-0.02,0.09,-0.01,-36.93,44.92,709.59
8246,-0.03,0.09,-0.01,-37.72,44.92,709.53
8256,-0.03,0.09,-0.01,-38.7,44.92,709.53
8268,-0.03,0.09,-0.01,-40.34,44.74,709.96
8278,-0.03,0.09,-0.01,-41.02,44.86,709.41
8288,-0.03,0.09,-0.01,-41.81,44.62,709.35
8303,-0.03,0.09,-0.01,-43.52,44.49,709.23
8313,-0.03,0.09,-0.01,-44.07,44.31,709.23
8323,-0.03,0.09,-0.01,-44.98,44.25,709.53
8333,-0.03,0.09,-0.01,-46.57,43.82,708.86
8345,-0.03,0.09,-0.01,-47.42,43.64,708.8
8356,-0.03,0.09,-0.01,-48.16,43.58,708.68
8366,-0.03,0.09,-0.01,-48.83,43.33,708.68
8376,-0.04,0.09,-0.01,-50.42,42.79,708.56
8388,-0.04,0.09,-0.01,-50.96,42.6,708.5
8404,-0.04,0.09,-0.01,-52.55,41.99,708.37
8414,-0.04,0.09,-0.01,-53.41,41.69,708.5
8424,-0.04,0.09,-0.01,-54.32,41.38,708.74
8434,-0.04,0.09,-0.01,-54.93,41.08,708.44
8444,-0.04,0.09,-0.01,-56.34,40.41,708.25
8458,-0.04,0.09,-0.01,-56.82,40.1,708.25
8469,-0.04,0.09,-0.01,-58.23,39.18,708.25
8481,-0.04,0.08,-0.01,-59.08,38.82,708.07
8492,-0.04,0.09,-0.01,-59.81,38.45,707.89
8507,-0.04,0.08,-0.01,-60.97,37.66,708.13
8517,-0.04,0.08,-0.01,-61.83,37.29,708.37
8528,-0.05,0.08,-0.01,-62.32,36.74,708.25
8540,-0.05,0.08,-0.01,-63.54,35.83,707.76
8552,-0.05,0.08,-0.01,-64.15,35.4,707.95
8562,-0.05,0.08,-0.01,-64.64,34.85,707.82
8572,-0.05,0.08,-0.01,-65.86,33.87,707.89
8583,-0.05,0.08,-0.01,-66.28,33.39,707.46
8595,-0.05,0.08,-0.01,-66.77,32.71,707.52
8609,-0.05,0.08,-0.01,-67.69,31.62,707.46
8619,-0.05,0.08,-0.01,-68.12,31.01,707.7
8629,-0.05,0.08,-0.01,-68.66,30.46,707.76
8639,-0.05,0.08,-0.01,-69.03,29.91,707.46
8652,-0.05,0.08,-0.01,-69.95,28.63,707.4
8662,-0.05,0.08,-0.01,-70.25,28.2,707.34
8672,-0.05,0.08,-0.01,-70.62,27.59,707.52
8682,-0.05,0.08,-0.01,-71.11,26.92,707.46
8693,-0.05,0.07,-0.01,-71.47,25.57,707.21
8710,-0.05,0.07,-0.01,-72.08,24.48,707.34
8721,-0.05,0.07,-0.01,-72.45,23.93,707.64
8731,-0.05,0.07,-0.01,-72.69,23.19,707.52
8742,-0.05,0.07,-0.01,-72.69,22.52,707.28
8755,-0.05,0.07,-0.01,-73.12,21.36,707.21
8765,-0.05,0.07,-0.01,-73.36,20.63,707.28
8775,-0.05,0.07,-0.01,-73.43,19.78,707.46
8785,-0.05,0.07,-0.01,-73.24,18.43,706.97
8795,-0.05,0.07,-0.01,-73.49,17.82,707.21
8811,-0.05,0.07,-0.01,-73.3,16.36,707.28
8823,-0.05,0.07,-0.01,-73.43,15.62,707.4
8833,-0.05,0.07,-0.01,-73.43,14.95,707.34
8843,-0.05,0.07,-0.01,-73.36,14.22,707.21
8854,-0.05,0.07,-0.01,-73.06,12.82,707.15
8864,-0.05,0.07,-0.01,-72.75,12.15,707.15
8875,-0.05,0.06,-0.01,-72.94,11.29,707.34
8885,-0.05,0.06,-0.01,-72.75,10.62,707.21
8895,-0.05,0.06,-0.01,-72.33,9.34,707.21
8912,-0.05,0.06,-0.01,-71.96,8.0,707.28
8922,-0.05,0.06,-0.01,-71.66,7.14,707.52
8933,-0.05,0.06,-0.01,-71.47,6.59,707.46
8944,-0.05,0.06,-0.01,-71.11,5.8,707.21
8955,-0.05,0.06,-0.01,-70.68,5.0,707.09
8966,-0.05,0.06,-0.01,-70.13,3.85,707.21
8977,-0.05,0.06,-0.01,-70.07,3.05,707.52
8987,-0.05,0.06,-0.01,-69.4,2.5,707.28
8997,-0.05,0.06,-0.01,-68.85,1.77,707.46
9012,-0.05,0.06,-0.01,-68.18,0.49,707.21
9023,-0.05,0.06,-0.01,-67.57,0.0,707.28
9034,-0.05,0.06,-0.01,-66.89,-1.34,707.4
9044,-0.05,0.05,-0.01,-66.41,-2.01,707.34
9054,-0.05,0.05,-0.01,-65.92,-2.56,707.4
9065,-0.05,0.05,-0.01,-65.43,-3.11,707.4
9076,-0.05,0.05,-0.01,-64.45,-4.27,707.82
9087,-0.05,0.05,-0.01,-63.84,-4.64,707.58
9099,-0.05,0.05,-0.01,-63.29,-5.13,707.58
9113,-0.04,0.05,-0.01,-62.01,-6.04,707.52
9123,-0.04,0.05,-0.01,-61.34,-6.47,707.7
9134,-0.04,0.05,-0.01,-60.85,-6.9,708.25
9147,-0.04,0.05,-0.01,-59.51,-7.57,707.64
9157,-0.04,0.05,-0.01,-58.9,-8.18,707.76
9167,-0.04,0.05,-0.01,-58.04,-8.67,707.82
9177,-0.04,0.05,-0.01,-56.88,-9.64,708.25
9187,-0.04,0.05,-0.01,-56.15,-10.07,708.07
9198,-0.04,0.05,-0.01,-55.42,-10.31,708.01
9215,-0.04,0.05,-0.01,-53.89,-10.86,708.07
9225,-0.04,0.05,-0.0,-53.16,-11.47,708.25
9235,-0.04,0.05,-0.01,-52.55,-11.78,708.68
9245,-0.04,0.05,-0.0,-51.09,-12.63,708.13
9255,-0.03,0.05,-0.0,-50.29,-12.82,708.25
9267,-0.03,0.05,-0.0,-49.38,-13.18,708.25
9277,-0.03,0.05,-0.0,-48.71,-13.43,708.37
9287,-0.03,0.05,-0.0,-47.12,-13.92,708.37
9297,-0.03,0.05,-0.0,-46.33,-14.22,708.56
9313,-0.03,0.05,-0.0,-44.68,-14.53,708.8
9323,-0.03,0.04,-0.0,-43.95,-14.65,708.98
9334,-0.03,0.05,-0.0,-43.15,-14.89,709.05
9344,-0.03,0.04,-0.0,-42.24,-15.08,708.62
9354,-0.03,0.04,-0.0,-41.38,-15.32,708.8
9364,-0.03,0.04,-0.0,-39.67,-15.62,708.86
9375,-0.03,0.04,-0.0,-38.88,-15.69,708.98
9385,-0.03,0.04,-0.0,-38.02,-15.69,709.23
9395,-0.02,0.04,-0.0,-37.11,-15.69,708.92
9411,-0.02,0.04,-0.0,-35.46,-15.81,708.98
9422,-0.02,0.04,-0.0,-34.61,-15.69,709.05
9432,-0.02,0.04,-0.0,-32.9,-15.93,709.72
9443,-0.02,0.04,-0.0,-32.1,-15.81,709.29
9454,-0.02,0.04,-0.0,-31.07,-15.87,709.17
9464,-0.02,0.04,-0.0,-30.33,-15.87,709.23
9474,-0.02,0.04,-0.0,-29.42,-15.75,709.41
9484,-0.02,0.04,-0.0,-27.71,-15.5,709.47
9494,-0.02,0.04,-0.0,-26.86,-15.38,709.53
9510,-0.02,0.04,-0.0,-25.39,-15.32,709.35
9522,-0.01,0.04,-0.0,-24.48,-14.89,709.53
9533,-0.01,0.04,-0.0,-23.56,-14.83,709.78
9543,-0.01,0.05,-0.0,-21.91,-14.47,709.66
9555,-0.01,0.05,-0.0,-21.12,-14.1,709.72
9566,-0.01,0.04,-0.0,-20.26,-14.04,709.53
9576,-0.01,0.05,-0.0,-19.59,-13.67,709.53
9588,-0.01,0.05,-0.0,-17.94,-13.12,709.9
9599,-0.01,0.05,-0.0,-17.21,-12.94,709.66
9614,-0.01,0.05,-0.0,-15.5,-12.21,709.84
9624,-0.01,0.05,-0.0,-14.83,-11.9,709.78
9634,-0.01,0.05,-0.0,-14.22,-11.47,710.14
9644,-0.01,0.05,-0.0,-13.43,-11.11,710.21
9656,-0.0,0.05,-0.0,-12.15,-10.5,709.84
9666,-0.0,0.05,-0.0,-11.66,-10.19,710.14
9676,-0.0,0.05,-0.0,-10.93,-9.77,709.96
9686,-0.0,0.05,-0.0,-10.25,-9.22,709.96
9696,-0.0,0.05,-0.0,-9.7,-8.79,710.08
9711,-0.0,0.05,-0.0,-8.42,-7.81,709.78
9722,-0.0,0.05,-0.0,-7.45,-7.08,709.96
9734,-0.0,0.05,-0.0,-6.96,-6.71,710.21
9745,0.0,0.05,-0.01,-6.35,-6.04,710.14
9756,0.0,0.05,-0.01,-5.19,-5.25,709.84
9768,0.0,0.05,-0.01,-4.82,-4.64,709.84
9778,0.0,0.05,-0.01,-4.27,-4.03,709.9
9788,0.0,0.05,-0.0,-3.78,-3.6,710.08
9799,0.0,0.05,-0.0,-2.87,-2.44,709.78
9815,0.0,0.05,-0.0,-2.2,-1.16,709.9
9826,0.0,0.06,-0.0,-1.59,-0.61,709.96
9837,0.0,0.06,-0.01,-1.16,0.0,710.08
9847,0.0,0.06,-0.0,-0.98,0.67,709.9
9857,0.0,0.06,-0.0,-0.49,1.28,709.78
9869,0.0,0.06,-0.01,0.12,2.75,709.9
9879,0.0,0.06,-0.01,0.43,3.36,709.9
9891,0.0,0.06,-0.0,0.55,3.97,710.21
9901,0.01,0.06,-0.01,1.04,5.43,709.66
9914,0.01,0.06,-0.01,1.4,6.04,709.9
9927,0.01,0.06,-0.01,1.83,7.57,709.84
9940,0.01,0.06,-0.01,1.89,8.3,710.21
9950,0.01,0.06,-0.01,2.01,9.09,710.08
9961,0.01,0.06,-0.01,2.38,10.25,709.84
9973,0.01,0.07,-0.01,2.5,10.93,710.02
9984,0.01,0.07,-0.01,2.56,11.78,709.96
9995,0.01,0.07,-0.01,2.75,13.31,709.9
10005,0.01,0.07,-0.01,2.69,13.92,709.78
10015,0.01,0.07,-0.01,2.75,14.65,709.78
10026,0.01,0.07,-0.01,2.69,15.38,709.78
10040,0.01,0.07,-0.01,2.62,16.91,710.21
10050,0.01,0.07,-0.01,2.56,17.58,709.96
10061,0.01,0.07,-0.01,2.44,18.37,709.9
10072,0.01,0.07,-0.01,2.2,19.84,709.84
10082,0.01,0.07,-0.01,2.08,20.45,709.9
10092,0.01,0.07,-0.01,2.01,21.24,709.96
10103,0.01,0.07,-0.01,1.83,21.79,709.84
10113,0.0,0.07,-0.01,1.4,23.38,709.41
10123,0.0,0.07,-0.01,1.34,23.93,709.41
10141,0.0,0.08,-0.01,0.61,25.39,710.02
10151,0.0,0.08,-0.01,0.61,25.88,709.66
10162,0.0,0.08,-0.01,0.12,26.61,709.47
10173,0.0,0.08,-0.01,-0.24,27.22,709.35
10185,0.0,0.08,-0.01,-0.85,28.56,709.47
10195,0.0,0.08,-0.01,-1.34,29.36,709.9
10205,0.0,0.08,-0.01,-1.59,29.85,709.35
10217,0.0,0.08,-0.01,-2.38,31.25,709.53
10229,0.0,0.08,-0.01,-2.99,31.8,709.29
10246,0.0,0.08,-0.01,-3.91,32.96,709.47
10257,0.0,0.08,-0.01,-4.21,33.51,709.29
10267,0.0,0.08,-0.01,-5.31,34.73,709.05
10277,0.0,0.08,-0.01,-5.86,35.22,709.11
10288,-0.0,0.08,-0.01,-6.29,35.77,709.05
10299,-0.0,0.08,-0.01,-7.02,36.5,709.29
10309,-0.0,0.08,-0.01,-8.36,37.48,708.8
10319,-0.0,0.08,-0.01,-8.73,37.96,708.86
10330,-0.0,0.09,-0.01,-9.22,38.45,708.86
10346,-0.0,0.09,-0.01,-10.5,39.55,708.98
10357,-0.0,0.09,-0.01,-11.17,40.04,708.74
10367,-0.01,0.09,-0.01,-11.9,40.59,708.74
10377,-0.01,0.09,-0.01,-12.63,41.02,708.25
10388,-0.01,0.09,-0.01,-13.98,41.87,708.56
10399,-0.01,0.09,-0.01,-14.65,42.24,708.74
10410,-0.01,0.09,-0.01,-15.26,42.54,708.19
10421,-0.01,0.09,-0.01,-16.85,43.27,708.19
10432,-0.01,0.09,-0.01,-17.64,43.76,708.19
10448,-0.01,0.09,-0.01,-19.23,44.31,708.37
10458,-0.01,0.09,-0.01,-20.08,44.74,708.01
10469,-0.01,0.09,-0.01,-20.94,44.92,708.07
10479,-0.01,0.09,-0.01,-22.4,45.35,707.95
10489,-0.01,0.09,-0.01,-23.32,45.72,707.89
10499,-0.01,0.09,-0.01,-23.99,45.84,708.19
10509,-0.02,0.09,-0.01,-24.96,46.08,707.76
10519,-0.02,0.09,-0.01,-25.82,46.33,707.7
10529,-0.02,0.09,-0.01,-26.55,46.51,707.64
10544,-0.02,0.09,-0.01,-28.5,46.94,707.58
10554,-0.02,0.09,-0.01,-29.3,47.06,707.82
10565,-0.02,0.09,-0.01,-30.82,47.3,707.4
10577,-0.02,0.09,-0.01,-31.62,47.36,707.28
10587,-0.02,0.09,-0.01,-32.59,47.49,707.21
10598,-0.02,0.09,-0.01,-33.45,47.61,707.21
10608,-0.02,0.09,-0.01,-35.28,47.67,706.97
10618,-0.02,0.09,-0.01,-36.13,47.79,707.03
10629,-0.03,0.09,-0.01,-37.11,47.79,706.91
10644,-0.03,0.09,-0.01,-38.64,47.61,706.91
10655,-0.03,0.09,-0.01,-39.67,47.61,706.91
10665,-0.03,0.09,-0.01,-40.53,47.36,706.73
10675,-0.03,0.09,-0.01,-41.38,47.24,706.54
10686,-0.03,0.09,-0.01,-43.15,47.24,706.3
10697,-0.03,0.09,-0.01,-44.13,47.06,706.54
10707,-0.03,0.09,-0.01,-44.98,46.94,706.48
10718,-0.03,0.09,-0.01,-46.45,46.69,706.3
10730,-0.03,0.09,-0.01,-47.24,46.39,706.24
10745,-0.03,0.09,-0.01,-49.07,46.14,706.3
10756,-0.04,0.09,-0.01,-49.99,45.72,706.18
10766,-0.04,0.09,-0.01,-50.78,45.59,705.87
10776,-0.04,0.09,-0.01,-51.64,45.29,705.87
10786,-0.04,0.09,-0.01,-52.43,44.92,705.75
10797,-0.04,0.09,-0.01,-54.02,44.43,705.75
10808,-0.04,0.09,-0.01,-54.81,44.13,705.69
10818,-0.04,0.09,-0.01,-55.6,43.7,705.38
10828,-0.04,0.09,-0.01,-56.15,43.27,705.38
10845,-0.04,0.09,-0.01,-58.41,42.18,705.44
10855,-0.04,0.09,-0.01,-59.2,41.87,705.44
10865,-0.04,0.09,-0.01,-59.94,41.44,705.2
10876,-0.04,0.09,-0.01,-60.49,41.14,705.2
10886,-0.05,0.09,-0.01,-61.22,40.65,705.14
10896,-0.05,0.09,-0.01,-62.13,40.1,705.2
10906,-0.05,0.08,-0.01,-63.54,39.06,705.02
10916,-0.05,0.08,-0.01,-64.03,38.64,705.02
10933,-0.05,0.08,-0.01,-65.0,37.6,704.71
10945,-0.05,0.08,-0.01,-65.67,37.05,704.83
10956,-0.05,0.08,-0.01,-66.41,36.56,704.96
10966,-0.05,0.08,-0.01,-67.44,35.4,704.59
10978,-0.05,0.08,-0.01,-68.05,34.91,704.65
10988,-0.05,0.08,-0.01,-68.73,34.3,704.59
10998,-0.05,0.08,-0.01,-69.15,33.75,704.47
11009,-0.05,0.08,-0.01,-70.13,32.41,704.47
11021,-0.05,0.08,-0.01,-70.37,31.86,704.35
11037,-0.05,0.08,-0.01,-71.29,30.76,704.47
11047,-0.05,0.08,-0.01,-71.53,30.21,704.41
11057,-0.05,0.08,-0.01,-72.27,29.48,704.65
11067,-0.05,0.08,-0.01,-72.57,28.2,704.16
11078,-0.05,0.08,-0.01,-73.12,27.53,704.16
11088,-0.05,0.08,-0.01,-73.43,26.73,704.16
11099,-0.05,0.08,-0.01,-73.73,26.12,704.16
11109,-0.05,0.07,-0.01,-73.85,25.39,704.35
11119,-0.05,0.07,-0.01,-74.46,24.29,704.22
11137,-0.06,0.07,-0.01,-74.77,22.64,704.28
11148,-0.06,0.07,-0.01,-74.77,21.97,704.22
11159,-0.06,0.07,-0.01,-75.07,21.18,704.35
11172,-0.05,0.07,-0.01,-75.26,19.84,704.04
11183,-0.05,0.07,-0.01,-75.32,19.1,704.04
11193,-0.05,0.07,-0.01,-75.26,18.43,704.04
11203,-0.06,0.07,-0.01,-75.38,17.82,704.04
11215,-0.06,0.07,-0.01,-75.5,16.3,703.98
11226,-0.05,0.07,-0.01,-75.5,15.62,704.04
11241,-0.05,0.07,-0.01,-75.32,13.98,703.92
11252,-0.06,0.07,-0.01,-75.2,13.24,704.22
11262,-0.06,0.06,-0.01,-75.07,12.7,704.59
11272,-0.06,0.06,-0.01,-74.89,11.17,704.04
11282,-0.05,0.06,-0.01,-74.89,10.38,704.16
11293,-0.05,0.06,-0.01,-74.46,9.64,704.1
11304,-0.05,0.06,-0.01,-74.22,8.91,704.1
11315,-0.05,0.06,-0.01,-73.73,7.45,704.16
11325,-0.05,0.06,-0.01,-73.61,6.71,704.1
11342,-0.05,0.06,-0.01,-72.94,5.19,704.35
11353,-0.05,0.06,-0.01,-72.51,4.58,704.41
11364,-0.05,0.06,-0.01,-72.27,3.72,704.71
11375,-0.05,0.06,-0.01,-71.47,2.44,704.28
11385,-0.05,0.06,-0.01,-71.17,1.71,704.47
11395,-0.05,0.06,-0.01,-70.74,1.1,704.59
11405,-0.05,0.06,-0.01,-70.43,0.31,704.53
11416,-0.05,0.06,-0.01,-69.82,-0.37,704.71
11426,-0.05,0.05,-0.01,-68.91,-1.83,704.41
11443,-0.05,0.05,-0.01,-67.75,-2.87,704.65
11453,-0.05,0.05,-0.01,-67.26,-3.48,704.9
11464,-0.05,0.05,-0.01,-66.83,-4.21,705.02
11475,-0.05,0.05,-0.01,-66.22,-4.76,704.71
11485,-0.05,0.05,-0.01,-65.06,-5.62,704.59
11497,-0.05,0.05,-0.01,-64.39,-6.29,704.65
11507,-0.05,0.05,-0.01,-63.78,-6.77,704.83
11517,-0.05,0.05,-0.01,-63.35,-7.14,705.26
11527,-0.05,0.05,-0.01,-62.74,-7.57,704.9
11543,-0.04,0.05,-0.01,-60.67,-9.16,705.02
11553,-0.04,0.05,-0.01,-60.0,-9.58,705.2
11563,-0.04,0.05,-0.01,-59.2,-10.07,705.57
11574,-0.04,0.05,-0.01,-58.47,-10.38,704.96
11584,-0.04,0.05,-0.01,-57.74,-11.05,705.02
11594,-0.04,0.05,-0.0,-57.01,-11.47,705.08
11604,-0.04,0.05,-0.01,-55.42,-12.27,705.26
11616,-0.04,0.05,-0.01,-54.75,-12.76,705.44
11633,-0.04,0.05,-0.0,-53.16,-13.37,705.32
11644,-0.04,0.05,-0.0,-52.19,-13.73,705.44
11655,-0.04,0.04,-0.0,-51.39,-14.04,705.57
11667,-0.03,0.04,-0.0,-49.8,-14.83,705.81
11677,-0.03,0.04,-0.0,-49.07,-15.2,705.57
11688,-0.03,0.04,-0.01,-48.03,-15.32,705.63
11701,-0.03,0.04,-0.0,-46.14,-15.87,705.75
11712,-0.03,0.04,-0.0,-45.53,-16.11,705.87
11722,-0.03,0.04,-0.0,-44.74,-16.42,705.99
11737,-0.03,0.04,-0.0,-42.91,-16.91,705.93
11747,-0.03,0.04,-0.0,-42.91,-16.91,705.93
11757,-0.03,0.04,-0.0,-41.14,-17.09,705.99
11769,-0.03,0.04,-0.0,-39.25,-17.46,706.3
11779,-0.03,0.04,-0.0,-38.33,-17.64,706.18
11789,-0.02,0.04,-0.0,-37.48,-17.58,706.05
11799,-0.02,0.04,-0.0,-35.64,-17.88,706.05
11813,-0.02,0.04,-0.0,-34.73,-17.88,706.42
11824,-0.02,0.04,-0.0,-33.81,-17.88,706.48
11841,-0.02,0.04,-0.0,-31.13,-17.76,706.24
11851,-0.02,0.04,-0.0,-30.4,-17.76,706.24
11864,-0.02,0.04,-0.0,-29.54,-17.76,706.54
11874,-0.02,0.04,-0.0,0.0,8590721024.0,0.0
11884,-0.02,0.04,-0.0,-27.47,-17.58,706.36
11895,-0.01,0.04,-0.0,-25.76,-17.46,706.6
11906,-0.02,0.04,-0.0,-24.66,-17.27,706.54
11916,-0.01,0.04,-0.0,-23.99,-17.09,706.6
11938,-0.01,0.04,-0.0,-21.48,-16.54,706.67
11949,-0.01,0.04,-0.0,-20.51,-16.24,706.85
11960,-0.01,0.04,-0.0,-19.78,-15.99,706.97
11971,-0.01,0.04,-0.0,-18.13,-15.62,706.97
11982,-0.01,0.04,-0.0,-17.33,-15.32,706.85
11993,-0.01,0.04,-0.0,-16.54,-15.01,706.85
12003,-0.01,0.04,-0.0,-15.81,-14.71,706.85
12013,-0.01,0.05,-0.0,-14.34,-13.98,707.28
12023,-0.01,0.05,-0.0,-13.61,-13.67,707.09
12040,-0.0,0.05,-0.0,-11.9,-12.88,707.09
12051,-0.0,0.05,-0.0,-11.47,-12.51,706.97
12062,-0.0,0.05,-0.0,-10.68,-12.08,707.15
12072,-0.0,0.05,-0.0,-9.89,-11.66,707.4
12083,-0.0,0.05,-0.0,-8.61,-10.68,706.85
12094,-0.0,0.05,-0.0,-7.93,-10.31,707.03
12105,-0.0,0.05,-0.0,-7.26,-9.64,707.03
12115,0.0,0.05,-0.01,-6.04,-8.54,707.52
12128,0.0,0.05,-0.01,-5.55,-7.93,707.28
12142,0.0,0.05,-0.0,-4.33,-7.02,707.15
12153,0.0,0.05,-0.0,-3.85,-6.59,707.34
12163,0.0,0.05,-0.0,-3.3,-5.98,707.28
12175,0.0,0.05,-0.0,-2.14,-5.13,707.46
12187,0.0,0.05,-0.0,-1.65,-4.52,707.28
12197,0.0,0.05,-0.01,-1.04,-3.97,707.15
12207,0.0,0.05,-0.0,-0.55,-3.36,707.21
12217,0.0,0.05,-0.0,-0.24,-2.75,707.09
12228,0.0,0.06,-0.01,0.79,-1.34,707.34
12245,0.0,0.06,-0.01,1.28,-0.18,707.21
12255,0.01,0.06,-0.01,1.71,0.49,707.28
12266,0.01,0.06,-0.01,2.2,1.22,707.21
12276,0.01,0.06,-0.01,2.56,2.08,707.46
12286,0.01,0.06,-0.01,3.11,3.42,706.91
12296,0.01,0.06,-0.01,3.36,4.15,707.09
12306,0.01,0.06,-0.01,3.72,4.94,707.03
12316,0.01,0.06,-0.01,3.85,5.68,707.09
12327,0.01,0.06,-0.0,3.97,6.53,707.46
12337,0.01,0.06,-0.01,4.39,7.93,706.97
12355,0.01,0.06,-0.01,4.76,9.4,707.15
12366,0.01,0.06,-0.01,4.88,10.19,707.28
12376,0.01,0.06,-0.01,4.82,10.8,707.7
12386,0.01,0.06,-0.01,5.0,11.6,707.15
12398,0.01,0.07,-0.01,5.25,13.18,707.28
12409,0.01,0.07,-0.01,5.25,13.85,707.09
12420,0.01,0.07,-0.01,5.37,14.59,706.91
12432,0.01,0.07,-0.01,5.25,16.24,707.03
12443,0.01,0.07,-0.01,5.13,16.97,706.91
12459,0.01,0.07,-0.01,5.07,18.43,707.03
12469,0.01,0.07,-0.01,4.94,19.23,707.03
12482,0.01,0.07,-0.01,4.88,20.81,706.91
12493,0.01,0.07,-0.01,4.64,21.42,707.03
12504,0.01,0.07,-0.01,4.39,22.28,706.85
12514,0.01,0.07,-0.01,4.33,22.89,706.79
12524,0.01,0.07,-0.01,3.6,24.54,707.03
12534,-0.41,-0.12,-0.11,3.66,25.15,706.18
12544,-0.01,0.07,-0.01,5.07,26.67,696.53
12559,0.01,0.09,-0.0,4.76,29.97,691.77
12570,0.02,0.08,-0.01,3.72,31.19,691.71
12581,0.01,0.09,-0.01,2.44,32.35,691.71
12591,0.01,0.08,-0.01,1.4,33.26,691.04
12601,-0.01,0.08,-0.02,-0.43,34.36,691.35
12613,-0.0,0.08,-0.01,-0.73,34.67,691.65
12624,0.0,0.08,-0.01,-1.22,34.97,691.77
12634,0.0,0.08,-0.01,-1.65,35.22,691.77
12645,0.01,0.08,-0.01,-2.75,36.44,691.65
12663,0.0,0.08,-0.01,-3.91,38.21,691.47
12674,0.0,0.08,-0.01,-4.33,39.0,691.41
12684,-0.0,0.08,-0.01,-5.07,39.86,691.65
12695,-0.0,0.08,-0.01,-6.53,40.95,691.04
12708,-0.0,0.08,-0.01,-7.39,41.44,691.16
12718,-0.0,0.08,-0.01,-8.67,42.42,690.92
12728,-0.0,0.08,-0.01,-8.67,42.42,690.92
12741,-0.0,0.09,-0.01,-10.31,43.52,690.67
12751,-0.01,0.09,-0.01,-10.99,44.01,690.73
12762,-0.01,0.09,-0.01,-11.84,44.49,690.8
12776,-0.01,0.09,-0.01,-13.55,45.41,690.92
12787,-0.01,0.09,-0.01,-13.55,45.41,690.92
12797,-0.01,0.09,-0.01,-15.69,46.75,690.55
12809,-0.01,0.09,-0.01,-16.3,46.94,690.55
12819,-0.01,0.09,-0.01,-17.15,47.18,690.55
12829,-0.01,0.09,-0.01,-19.17,47.91,690.73
12842,-0.01,0.09,-0.01,-19.9,48.22,690.43
12853,-0.01,0.09,-0.01,-20.81,48.34,690.31
12867,-0.01,0.09,-0.01,-22.52,48.95,690.19
12877,-0.01,0.09,-0.01,-23.5,49.19,690.49
12887,-0.02,0.09,-0.01,-24.66,49.44,690.43
12898,-0.02,0.09,-0.01,-25.33,49.68,690.0
12912,-0.02,0.09,-0.01,-27.22,49.93,690.0
12923,-0.02,0.09,-0.01,-28.08,49.99,689.88
12933,-0.02,0.09,-0.01,-30.15,50.35,690.0
12945,-0.02,0.09,-0.01,-30.88,50.48,689.58
12957,-0.02,0.09,-0.01,-31.8,50.42,689.39
12973,-0.02,0.09,-0.01,-33.81,50.66,689.64
12983,-0.02,0.09,-0.01,-33.81,50.66,689.64
12993,-0.03,0.09,-0.01,-36.87,50.9,689.33
13003,-0.03,0.09,-0.01,-37.6,50.78,689.27
13015,-0.03,0.09,-0.01,-38.64,50.54,689.21
13025,-0.03,0.09,-0.01,-39.55,50.6,689.15
13035,-0.03,0.09,-0.01,-41.56,50.6,689.21
13045,-0.03,0.09,-0.01,-42.42,50.54,688.96
13055,-0.03,0.09,-0.01,-43.4,50.29,688.84
13072,-0.03,0.09,-0.01,-45.35,50.17,688.6
13083,-0.03,0.09,-0.01,-46.26,49.74,688.78
13094,-0.03,0.09,-0.01,-47.3,49.56,688.66
13105,-0.04,0.09,-0.01,-48.89,49.19,688.54
13116,-0.04,0.09,-0.01,-49.62,49.01,688.29
13126,-0.04,0.09,-0.01,-50.6,48.71,688.35
13136,-0.04,0.09,-0.01,-51.7,48.34,688.42
13148,-0.04,0.09,-0.01,-53.16,47.91,688.23
13158,-0.04,0.09,-0.01,-54.2,47.42,688.23
13173,-0.04,0.09,-0.01,-55.66,46.88,687.81
13185,-0.04,0.09,-0.01,-56.82,46.57,688.11
13195,-0.04,0.09,-0.01,-57.68,46.14,687.99
13205,-0.04,0.09,-0.01,-58.9,45.35,687.81
13215,-0.04,0.08,-0.01,-59.81,44.8,687.68
13226,-0.04,0.08,-0.01,-60.67,44.37,687.56
13238,-0.04,0.08,-0.01,-61.52,43.88,687.87
13248,-0.05,0.08,-0.01,-63.05,43.03,687.32
13259,-0.05,0.08,-0.01,-63.78,42.6,687.38
13276,-0.05,0.08,-0.01,-65.12,41.5,687.38
13287,-0.05,0.08,-0.01,-65.92,40.95,687.62
13298,-0.05,0.08,-0.01,-66.53,40.41,687.44
13311,-0.05,0.08,-0.01,-67.87,39.18,687.01
13322,-0.05,0.08,-0.01,-68.48,38.64,686.95
13332,-0.05,0.08,-0.01,-69.27,38.02,686.95
13343,-0.05,0.08,-0.01,-70.5,37.05,686.71
13354,-0.05,0.08,-0.01,-70.92,36.32,686.65
13365,-0.05,0.08,-0.01,-71.35,35.58,686.89
13382,-0.05,0.08,-0.01,-72.51,34.18,686.58
13392,-0.05,0.08,-0.01,-73.18,33.45,686.95
13405,-0.05,0.08,-0.01,-74.04,32.23,686.34
13415,-0.05,0.07,-0.01,-74.4,31.43,686.34
13425,-0.05,0.07,-0.01,-74.77,30.88,686.22
13435,-0.05,0.07,-0.01,-75.56,29.48,686.71
13446,-0.06,0.07,-0.01,-75.74,28.75,686.34
13456,-0.05,0.07,-0.01,-76.17,28.08,686.16
13478,-0.06,0.07,-0.01,-77.09,25.82,686.16
13488,-0.06,0.07,-0.01,-77.39,25.02,686.77
13499,-0.06,0.07,-0.01,-77.45,24.35,686.28
13509,-0.06,0.07,-0.01,-77.58,23.62,686.16
13520,-0.06,0.07,-0.01,-78.12,21.97,686.1
13531,-0.06,0.07,-0.01,-78.06,21.12,686.16
13544,-0.06,0.07,-0.01,-78.49,20.32,686.4
13554,-0.06,0.07,-0.01,-78.61,19.47,686.28
13566,-0.06,0.07,-0.01,-78.49,17.94,686.04
13583,-0.06,0.06,-0.01,-78.61,16.24,686.22
13593,-0.06,0.06,-0.01,-78.67,15.44,686.52
13603,-0.06,0.06,-0.01,-78.55,14.53,686.22
13613,-0.06,0.06,-0.01,-78.31,13.79,686.04
13625,-0.06,0.06,-0.01,-78.19,12.21,686.16
13635,-0.06,0.06,-0.01,-78.31,11.41,686.1
13645,-0.06,0.06,-0.01,-78.12,10.56,686.46
13656,-0.06,0.06,-0.01,-77.7,8.79,686.1
13666,-0.06,0.06,-0.01,-77.58,8.06,685.91
13682,-0.06,0.06,-0.01,-77.09,6.41,686.28
13693,-0.06,0.06,-0.01,-76.97,5.74,686.58
13704,-0.06,0.06,-0.01,-76.66,5.07,686.46
13715,-0.06,0.06,-0.01,-76.35,4.21,686.34
13725,-0.06,0.06,-0.01,-75.5,2.62,686.28
13737,-0.06,0.05,-0.01,-75.2,1.83,686.4
13748,-0.05,0.05,-0.01,-75.07,1.1,686.71
13758,-0.05,0.05,-0.01,-74.28,-0.55,686.34
