%!PS-Adobe-3.0 EPSF-3.0
%%Title: pics\gyro_vs_motor_vs_ccs_acc_3.eps
%%Creator: matplotlib version 3.2.1, http://matplotlib.org/
%%CreationDate: Sat Apr 10 16:18:42 2021
%%Orientation: portrait
%%BoundingBox: -234.0 108.0 846.0 684.0
%%EndComments
%%BeginProlog
/mpldict 8 dict def
mpldict begin
/m { moveto } bind def
/l { lineto } bind def
/r { rlineto } bind def
/c { curveto } bind def
/cl { closepath } bind def
/box {
m
1 index 0 r
0 exch r
neg 0 r
cl
} bind def
/clipbox {
box
clip
newpath
} bind def
%!PS-Adobe-3.0 Resource-Font
%%Title: DejaVu Sans
%%Copyright: Copyright (c) 2003 by Bitstream, Inc. All Rights Reserved. Copyright (c) 2006 by Tavmjong Bah. All Rights Reserved. DejaVu changes are in public domain 
%%Creator: Converted from TrueType to type 3 by PPR
25 dict begin
/_d{bind def}bind def
/_m{moveto}_d
/_l{lineto}_d
/_cl{closepath eofill}_d
/_c{curveto}_d
/_sc{7 -1 roll{setcachedevice}{pop pop pop pop pop pop}ifelse}_d
/_e{exec}_d
/FontName /DejaVuSans def
/PaintType 0 def
/FontMatrix[.001 0 0 .001 0 0]def
/FontBBox[-1021 -463 1793 1232]def
/FontType 3 def
/Encoding [ /space /quotesingle /zero /one /two /three /four /five /six /seven /eight /A /C /H /M /R /S /T /Z /bracketleft /bracketright /a /b /c /d /e /g /h /i /l /m /n /o /p /r /s /t /u /v /x /y /z /minus ] def
/FontInfo 10 dict dup begin
/FamilyName (DejaVu Sans) def
/FullName (DejaVu Sans) def
/Notice (Copyright (c) 2003 by Bitstream, Inc. All Rights Reserved. Copyright (c) 2006 by Tavmjong Bah. All Rights Reserved. DejaVu changes are in public domain ) def
/Weight (Book) def
/Version (Version 2.35) def
/ItalicAngle 0.0 def
/isFixedPitch false def
/UnderlinePosition -130 def
/UnderlineThickness 90 def
end readonly def
/CharStrings 44 dict dup begin
/.notdef 0 def
/space{318 0 0 0 0 0 _sc
}_d
/quotesingle{275 0 96 458 179 729 _sc
179 729 _m
179 458 _l
96 458 _l
96 729 _l
179 729 _l
_cl}_d
/zero{636 0 66 -13 570 742 _sc
318 664 _m
267 664 229 639 203 589 _c
177 539 165 464 165 364 _c
165 264 177 189 203 139 _c
229 89 267 64 318 64 _c
369 64 407 89 433 139 _c
458 189 471 264 471 364 _c
471 464 458 539 433 589 _c
407 639 369 664 318 664 _c
318 742 _m
399 742 461 709 505 645 _c
548 580 570 486 570 364 _c
570 241 548 147 505 83 _c
461 19 399 -13 318 -13 _c
236 -13 173 19 130 83 _c
87 147 66 241 66 364 _c
66 486 87 580 130 645 _c
173 709 236 742 318 742 _c
_cl}_d
/one{636 0 110 0 544 729 _sc
124 83 _m
285 83 _l
285 639 _l
110 604 _l
110 694 _l
284 729 _l
383 729 _l
383 83 _l
544 83 _l
544 0 _l
124 0 _l
124 83 _l
_cl}_d
/two{{636 0 73 0 536 742 _sc
192 83 _m
536 83 _l
536 0 _l
73 0 _l
73 83 _l
110 121 161 173 226 239 _c
290 304 331 346 348 365 _c
380 400 402 430 414 455 _c
426 479 433 504 433 528 _c
433 566 419 598 392 622 _c
365 646 330 659 286 659 _c
255 659 222 653 188 643 _c
154 632 117 616 78 594 _c
78 694 _l
118 710 155 722 189 730 _c
223 738 255 742 284 742 _c
}_e{359 742 419 723 464 685 _c
509 647 532 597 532 534 _c
532 504 526 475 515 449 _c
504 422 484 390 454 354 _c
446 344 420 317 376 272 _c
332 227 271 164 192 83 _c
_cl}_e}_d
/three{{636 0 76 -13 556 742 _sc
406 393 _m
453 383 490 362 516 330 _c
542 298 556 258 556 212 _c
556 140 531 84 482 45 _c
432 6 362 -13 271 -13 _c
240 -13 208 -10 176 -4 _c
144 1 110 10 76 22 _c
76 117 _l
103 101 133 89 166 81 _c
198 73 232 69 268 69 _c
330 69 377 81 409 105 _c
441 129 458 165 458 212 _c
458 254 443 288 413 312 _c
383 336 341 349 287 349 _c
}_e{202 349 _l
202 430 _l
291 430 _l
339 430 376 439 402 459 _c
428 478 441 506 441 543 _c
441 580 427 609 401 629 _c
374 649 336 659 287 659 _c
260 659 231 656 200 650 _c
169 644 135 635 98 623 _c
98 711 _l
135 721 170 729 203 734 _c
235 739 266 742 296 742 _c
370 742 429 725 473 691 _c
517 657 539 611 539 553 _c
539 513 527 479 504 451 _c
481 423 448 403 406 393 _c
_cl}_e}_d
/four{636 0 49 0 580 729 _sc
378 643 _m
129 254 _l
378 254 _l
378 643 _l
352 729 _m
476 729 _l
476 254 _l
580 254 _l
580 172 _l
476 172 _l
476 0 _l
378 0 _l
378 172 _l
49 172 _l
49 267 _l
352 729 _l
_cl}_d
/five{{636 0 77 -13 549 729 _sc
108 729 _m
495 729 _l
495 646 _l
198 646 _l
198 467 _l
212 472 227 476 241 478 _c
255 480 270 482 284 482 _c
365 482 429 459 477 415 _c
525 370 549 310 549 234 _c
549 155 524 94 475 51 _c
426 8 357 -13 269 -13 _c
238 -13 207 -10 175 -6 _c
143 -1 111 6 77 17 _c
77 116 _l
106 100 136 88 168 80 _c
199 72 232 69 267 69 _c
}_e{323 69 368 83 401 113 _c
433 143 450 183 450 234 _c
450 284 433 324 401 354 _c
368 384 323 399 267 399 _c
241 399 214 396 188 390 _c
162 384 135 375 108 363 _c
108 729 _l
_cl}_e}_d
/six{{636 0 70 -13 573 742 _sc
330 404 _m
286 404 251 388 225 358 _c
199 328 186 286 186 234 _c
186 181 199 139 225 109 _c
251 79 286 64 330 64 _c
374 64 409 79 435 109 _c
461 139 474 181 474 234 _c
474 286 461 328 435 358 _c
409 388 374 404 330 404 _c
526 713 _m
526 623 _l
501 635 476 644 451 650 _c
425 656 400 659 376 659 _c
310 659 260 637 226 593 _c
}_e{192 549 172 482 168 394 _c
187 422 211 444 240 459 _c
269 474 301 482 336 482 _c
409 482 467 459 509 415 _c
551 371 573 310 573 234 _c
573 159 550 99 506 54 _c
462 9 403 -13 330 -13 _c
246 -13 181 19 137 83 _c
92 147 70 241 70 364 _c
70 479 97 571 152 639 _c
206 707 280 742 372 742 _c
396 742 421 739 447 735 _c
472 730 498 723 526 713 _c
_cl}_e}_d
/seven{636 0 82 0 551 729 _sc
82 729 _m
551 729 _l
551 687 _l
286 0 _l
183 0 _l
432 646 _l
82 646 _l
82 729 _l
_cl}_d
/eight{{636 0 68 -13 568 742 _sc
318 346 _m
271 346 234 333 207 308 _c
180 283 167 249 167 205 _c
167 161 180 126 207 101 _c
234 76 271 64 318 64 _c
364 64 401 76 428 102 _c
455 127 469 161 469 205 _c
469 249 455 283 429 308 _c
402 333 365 346 318 346 _c
219 388 _m
177 398 144 418 120 447 _c
96 476 85 511 85 553 _c
85 611 105 657 147 691 _c
188 725 245 742 318 742 _c
}_e{390 742 447 725 489 691 _c
530 657 551 611 551 553 _c
551 511 539 476 515 447 _c
491 418 459 398 417 388 _c
464 377 501 355 528 323 _c
554 291 568 251 568 205 _c
568 134 546 80 503 43 _c
459 5 398 -13 318 -13 _c
237 -13 175 5 132 43 _c
89 80 68 134 68 205 _c
68 251 81 291 108 323 _c
134 355 171 377 219 388 _c
183 544 _m
183 506 194 476 218 455 _c
}_e{242 434 275 424 318 424 _c
360 424 393 434 417 455 _c
441 476 453 506 453 544 _c
453 582 441 611 417 632 _c
393 653 360 664 318 664 _c
275 664 242 653 218 632 _c
194 611 183 582 183 544 _c
_cl}_e}_d
/A{684 0 8 0 676 729 _sc
342 632 _m
208 269 _l
476 269 _l
342 632 _l
286 729 _m
398 729 _l
676 0 _l
573 0 _l
507 187 _l
178 187 _l
112 0 _l
8 0 _l
286 729 _l
_cl}_d
/C{{698 0 56 -13 644 742 _sc
644 673 _m
644 569 _l
610 599 575 622 537 638 _c
499 653 460 661 418 661 _c
334 661 270 635 226 584 _c
182 533 160 460 160 364 _c
160 268 182 194 226 143 _c
270 92 334 67 418 67 _c
460 67 499 74 537 90 _c
575 105 610 128 644 159 _c
644 56 _l
609 32 572 15 534 4 _c
496 -7 455 -13 412 -13 _c
302 -13 215 20 151 87 _c
}_e{87 154 56 246 56 364 _c
56 481 87 573 151 641 _c
215 708 302 742 412 742 _c
456 742 497 736 535 725 _c
573 713 610 696 644 673 _c
_cl}_e}_d
/H{752 0 98 0 654 729 _sc
98 729 _m
197 729 _l
197 430 _l
555 430 _l
555 729 _l
654 729 _l
654 0 _l
555 0 _l
555 347 _l
197 347 _l
197 0 _l
98 0 _l
98 729 _l
_cl}_d
/M{863 0 98 0 765 729 _sc
98 729 _m
245 729 _l
431 233 _l
618 729 _l
765 729 _l
765 0 _l
669 0 _l
669 640 _l
481 140 _l
382 140 _l
194 640 _l
194 0 _l
98 0 _l
98 729 _l
_cl}_d
/R{{695 0 98 0 666 729 _sc
444 342 _m
465 334 486 319 506 296 _c
526 272 546 240 566 199 _c
666 0 _l
560 0 _l
467 187 _l
443 235 419 268 397 284 _c
374 300 343 308 304 308 _c
197 308 _l
197 0 _l
98 0 _l
98 729 _l
321 729 _l
404 729 466 711 507 677 _c
548 642 569 589 569 519 _c
569 473 558 434 537 404 _c
515 374 484 353 444 342 _c
197 648 _m
197 389 _l
321 389 _l
}_e{368 389 404 400 428 422 _c
452 444 465 476 465 519 _c
465 561 452 593 428 615 _c
404 637 368 648 321 648 _c
197 648 _l
_cl}_e}_d
/S{{635 0 66 -13 579 742 _sc
535 705 _m
535 609 _l
497 627 462 640 429 649 _c
395 657 363 662 333 662 _c
279 662 237 651 208 631 _c
179 610 165 580 165 542 _c
165 510 174 485 194 469 _c
213 452 250 439 304 429 _c
364 417 _l
437 403 491 378 526 343 _c
561 307 579 260 579 201 _c
579 130 555 77 508 41 _c
460 5 391 -13 300 -13 _c
265 -13 228 -9 189 -2 _c
}_e{150 5 110 16 69 32 _c
69 134 _l
109 111 148 94 186 83 _c
224 71 262 66 300 66 _c
356 66 399 77 430 99 _c
460 121 476 152 476 194 _c
476 230 465 258 443 278 _c
421 298 385 313 335 323 _c
275 335 _l
201 349 148 372 115 404 _c
82 435 66 478 66 534 _c
66 598 88 649 134 686 _c
179 723 242 742 322 742 _c
356 742 390 739 426 733 _c
461 727 497 717 535 705 _c
}_e{_cl}_e}_d
/T{611 0 -2 0 614 729 _sc
-2 729 _m
614 729 _l
614 646 _l
355 646 _l
355 0 _l
256 0 _l
256 646 _l
-2 646 _l
-2 729 _l
_cl}_d
/Z{685 0 45 0 640 729 _sc
56 729 _m
629 729 _l
629 654 _l
168 83 _l
640 83 _l
640 0 _l
45 0 _l
45 75 _l
506 646 _l
56 646 _l
56 729 _l
_cl}_d
/bracketleft{390 0 86 -131 293 760 _sc
86 760 _m
293 760 _l
293 690 _l
176 690 _l
176 -61 _l
293 -61 _l
293 -131 _l
86 -131 _l
86 760 _l
_cl}_d
/bracketright{390 0 97 -131 304 760 _sc
304 760 _m
304 -131 _l
97 -131 _l
97 -61 _l
214 -61 _l
214 690 _l
97 690 _l
97 760 _l
304 760 _l
_cl}_d
/a{{613 0 60 -13 522 560 _sc
343 275 _m
270 275 220 266 192 250 _c
164 233 150 205 150 165 _c
150 133 160 107 181 89 _c
202 70 231 61 267 61 _c
317 61 357 78 387 114 _c
417 149 432 196 432 255 _c
432 275 _l
343 275 _l
522 312 _m
522 0 _l
432 0 _l
432 83 _l
411 49 385 25 355 10 _c
325 -5 287 -13 243 -13 _c
187 -13 142 2 109 33 _c
76 64 60 106 60 159 _c
}_e{60 220 80 266 122 298 _c
163 329 224 345 306 345 _c
432 345 _l
432 354 _l
432 395 418 427 391 450 _c
364 472 326 484 277 484 _c
245 484 215 480 185 472 _c
155 464 127 453 100 439 _c
100 522 _l
132 534 164 544 195 550 _c
226 556 256 560 286 560 _c
365 560 424 539 463 498 _c
502 457 522 395 522 312 _c
_cl}_e}_d
/b{{635 0 91 -13 580 760 _sc
487 273 _m
487 339 473 390 446 428 _c
418 466 381 485 334 485 _c
286 485 249 466 222 428 _c
194 390 181 339 181 273 _c
181 207 194 155 222 117 _c
249 79 286 61 334 61 _c
381 61 418 79 446 117 _c
473 155 487 207 487 273 _c
181 464 _m
199 496 223 520 252 536 _c
281 552 316 560 356 560 _c
422 560 476 533 518 481 _c
559 428 580 359 580 273 _c
}_e{580 187 559 117 518 65 _c
476 13 422 -13 356 -13 _c
316 -13 281 -5 252 10 _c
223 25 199 49 181 82 _c
181 0 _l
91 0 _l
91 760 _l
181 760 _l
181 464 _l
_cl}_e}_d
/c{{550 0 55 -13 488 560 _sc
488 526 _m
488 442 _l
462 456 437 466 411 473 _c
385 480 360 484 334 484 _c
276 484 230 465 198 428 _c
166 391 150 339 150 273 _c
150 206 166 154 198 117 _c
230 80 276 62 334 62 _c
360 62 385 65 411 72 _c
437 79 462 90 488 104 _c
488 21 _l
462 9 436 0 410 -5 _c
383 -10 354 -13 324 -13 _c
242 -13 176 12 128 64 _c
}_e{79 115 55 185 55 273 _c
55 362 79 432 128 483 _c
177 534 244 560 330 560 _c
358 560 385 557 411 551 _c
437 545 463 537 488 526 _c
_cl}_e}_d
/d{{635 0 55 -13 544 760 _sc
454 464 _m
454 760 _l
544 760 _l
544 0 _l
454 0 _l
454 82 _l
435 49 411 25 382 10 _c
353 -5 319 -13 279 -13 _c
213 -13 159 13 117 65 _c
75 117 55 187 55 273 _c
55 359 75 428 117 481 _c
159 533 213 560 279 560 _c
319 560 353 552 382 536 _c
411 520 435 496 454 464 _c
148 273 _m
148 207 161 155 188 117 _c
215 79 253 61 301 61 _c
}_e{348 61 385 79 413 117 _c
440 155 454 207 454 273 _c
454 339 440 390 413 428 _c
385 466 348 485 301 485 _c
253 485 215 466 188 428 _c
161 390 148 339 148 273 _c
_cl}_e}_d
/e{{615 0 55 -13 562 560 _sc
562 296 _m
562 252 _l
149 252 _l
153 190 171 142 205 110 _c
238 78 284 62 344 62 _c
378 62 412 66 444 74 _c
476 82 509 95 541 113 _c
541 28 _l
509 14 476 3 442 -3 _c
408 -9 373 -13 339 -13 _c
251 -13 182 12 131 62 _c
80 112 55 181 55 268 _c
55 357 79 428 127 481 _c
175 533 241 560 323 560 _c
397 560 455 536 498 489 _c
}_e{540 441 562 377 562 296 _c
472 322 _m
471 371 457 410 431 440 _c
404 469 368 484 324 484 _c
274 484 234 469 204 441 _c
174 413 156 373 152 322 _c
472 322 _l
_cl}_e}_d
/g{{635 0 55 -207 544 560 _sc
454 280 _m
454 344 440 395 414 431 _c
387 467 349 485 301 485 _c
253 485 215 467 188 431 _c
161 395 148 344 148 280 _c
148 215 161 165 188 129 _c
215 93 253 75 301 75 _c
349 75 387 93 414 129 _c
440 165 454 215 454 280 _c
544 68 _m
544 -24 523 -93 482 -139 _c
440 -184 377 -207 292 -207 _c
260 -207 231 -204 203 -200 _c
175 -195 147 -188 121 -178 _c
}_e{121 -91 _l
147 -105 173 -115 199 -122 _c
225 -129 251 -133 278 -133 _c
336 -133 380 -117 410 -87 _c
439 -56 454 -10 454 52 _c
454 96 _l
435 64 411 40 382 24 _c
353 8 319 0 279 0 _c
211 0 157 25 116 76 _c
75 127 55 195 55 280 _c
55 364 75 432 116 483 _c
157 534 211 560 279 560 _c
319 560 353 552 382 536 _c
411 520 435 496 454 464 _c
454 547 _l
544 547 _l
}_e{544 68 _l
_cl}_e}_d
/h{634 0 91 0 549 760 _sc
549 330 _m
549 0 _l
459 0 _l
459 327 _l
459 379 448 417 428 443 _c
408 469 378 482 338 482 _c
289 482 251 466 223 435 _c
195 404 181 362 181 309 _c
181 0 _l
91 0 _l
91 760 _l
181 760 _l
181 462 _l
202 494 227 519 257 535 _c
286 551 320 560 358 560 _c
420 560 468 540 500 501 _c
532 462 549 405 549 330 _c
_cl}_d
/i{278 0 94 0 184 760 _sc
94 547 _m
184 547 _l
184 0 _l
94 0 _l
94 547 _l
94 760 _m
184 760 _l
184 646 _l
94 646 _l
94 760 _l
_cl}_d
/l{278 0 94 0 184 760 _sc
94 760 _m
184 760 _l
184 0 _l
94 0 _l
94 760 _l
_cl}_d
/m{{974 0 91 0 889 560 _sc
520 442 _m
542 482 569 511 600 531 _c
631 550 668 560 711 560 _c
767 560 811 540 842 500 _c
873 460 889 403 889 330 _c
889 0 _l
799 0 _l
799 327 _l
799 379 789 418 771 444 _c
752 469 724 482 686 482 _c
639 482 602 466 575 435 _c
548 404 535 362 535 309 _c
535 0 _l
445 0 _l
445 327 _l
445 379 435 418 417 444 _c
398 469 369 482 331 482 _c
}_e{285 482 248 466 221 435 _c
194 404 181 362 181 309 _c
181 0 _l
91 0 _l
91 547 _l
181 547 _l
181 462 _l
201 495 226 520 255 536 _c
283 552 317 560 357 560 _c
397 560 430 550 458 530 _c
486 510 506 480 520 442 _c
_cl}_e}_d
/n{634 0 91 0 549 560 _sc
549 330 _m
549 0 _l
459 0 _l
459 327 _l
459 379 448 417 428 443 _c
408 469 378 482 338 482 _c
289 482 251 466 223 435 _c
195 404 181 362 181 309 _c
181 0 _l
91 0 _l
91 547 _l
181 547 _l
181 462 _l
202 494 227 519 257 535 _c
286 551 320 560 358 560 _c
420 560 468 540 500 501 _c
532 462 549 405 549 330 _c
_cl}_d
/o{612 0 55 -13 557 560 _sc
306 484 _m
258 484 220 465 192 427 _c
164 389 150 338 150 273 _c
150 207 163 156 191 118 _c
219 80 257 62 306 62 _c
354 62 392 80 420 118 _c
448 156 462 207 462 273 _c
462 337 448 389 420 427 _c
392 465 354 484 306 484 _c
306 560 _m
384 560 445 534 490 484 _c
534 433 557 363 557 273 _c
557 183 534 113 490 63 _c
445 12 384 -13 306 -13 _c
227 -13 165 12 121 63 _c
77 113 55 183 55 273 _c
55 363 77 433 121 484 _c
165 534 227 560 306 560 _c
_cl}_d
/p{{635 0 91 -207 580 560 _sc
181 82 _m
181 -207 _l
91 -207 _l
91 547 _l
181 547 _l
181 464 _l
199 496 223 520 252 536 _c
281 552 316 560 356 560 _c
422 560 476 533 518 481 _c
559 428 580 359 580 273 _c
580 187 559 117 518 65 _c
476 13 422 -13 356 -13 _c
316 -13 281 -5 252 10 _c
223 25 199 49 181 82 _c
487 273 _m
487 339 473 390 446 428 _c
418 466 381 485 334 485 _c
}_e{286 485 249 466 222 428 _c
194 390 181 339 181 273 _c
181 207 194 155 222 117 _c
249 79 286 61 334 61 _c
381 61 418 79 446 117 _c
473 155 487 207 487 273 _c
_cl}_e}_d
/r{411 0 91 0 411 560 _sc
411 463 _m
401 469 390 473 378 476 _c
366 478 353 480 339 480 _c
288 480 249 463 222 430 _c
194 397 181 350 181 288 _c
181 0 _l
91 0 _l
91 547 _l
181 547 _l
181 462 _l
199 495 224 520 254 536 _c
284 552 321 560 365 560 _c
371 560 378 559 386 559 _c
393 558 401 557 411 555 _c
411 463 _l
_cl}_d
/s{{521 0 54 -13 472 560 _sc
443 531 _m
443 446 _l
417 458 391 468 364 475 _c
336 481 308 485 279 485 _c
234 485 200 478 178 464 _c
156 450 145 430 145 403 _c
145 382 153 366 169 354 _c
185 342 217 330 265 320 _c
296 313 _l
360 299 405 279 432 255 _c
458 230 472 195 472 151 _c
472 100 452 60 412 31 _c
372 1 316 -13 246 -13 _c
216 -13 186 -10 154 -5 _c
}_e{122 0 89 8 54 20 _c
54 113 _l
87 95 120 82 152 74 _c
184 65 216 61 248 61 _c
290 61 323 68 346 82 _c
368 96 380 117 380 144 _c
380 168 371 187 355 200 _c
339 213 303 226 247 238 _c
216 245 _l
160 257 119 275 95 299 _c
70 323 58 356 58 399 _c
58 450 76 490 112 518 _c
148 546 200 560 268 560 _c
301 560 332 557 362 552 _c
391 547 418 540 443 531 _c
}_e{_cl}_e}_d
/t{392 0 27 0 368 702 _sc
183 702 _m
183 547 _l
368 547 _l
368 477 _l
183 477 _l
183 180 _l
183 135 189 106 201 94 _c
213 81 238 75 276 75 _c
368 75 _l
368 0 _l
276 0 _l
206 0 158 13 132 39 _c
106 65 93 112 93 180 _c
93 477 _l
27 477 _l
27 547 _l
93 547 _l
93 702 _l
183 702 _l
_cl}_d
/u{634 0 85 -13 543 560 _sc
85 216 _m
85 547 _l
175 547 _l
175 219 _l
175 167 185 129 205 103 _c
225 77 255 64 296 64 _c
344 64 383 79 411 110 _c
439 141 453 183 453 237 _c
453 547 _l
543 547 _l
543 0 _l
453 0 _l
453 84 _l
431 50 405 26 377 10 _c
348 -5 315 -13 277 -13 _c
214 -13 166 6 134 45 _c
101 83 85 140 85 216 _c
311 560 _m
311 560 _l
_cl}_d
/v{592 0 30 0 562 547 _sc
30 547 _m
125 547 _l
296 88 _l
467 547 _l
562 547 _l
357 0 _l
235 0 _l
30 547 _l
_cl}_d
/x{592 0 29 0 559 547 _sc
549 547 _m
351 281 _l
559 0 _l
453 0 _l
294 215 _l
135 0 _l
29 0 _l
241 286 _l
47 547 _l
153 547 _l
298 352 _l
443 547 _l
549 547 _l
_cl}_d
/y{592 0 30 -207 562 547 _sc
322 -50 _m
296 -114 271 -157 247 -177 _c
223 -197 191 -207 151 -207 _c
79 -207 _l
79 -132 _l
132 -132 _l
156 -132 175 -126 189 -114 _c
203 -102 218 -75 235 -31 _c
251 9 _l
30 547 _l
125 547 _l
296 119 _l
467 547 _l
562 547 _l
322 -50 _l
_cl}_d
/z{525 0 43 0 482 547 _sc
55 547 _m
482 547 _l
482 465 _l
144 72 _l
482 72 _l
482 0 _l
43 0 _l
43 82 _l
381 475 _l
55 475 _l
55 547 _l
_cl}_d
/minus{838 0 106 272 732 355 _sc
106 355 _m
732 355 _l
732 272 _l
106 272 _l
106 355 _l
_cl}_d
end readonly def

/BuildGlyph
 {exch begin
 CharStrings exch
 2 copy known not{pop /.notdef}if
 true 3 1 roll get exec
 end}_d

/BuildChar {
 1 index /Encoding get exch get
 1 index /BuildGlyph get exec
}_d

FontName currentdict end definefont pop
end
%%EndProlog
mpldict begin
-234 108 translate
1080 576 0 0 clipbox
gsave
0 0 m
1080 0 l
1080 576 l
0 576 l
cl
1.000 setgray
fill
grestore
gsave
135 72 m
972 72 l
972 506.88 l
135 506.88 l
cl
1.000 setgray
fill
grestore
0.800 setlinewidth
1 setlinejoin
0 setlinecap
[] 0 setdash
0.000 setgray
gsave
/o {
gsave
newpath
translate
0.8 setlinewidth
1 setlinejoin
0 setlinecap
0 0 m
0 -3.5 l

gsave
0.000 setgray
fill
grestore
stroke
grestore
} bind def
135 72 o
grestore
/DejaVuSans findfont
16.000 scalefont
setfont
gsave
129.906250 52.843750 translate
0.000000 rotate
0.000000 0 m /zero glyphshow
grestore
gsave
/o {
gsave
newpath
translate
0.8 setlinewidth
1 setlinejoin
0 setlinecap
0 0 m
0 -3.5 l

gsave
0.000 setgray
fill
grestore
stroke
grestore
} bind def
263.769 72 o
grestore
gsave
243.394231 52.843750 translate
0.000000 rotate
0.000000 0 m /two glyphshow
10.179688 0 m /zero glyphshow
20.359375 0 m /zero glyphshow
30.539062 0 m /zero glyphshow
grestore
gsave
/o {
gsave
newpath
translate
0.8 setlinewidth
1 setlinejoin
0 setlinecap
0 0 m
0 -3.5 l

gsave
0.000 setgray
fill
grestore
stroke
grestore
} bind def
392.538 72 o
grestore
gsave
372.163462 52.843750 translate
0.000000 rotate
0.000000 0 m /four glyphshow
10.179688 0 m /zero glyphshow
20.359375 0 m /zero glyphshow
30.539062 0 m /zero glyphshow
grestore
gsave
/o {
gsave
newpath
translate
0.8 setlinewidth
1 setlinejoin
0 setlinecap
0 0 m
0 -3.5 l

gsave
0.000 setgray
fill
grestore
stroke
grestore
} bind def
521.308 72 o
grestore
gsave
500.932692 52.843750 translate
0.000000 rotate
0.000000 0 m /six glyphshow
10.179688 0 m /zero glyphshow
20.359375 0 m /zero glyphshow
30.539062 0 m /zero glyphshow
grestore
gsave
/o {
gsave
newpath
translate
0.8 setlinewidth
1 setlinejoin
0 setlinecap
0 0 m
0 -3.5 l

gsave
0.000 setgray
fill
grestore
stroke
grestore
} bind def
650.077 72 o
grestore
gsave
629.701923 52.843750 translate
0.000000 rotate
0.000000 0 m /eight glyphshow
10.179688 0 m /zero glyphshow
20.359375 0 m /zero glyphshow
30.539062 0 m /zero glyphshow
grestore
gsave
/o {
gsave
newpath
translate
0.8 setlinewidth
1 setlinejoin
0 setlinecap
0 0 m
0 -3.5 l

gsave
0.000 setgray
fill
grestore
stroke
grestore
} bind def
778.846 72 o
grestore
gsave
753.377404 52.843750 translate
0.000000 rotate
0.000000 0 m /one glyphshow
10.179688 0 m /zero glyphshow
20.359375 0 m /zero glyphshow
30.539062 0 m /zero glyphshow
40.718750 0 m /zero glyphshow
grestore
gsave
/o {
gsave
newpath
translate
0.8 setlinewidth
1 setlinejoin
0 setlinecap
0 0 m
0 -3.5 l

gsave
0.000 setgray
fill
grestore
stroke
grestore
} bind def
907.615 72 o
grestore
gsave
882.146635 52.843750 translate
0.000000 rotate
0.000000 0 m /one glyphshow
10.179688 0 m /two glyphshow
20.359375 0 m /zero glyphshow
30.539062 0 m /zero glyphshow
40.718750 0 m /zero glyphshow
grestore
gsave
513.148438 33.359375 translate
0.000000 rotate
0.000000 0 m /T glyphshow
9.273438 0 m /i glyphshow
13.718750 0 m /m glyphshow
29.304688 0 m /e glyphshow
39.148438 0 m /space glyphshow
44.234375 0 m /bracketleft glyphshow
50.476562 0 m /m glyphshow
66.062500 0 m /s glyphshow
74.398438 0 m /bracketright glyphshow
grestore
gsave
/o {
gsave
newpath
translate
0.8 setlinewidth
1 setlinejoin
0 setlinecap
0 0 m
-3.5 0 l

gsave
0.000 setgray
fill
grestore
stroke
grestore
} bind def
135 100.992 o
grestore
gsave
104.406250 94.913875 translate
0.000000 rotate
0.000000 0 m /minus glyphshow
13.406250 0 m /two glyphshow
grestore
gsave
/o {
gsave
newpath
translate
0.8 setlinewidth
1 setlinejoin
0 setlinecap
0 0 m
-3.5 0 l

gsave
0.000 setgray
fill
grestore
stroke
grestore
} bind def
135 158.976 o
grestore
gsave
104.406250 152.897875 translate
0.000000 rotate
0.000000 0 m /minus glyphshow
13.406250 0 m /one glyphshow
grestore
gsave
/o {
gsave
newpath
translate
0.8 setlinewidth
1 setlinejoin
0 setlinecap
0 0 m
-3.5 0 l

gsave
0.000 setgray
fill
grestore
stroke
grestore
} bind def
135 216.96 o
grestore
gsave
117.812500 210.881875 translate
0.000000 rotate
0.000000 0 m /zero glyphshow
grestore
gsave
/o {
gsave
newpath
translate
0.8 setlinewidth
1 setlinejoin
0 setlinecap
0 0 m
-3.5 0 l

gsave
0.000 setgray
fill
grestore
stroke
grestore
} bind def
135 274.944 o
grestore
gsave
117.812500 268.865875 translate
0.000000 rotate
0.000000 0 m /one glyphshow
grestore
gsave
/o {
gsave
newpath
translate
0.8 setlinewidth
1 setlinejoin
0 setlinecap
0 0 m
-3.5 0 l

gsave
0.000 setgray
fill
grestore
stroke
grestore
} bind def
135 332.928 o
grestore
gsave
117.812500 326.849875 translate
0.000000 rotate
0.000000 0 m /two glyphshow
grestore
gsave
/o {
gsave
newpath
translate
0.8 setlinewidth
1 setlinejoin
0 setlinecap
0 0 m
-3.5 0 l

gsave
0.000 setgray
fill
grestore
stroke
grestore
} bind def
135 390.912 o
grestore
gsave
117.812500 384.833875 translate
0.000000 rotate
0.000000 0 m /three glyphshow
grestore
gsave
/o {
gsave
newpath
translate
0.8 setlinewidth
1 setlinejoin
0 setlinecap
0 0 m
-3.5 0 l

gsave
0.000 setgray
fill
grestore
stroke
grestore
} bind def
135 448.896 o
grestore
gsave
117.812500 442.817875 translate
0.000000 rotate
0.000000 0 m /four glyphshow
grestore
gsave
/o {
gsave
newpath
translate
0.8 setlinewidth
1 setlinejoin
0 setlinecap
0 0 m
-3.5 0 l

gsave
0.000 setgray
fill
grestore
stroke
grestore
} bind def
135 506.88 o
grestore
gsave
117.812500 500.801875 translate
0.000000 rotate
0.000000 0 m /five glyphshow
grestore
gsave
97.078125 205.479062 translate
90.000000 rotate
0.000000 0 m /A glyphshow
10.945312 0 m /n glyphshow
21.085938 0 m /g glyphshow
31.242188 0 m /u glyphshow
41.382812 0 m /l glyphshow
45.828125 0 m /a glyphshow
55.632812 0 m /r glyphshow
62.210938 0 m /space glyphshow
67.296875 0 m /v glyphshow
76.765625 0 m /e glyphshow
86.609375 0 m /l glyphshow
91.054688 0 m /o glyphshow
100.843750 0 m /c glyphshow
109.640625 0 m /i glyphshow
114.085938 0 m /t glyphshow
120.359375 0 m /y glyphshow
129.828125 0 m /space glyphshow
134.914062 0 m /bracketleft glyphshow
141.156250 0 m /H glyphshow
153.187500 0 m /z glyphshow
161.585938 0 m /bracketright glyphshow
grestore
2.000 setlinewidth
2 setlinecap
0.122 0.467 0.706 setrgbcolor
gsave
837 434.9 135 72 clipbox
134.742462 217.008878 m
141.824769 216.997841 l
146.589231 216.988381 l
152.512615 216.97892 l
157.019538 216.988381 l
162.878538 216.988381 l
166.355308 216.988381 l
173.630769 216.997841 l
175.819846 216.988381 l
180.198 216.988381 l
254.369077 217.084559 l
255.012923 217.239075 l
257.266385 218.971863 l
257.910231 220.039285 l
260.099308 221.800453 l
260.936308 223.12803 l
262.288385 224.726798 l
263.125385 226.48639 l
264.413077 227.776126 l
266.344615 229.450576 l
267.052846 229.903087 l
268.340538 231.173903 l
269.306308 232.165644 l
270.014538 232.550358 l
270.658385 233.964653 l
272.203615 234.898056 l
272.847462 235.985976 l
274.199538 236.764863 l
275.551615 237.852782 l
276.581769 239.487815 l
277.225615 239.487815 l
277.869462 240.430678 l
279.414692 241.307321 l
280.058538 242.846175 l
281.990077 244.262047 l
285.080538 247.235693 l
286.497 248.052421 l
287.784692 249.391035 l
288.621692 250.594053 l
290.360077 252.036728 l
291.068308 252.306343 l
291.712154 253.422643 l
292.613538 253.952413 l
293.257385 254.557863 l
293.965615 255.809759 l
294.738231 256.290651 l
296.154692 257.542547 l
297.828692 259.341555 l
299.953385 260.861489 l
300.597231 261.775972 l
302.142462 263.037328 l
302.850692 264.200929 l
304.782231 265.385026 l
305.490462 266.048815 l
306.134308 267.242373 l
307.679538 268.156856 l
308.387769 269.003541 l
310.705615 271.100545 l
311.993308 271.871549 l
312.701538 272.458079 l
313.474154 273.949632 l
314.182385 274.362726 l
314.826231 274.57558 l
315.534462 275.469566 l
316.307077 276.220073 l
317.272846 277.577607 l
318.689308 278.241395 l
319.397538 279.63677 l
320.105769 280.426694 l
321.522231 281.099943 l
322.166077 282.110604 l
323.003077 282.908412 l
325.385308 284.545021 l
326.029154 285.20881 l
326.673 286.690903 l
328.089462 287.528128 l
328.733308 288.02794 l
329.441538 288.914042 l
330.664846 289.732347 l
333.369 292.300783 l
334.012846 293.205805 l
334.656692 293.918471 l
335.944385 294.659518 l
336.910154 295.919297 l
339.678692 298.278032 l
340.386923 298.479849 l
341.867769 300.039201 l
343.606154 301.193341 l
344.25 302.040026 l
344.958231 303.348683 l
345.666462 303.801194 l
346.954154 305.379466 l
347.598 305.6207 l
349.143231 307.121713 l
350.173385 308.43983 l
350.817231 309.065778 l
351.461077 309.497792 l
353.457 311.605833 l
354.744692 312.654335 l
355.517308 313.50102 l
356.547462 314.820714 l
358.092692 315.099789 l
358.800923 316.369028 l
360.217385 317.004436 l
360.99 318.111276 l
361.633846 318.525947 l
363.372231 320.545693 l
364.016077 320.854725 l
364.659923 321.72033 l
366.655846 323.807874 l
367.364077 324.126366 l
368.007923 324.578878 l
369.617538 326.973877 l
370.261385 326.973877 l
370.905231 328.176895 l
371.742231 328.966819 l
372.386077 329.255355 l
373.029923 329.389374 l
373.673769 330.564011 l
374.510769 330.843086 l
376.893 332.91171 l
377.536846 333.730014 l
379.725923 335.346126 l
380.369769 336.66582 l
381.786231 337.695402 l
383.395846 338.310313 l
386.872615 338.570467 l
387.516462 338.147913 l
388.160308 337.935059 l
389.190462 337.714322 l
390.027462 337.81996 l
390.671308 337.618144 l
392.023385 337.521965 l
392.667231 337.425787 l
393.439846 337.521965 l
394.148077 337.444707 l
394.791923 337.637064 l
395.950846 337.685941 l
396.723462 337.878298 l
398.011154 337.733242 l
401.552308 337.79158 l
402.582462 337.868838 l
403.290692 338.080115 l
403.934538 338.031238 l
404.642769 338.176293 l
405.930462 337.723782 l
406.638692 337.569266 l
407.346923 337.25235 l
408.055154 337.156172 l
409.020923 337.655984 l
409.664769 337.733242 l
410.501769 337.685941 l
411.145615 337.829421 l
414.558 337.723782 l
415.652538 337.993397 l
420.095077 337.857801 l
420.803308 337.906679 l
421.575923 337.646524 l
422.606077 337.463627 l
423.378692 337.482548 l
424.795154 337.81996 l
426.082846 337.714322 l
426.791077 337.80104 l
428.336308 337.194013 l
429.237692 337.146712 l
431.941846 338.397031 l
434.002154 337.906679 l
434.646 337.637064 l
435.869308 337.559806 l
436.706308 337.887758 l
437.350154 337.993397 l
438.122769 337.752163 l
438.766615 337.695402 l
439.474846 337.473088 l
440.183077 337.599223 l
440.955692 337.386369 l
443.917385 337.655984 l
444.561231 338.108496 l
445.848923 337.848341 l
446.557154 337.974477 l
447.844846 337.655984 l
449.325692 337.674905 l
450.355846 337.935059 l
450.999692 337.897219 l
451.707923 337.993397 l
452.416154 337.733242 l
453.06 337.704862 l
455.120308 337.320148 l
456.021692 337.271271 l
459.949154 337.993397 l
460.657385 337.80104 l
462.782077 337.965016 l
463.747846 337.761623 l
464.456077 337.944519 l
465.099923 337.714322 l
466.387615 337.974477 l
468.383538 337.473088 l
470.057538 337.646524 l
473.663077 337.618144 l
474.435692 337.599223 l
475.143923 337.906679 l
475.852154 337.878298 l
476.882308 338.061195 l
477.590538 338.051735 l
478.234385 337.848341 l
479.650846 337.618144 l
480.938538 337.271271 l
481.582385 337.406866 l
482.290615 338.147913 l
485.316692 337.618144 l
486.668769 337.203473 l
487.441385 337.24289 l
488.085231 337.444707 l
489.759231 338.253552 l
490.403077 338.117956 l
491.111308 337.848341 l
493.236 337.521965 l
496.455231 338.031238 l
497.163462 337.993397 l
498.515538 337.752163 l
501.155308 337.435247 l
503.473154 337.906679 l
504.760846 337.80104 l
506.949923 337.261811 l
507.658154 337.203473 l
508.302 337.416327 l
509.332154 338.031238 l
510.040385 338.108496 l
510.748615 338.070655 l
511.392462 338.185754 l
512.100692 338.176293 l
512.744538 337.838881 l
514.096615 337.531425 l
515.899385 337.674905 l
516.607615 337.944519 l
517.251462 337.80104 l
517.895308 337.531425 l
518.539154 337.503045 l
519.826846 337.742702 l
521.307692 337.512505 l
522.273462 337.655984 l
523.110462 337.637064 l
523.818692 337.878298 l
525.943385 337.887758 l
528.003692 337.955556 l
529.033846 337.714322 l
530.321538 337.77266 l
531.029769 337.569266 l
532.510615 337.733242 l
533.798308 337.386369 l
534.635308 337.310688 l
535.601077 337.531425 l
536.244923 337.531425 l
536.888769 337.78212 l
540.365538 338.089575 l
541.138154 337.897219 l
542.103923 337.897219 l
544.293 337.531425 l
545.001231 337.723782 l
546.417692 337.761623 l
547.061538 337.848341 l
551.182154 337.569266 l
551.954769 337.665444 l
552.598615 337.550346 l
553.306846 337.77266 l
554.079462 337.742702 l
554.787692 337.974477 l
556.526077 337.897219 l
557.942538 337.685941 l
558.650769 337.655984 l
559.423385 337.473088 l
560.839846 337.348529 l
562.320692 338.061195 l
565.089231 337.521965 l
569.338615 337.965016 l
571.463308 337.704862 l
572.879769 337.637064 l
575.262 337.848341 l
575.905846 337.714322 l
577.322308 337.906679 l
580.090846 337.540886 l
582.923769 337.8105 l
584.275846 337.752163 l
585.048462 337.23343 l
585.692308 330.207678 l
586.400538 320.306035 l
587.237538 323.568217 l
587.945769 329.813504 l
588.911538 339.513331 l
590.263615 339.994223 l
590.971846 338.021777 l
592.388308 337.348529 l
593.676 337.77266 l
594.770538 337.78212 l
596.251385 338.310313 l
596.895231 338.91734 l
597.539077 339.100237 l
598.182923 339.013518 l
598.955538 339.147537 l
599.663769 339.513331 l
600.500769 339.705687 l
601.466538 339.320974 l
602.239154 341.206701 l
602.883 347.73264 l
603.526846 351.996023 l
604.170692 353.121783 l
604.943308 353.29522 l
605.651538 353.246342 l
606.939231 350.945944 l
607.969385 350.148137 l
608.613231 349.95578 l
609.257077 349.060217 l
610.544769 347.943918 l
611.317385 347.30851 l
612.025615 344.604478 l
612.669462 342.709291 l
614.279077 336.616942 l
614.922923 336.337867 l
615.631154 335.789178 l
616.339385 323.336442 l
617.047615 315.791958 l
617.755846 313.357541 l
618.464077 313.040626 l
619.172308 312.126143 l
619.816154 308.526548 l
620.910692 303.561537 l
621.618923 303.503199 l
622.327154 304.244245 l
622.971 304.591118 l
623.614846 304.551701 l
624.323077 304.6668 l
626.512154 304.204828 l
627.542308 304.455523 l
629.538231 303.906833 l
630.182077 304.359344 l
632.435538 303.753893 l
641.513769 303.974631 l
643.445308 304.10865 l
645.634385 304.042429 l
646.407 304.185908 l
652.716692 304.09919 l
653.360538 304.138607 l
654.970154 304.012471 l
657.159231 304.042429 l
659.155154 303.93679 l
659.927769 303.993551 l
662.31 303.93679 l
663.726462 303.93679 l
665.786769 303.859532 l
668.233385 303.810654 l
681.303462 303.522119 l
683.428154 303.503199 l
689.158385 303.37864 l
693.472154 303.282462 l
702.228462 303.069608 l
703.644923 303.099565 l
704.932615 303.003387 l
718.839692 302.82049 l
720.256154 302.83941 l
720.9 302.762152 l
722.895923 302.809453 l
739.571538 302.694355 l
741.825 302.656514 l
746.138769 302.684894 l
748.778538 302.665974 l
752.512846 302.656514 l
753.156692 302.724312 l
754.573154 302.675434 l
761.462308 302.724312 l
772.794 302.82049 l
775.111846 302.83941 l
778.266692 302.867791 l
780.906462 302.367979 l
782.709231 302.358519 l
783.353077 302.377439 l
784.640769 303.079068 l
785.284615 302.83941 l
785.992846 302.42474 l
789.598385 298.248075 l
790.306615 297.969 l
791.079231 299.345455 l
793.139538 296.718681 l
793.912154 296.304011 l
794.684769 296.073813 l
795.714923 295.968175 l
796.358769 296.390729 l
797.260154 293.956312 l
797.904 294.774617 l
798.612231 299.846844 l
799.320462 303.271425 l
800.028692 303.733396 l
800.672538 303.723936 l
801.573923 304.312043 l
802.926 304.291546 l
804.406846 303.984091 l
805.050692 304.003011 l
805.758923 303.820115 l
806.467154 303.878452 l
807.175385 303.39756 l
808.269923 302.2718 l
808.913769 301.953308 l
809.622 302.126744 l
810.459 303.060148 l
811.102846 304.244245 l
811.746692 304.398762 l
812.390538 304.234785 l
813.742615 304.157527 l
814.837154 303.282462 l
815.481 303.195743 l
816.833077 303.271425 l
818.249538 303.186283 l
818.893385 303.329763 l
819.537231 303.282462 l
820.245462 303.109025 l
821.275615 303.646678 l
823.335923 303.589917 l
823.979769 303.358143 l
824.688 303.320302 l
827.778462 303.618298 l
829.130538 303.637218 l
830.482615 303.733396 l
851.150077 303.627758 l
857.781692 303.512659 l
874.714846 303.416481 l
876.710769 303.367603 l
881.668385 303.271425 l
889.845231 303.195743 l
892.806923 303.127946 l
894.931615 303.069608 l
902.593385 302.916668 l
904.846846 302.896171 l
912.766154 302.771613 l
914.697692 302.733772 l
923.067692 302.665974 l
925.192385 302.626557 l
939.163846 302.492538 l
940.966615 302.511458 l
947.984538 302.4342 l
952.620231 302.483077 l
959.573769 302.464157 l
963.114923 302.511458 l
966.269769 302.501998 l
968.394462 302.501998 l
972.708231 302.511458 l
972.708231 302.511458 l
stroke
grestore
1.000 0.498 0.055 setrgbcolor
gsave
837 434.9 135 72 clipbox
136.995923 216.96 m
254.433462 216.96 l
255.592385 217.262 l
256.751308 218.1076 l
257.459538 218.772 l
259.197923 221.0672 l
262.224 224.9932 l
265.250077 228.4964 l
265.829538 229.4024 l
266.409 230.0668 l
267.567923 230.9728 l
268.726846 232.1808 l
269.885769 233.8116 l
271.044692 234.778 l
271.624154 235.4424 l
272.783077 237.1336 l
273.362538 237.7376 l
273.942 238.0396 l
275.680385 240.214 l
276.839308 241.1804 l
277.418769 242.328 l
278.706462 243.536 l
279.865385 245.1064 l
281.024308 246.0728 l
281.603769 247.0996 l
282.183231 247.4016 l
282.762692 247.8848 l
283.342154 248.9116 l
284.501077 250.18 l
285.080538 251.086 l
285.788769 251.6296 l
286.947692 253.0792 l
287.527154 253.3812 l
288.106615 254.2268 l
289.265538 255.5556 l
289.845 256.4012 l
290.424462 256.7032 l
291.003923 257.73 l
292.162846 258.938 l
292.742308 259.6024 l
293.321769 259.9648 l
294.03 260.9312 l
294.609462 261.2936 l
295.188923 262.3808 l
295.768385 262.8036 l
296.476615 263.8304 l
297.056077 264.2532 l
297.635538 265.0384 l
298.215 265.4008 l
298.794462 266.2464 l
299.373923 266.8504 l
301.112308 269.0852 l
301.691769 269.5684 l
302.271231 270.2932 l
303.430154 271.5012 l
305.168538 273.7964 l
306.456231 274.8836 l
307.035692 275.7896 l
307.615154 276.2124 l
308.323385 276.9372 l
308.902846 277.7224 l
309.482308 278.266 l
310.061769 279.172 l
310.641231 279.8364 l
311.349462 280.38 l
313.216615 282.5544 l
315.534462 285.0912 l
316.693385 286.5408 l
317.272846 287.1448 l
317.852308 287.9904 l
321.908538 292.3392 l
323.196231 293.97 l
325.514077 296.2652 l
326.093538 297.292 l
327.252462 298.3792 l
328.990846 300.614 l
329.570308 301.0368 l
330.149769 301.8824 l
330.729231 302.3052 l
332.016923 303.936 l
332.596385 304.4796 l
333.175846 305.2044 l
333.755308 305.6876 l
334.334769 306.5332 l
334.914231 307.0164 l
335.493692 307.862 l
336.201923 308.466 l
336.781385 309.372 l
337.940308 310.5196 l
341.095154 314.1436 l
341.674615 314.6268 l
342.254077 315.5328 l
342.833538 315.8348 l
343.413 316.8616 l
344.700692 318.0092 l
345.280154 318.7944 l
345.988385 319.3984 l
346.567846 320.3648 l
347.726769 321.5124 l
348.306231 322.4788 l
348.885692 322.7808 l
349.465154 323.4452 l
350.173385 324.5324 l
351.332308 325.5592 l
352.491231 326.9484 l
353.199462 327.6732 l
353.778923 328.7 l
354.487154 329.1832 l
355.066615 329.8476 l
355.774846 330.9348 l
357.513231 332.626 l
358.221462 333.6528 l
359.509154 334.6796 l
360.668077 336.4916 l
361.376308 336.9144 l
361.955769 336.854 l
363.694154 337.8204 l
364.273615 337.76 l
364.853077 337.458 l
365.561308 337.458 l
366.140769 337.8204 l
366.720231 337.9412 l
367.879154 337.458 l
369.166846 337.8808 l
370.905231 337.3976 l
372.064154 338.0016 l
372.643615 337.9412 l
373.223077 337.5788 l
373.802538 337.5184 l
374.961462 338.0016 l
375.540923 337.6996 l
376.828615 337.5184 l
377.408077 337.8204 l
377.987538 337.9412 l
378.567 337.5788 l
379.146462 337.3976 l
379.725923 337.5788 l
380.434154 337.9412 l
381.013615 337.8204 l
381.593077 337.5788 l
382.752 337.76 l
383.460231 338.062 l
384.039692 337.8808 l
384.619154 337.5788 l
385.198615 337.6996 l
385.778077 337.9412 l
386.357538 338.0016 l
386.937 337.5788 l
387.516462 337.5184 l
388.675385 337.8808 l
389.254846 337.8808 l
390.413769 337.5788 l
391.701462 337.9412 l
392.280923 337.8808 l
392.860385 337.5184 l
393.439846 337.5788 l
394.019308 337.8204 l
394.598769 337.9412 l
395.886462 337.3976 l
396.465923 337.5184 l
397.045385 337.9412 l
397.624846 337.9412 l
398.204308 337.6392 l
398.783769 337.5184 l
399.363231 337.8204 l
400.071462 338.062 l
400.650923 337.76 l
401.938615 337.458 l
402.518077 337.76 l
403.226308 337.9412 l
404.385231 337.3976 l
404.964692 337.5788 l
405.544154 337.9412 l
406.831846 337.5788 l
407.411308 337.6392 l
408.699 338.062 l
409.986692 337.5184 l
410.566154 337.5184 l
411.145615 337.8204 l
411.725077 337.8204 l
412.304538 337.5184 l
413.463462 337.5788 l
414.042923 337.8808 l
414.622385 337.8808 l
415.201846 337.5788 l
415.781308 337.458 l
416.940231 338.062 l
417.648462 337.8808 l
418.227923 337.5184 l
419.966308 337.9412 l
420.545769 337.8204 l
421.125231 337.5184 l
421.833462 337.5788 l
422.992385 338.0016 l
424.151308 337.3976 l
424.730769 337.6996 l
425.439 337.9412 l
426.018462 337.8204 l
426.597923 337.5788 l
427.177385 337.5788 l
427.756846 337.8808 l
428.336308 337.8808 l
429.624 337.458 l
430.203462 337.5788 l
430.782923 337.9412 l
431.362385 337.8808 l
432.521308 337.458 l
433.100769 337.5184 l
433.680231 337.9412 l
434.259692 337.8808 l
434.839154 337.5184 l
435.418615 337.458 l
436.577538 338.062 l
437.157 337.6392 l
437.736462 337.458 l
438.315923 337.5184 l
438.895385 337.76 l
439.474846 337.8808 l
441.342 337.5788 l
441.921462 337.8808 l
442.500923 338.0016 l
443.080385 337.6392 l
443.659846 337.5788 l
444.239308 337.6996 l
444.818769 337.9412 l
445.527 337.9412 l
446.685923 337.458 l
447.844846 337.9412 l
449.132538 337.5184 l
450.999692 337.9412 l
452.158615 337.458 l
453.317538 337.9412 l
453.897 337.9412 l
454.476462 337.5788 l
455.055923 337.458 l
455.635385 337.76 l
456.214846 337.8808 l
457.502538 337.458 l
458.082 337.458 l
458.661462 337.8204 l
459.240923 337.8808 l
460.399846 337.5788 l
460.979308 337.6392 l
461.558769 338.0016 l
462.267 337.9412 l
462.846462 337.5788 l
463.425923 337.5184 l
464.005385 337.6392 l
464.584846 338.0016 l
465.743769 337.458 l
466.323231 337.458 l
467.610923 338.0016 l
468.190385 337.6996 l
469.349308 337.6392 l
470.508231 338.062 l
471.667154 337.458 l
472.246615 337.5788 l
472.954846 337.9412 l
473.534308 337.8204 l
474.113769 337.458 l
475.401462 337.76 l
475.980923 338.0016 l
477.268615 337.5184 l
479.007 338.0016 l
479.586462 337.6996 l
480.165923 337.5788 l
481.324846 338.062 l
482.483769 337.6392 l
483.063231 337.3976 l
484.222154 337.9412 l
484.801615 337.8808 l
485.381077 337.5184 l
485.960538 337.5788 l
486.54 337.8808 l
487.119462 337.9412 l
487.698923 337.6392 l
488.857846 337.5184 l
489.437308 337.76 l
490.145538 337.8808 l
491.304462 337.3976 l
491.883923 337.5788 l
492.463385 337.8808 l
493.042846 337.8808 l
493.622308 337.6392 l
494.201769 337.5788 l
494.781231 337.6392 l
495.360692 338.0016 l
496.068923 337.9412 l
496.648385 337.6392 l
497.227846 337.5184 l
498.515538 338.0016 l
499.095 337.6392 l
500.382692 337.6392 l
500.962154 337.9412 l
501.541615 337.8808 l
502.121077 337.5788 l
502.700538 337.458 l
503.859462 338.0016 l
504.438923 337.8808 l
505.018385 337.5184 l
505.597846 337.5788 l
506.756769 337.9412 l
507.336231 337.8204 l
508.044462 337.5184 l
508.623923 337.5184 l
509.203385 337.8204 l
509.911615 337.9412 l
510.491077 337.6996 l
511.070538 337.6392 l
511.65 337.76 l
512.229462 338.062 l
513.388385 337.76 l
513.967846 337.5184 l
515.126769 338.0016 l
515.706231 337.8204 l
516.285692 337.5184 l
516.865154 337.5184 l
518.024077 337.8808 l
518.732308 337.6392 l
519.891231 337.5184 l
521.050154 338.1224 l
521.629615 337.8808 l
522.209077 337.0956 l
522.917308 336.9144 l
524.655692 337.156 l
525.235154 337.3372 l
525.814615 337.8204 l
526.394077 338.1224 l
526.973538 338.0016 l
527.553 337.6996 l
528.132462 337.6996 l
528.711923 337.9412 l
529.291385 338.0016 l
529.870846 337.6392 l
530.450308 337.458 l
531.029769 337.5184 l
531.609231 337.8204 l
532.317462 337.9412 l
533.476385 337.5788 l
534.635308 338.0016 l
535.923 337.5788 l
537.081923 337.76 l
537.790154 337.6392 l
538.369615 337.156 l
538.949077 337.0956 l
540.236769 338.364 l
540.816231 338.3036 l
541.395692 329.9684 l
541.975154 276.9372 l
543.134077 155.2312 l
543.713538 115.3068 l
545.001231 63.1816 l
546.160154 38.9008 l
547.319077 27.3644 l
547.898538 23.8612 l
549.057462 19.9352 l
549.636923 19.3916 l
550.216385 18.546 l
550.795846 18.3044 l
551.375308 18.4856 l
551.954769 18.0628 l
552.534231 18.1232 l
553.113692 17.7004 l
553.693154 17.8212 l
554.980846 17.7004 l
555.560308 18.0628 l
556.139769 17.64 l
556.719231 17.8816 l
557.298692 17.5192 l
559.037077 17.4588 l
559.616538 17.7608 l
560.196 17.3984 l
560.775462 17.7608 l
561.354923 17.64 l
561.934385 17.64 l
562.513846 17.942 l
563.093308 17.5192 l
563.672769 17.7608 l
564.252231 17.338 l
565.411154 17.5192 l
566.119385 17.4588 l
566.698846 17.8212 l
567.278308 17.5796 l
567.857769 17.7608 l
568.437231 17.5796 l
569.016692 17.64 l
569.596154 17.8212 l
570.304385 17.4588 l
570.883846 17.7608 l
571.463308 17.5796 l
572.042769 17.5796 l
572.622231 17.7004 l
573.201692 17.4588 l
573.781154 17.8212 l
574.360615 17.5796 l
574.940077 17.8212 l
576.099 17.64 l
576.678462 17.942 l
577.257923 17.5192 l
577.837385 17.8816 l
578.416846 17.5192 l
578.996308 17.64 l
579.575769 17.4588 l
580.155231 17.3984 l
580.734692 17.7608 l
581.314154 17.4588 l
581.893615 17.8816 l
582.473077 17.7004 l
583.052538 17.64 l
583.632 17.7608 l
584.211462 17.5192 l
584.790923 17.8816 l
585.499154 17.4588 l
586.078615 17.64 l
587.237538 17.5192 l
587.817 17.7608 l
588.396462 17.5192 l
588.975923 17.8816 l
589.684154 17.8212 l
590.263615 17.64 l
590.843077 17.942 l
591.422538 17.5796 l
592.002 17.942 l
592.581462 17.64 l
593.160923 17.7004 l
593.869154 17.64 l
594.448615 17.4588 l
595.028077 17.7608 l
596.315769 17.64 l
596.895231 17.8212 l
597.474692 17.5192 l
598.054154 17.942 l
598.633615 17.7004 l
599.921308 17.64 l
600.500769 17.2776 l
601.080231 17.5192 l
601.659692 17.338 l
602.239154 17.5796 l
602.818615 17.7004 l
603.398077 17.5192 l
604.106308 17.8212 l
604.685769 17.64 l
605.844692 17.8212 l
606.424154 17.64 l
607.003615 17.8816 l
607.583077 17.4588 l
608.162538 17.64 l
608.742 17.5192 l
609.321462 17.5796 l
609.900923 17.8212 l
610.480385 17.5796 l
611.059846 17.8816 l
611.639308 17.5192 l
612.218769 17.7004 l
614.085923 17.8816 l
614.665385 17.5192 l
615.244846 17.8816 l
615.824308 17.5192 l
616.983231 17.7004 l
617.562692 17.5192 l
618.142154 17.8212 l
618.721615 25.4316 l
619.301077 59.6784 l
619.880538 101.898 l
621.039462 158.1908 l
621.618923 175.4048 l
622.198385 187.9076 l
622.777846 197.3904 l
623.936769 207.8396 l
624.516231 210.6784 l
625.095692 212.6716 l
625.803923 214.1816 l
626.383385 215.0876 l
626.962846 215.6916 l
628.121769 216.4164 l
629.280692 216.7184 l
630.439615 216.8996 l
635.075308 216.96 l
636.363 217.0204 l
637.521923 216.96 l
643.896 216.96 l
644.475462 217.1412 l
645.054923 234.5364 l
646.213846 286.2388 l
647.372769 317.3448 l
647.952231 327.6128 l
649.239923 339.9344 l
649.819385 342.8336 l
650.398846 345.1288 l
650.978308 346.4576 l
651.557769 347.424 l
652.716692 348.632 l
653.875615 349.538 l
655.614 350.0212 l
656.772923 349.9004 l
657.931846 349.5984 l
658.511308 349.4776 l
660.378462 349.7796 l
661.537385 350.0816 l
662.116846 350.142 l
663.855231 349.7192 l
664.434692 349.4776 l
665.014154 349.538 l
665.593615 349.4776 l
666.173077 349.538 l
667.332 349.84 l
669.070385 350.142 l
671.388231 349.5984 l
675.444462 350.0212 l
676.023923 349.9608 l
676.603385 349.7796 l
678.470538 349.5984 l
679.05 349.7192 l
679.629462 349.7192 l
680.788385 349.9004 l
682.655538 350.0816 l
683.235 350.0212 l
683.814462 349.7192 l
685.552846 349.538 l
688.450154 350.0816 l
688.450154 350.0816 l
stroke
grestore
0.800 setlinewidth
0 setlinejoin
[] 0 setdash
0.000 setgray
gsave
135 72 m
135 506.88 l
stroke
grestore
gsave
972 72 m
972 506.88 l
stroke
grestore
gsave
135 72 m
972 72 l
stroke
grestore
gsave
135 506.88 m
972 506.88 l
stroke
grestore
1 setlinejoin
0 setlinecap
[] 0 setdash
gsave
/o {
gsave
newpath
translate
0.8 setlinewidth
1 setlinejoin
0 setlinecap
0 0 m
3.5 0 l

gsave
0.000 setgray
fill
grestore
stroke
grestore
} bind def
972 113.417 o
grestore
gsave
979.000000 107.339018 translate
0.000000 rotate
0.000000 0 m /minus glyphshow
13.406250 0 m /one glyphshow
23.585938 0 m /five glyphshow
33.765625 0 m /zero glyphshow
grestore
gsave
/o {
gsave
newpath
translate
0.8 setlinewidth
1 setlinejoin
0 setlinecap
0 0 m
3.5 0 l

gsave
0.000 setgray
fill
grestore
stroke
grestore
} bind def
972 165.189 o
grestore
gsave
979.000000 159.110446 translate
0.000000 rotate
0.000000 0 m /minus glyphshow
13.406250 0 m /one glyphshow
23.585938 0 m /two glyphshow
33.765625 0 m /five glyphshow
grestore
gsave
/o {
gsave
newpath
translate
0.8 setlinewidth
1 setlinejoin
0 setlinecap
0 0 m
3.5 0 l

gsave
0.000 setgray
fill
grestore
stroke
grestore
} bind def
972 216.96 o
grestore
gsave
979.000000 210.881875 translate
0.000000 rotate
0.000000 0 m /minus glyphshow
13.406250 0 m /one glyphshow
23.585938 0 m /zero glyphshow
33.765625 0 m /zero glyphshow
grestore
gsave
/o {
gsave
newpath
translate
0.8 setlinewidth
1 setlinejoin
0 setlinecap
0 0 m
3.5 0 l

gsave
0.000 setgray
fill
grestore
stroke
grestore
} bind def
972 268.731 o
grestore
gsave
979.000000 262.653304 translate
0.000000 rotate
0.000000 0 m /minus glyphshow
13.406250 0 m /seven glyphshow
23.585938 0 m /five glyphshow
grestore
gsave
/o {
gsave
newpath
translate
0.8 setlinewidth
1 setlinejoin
0 setlinecap
0 0 m
3.5 0 l

gsave
0.000 setgray
fill
grestore
stroke
grestore
} bind def
972 320.503 o
grestore
gsave
979.000000 314.424732 translate
0.000000 rotate
0.000000 0 m /minus glyphshow
13.406250 0 m /five glyphshow
23.585938 0 m /zero glyphshow
grestore
gsave
/o {
gsave
newpath
translate
0.8 setlinewidth
1 setlinejoin
0 setlinecap
0 0 m
3.5 0 l

gsave
0.000 setgray
fill
grestore
stroke
grestore
} bind def
972 372.274 o
grestore
gsave
979.000000 366.196161 translate
0.000000 rotate
0.000000 0 m /minus glyphshow
13.406250 0 m /two glyphshow
23.585938 0 m /five glyphshow
grestore
gsave
/o {
gsave
newpath
translate
0.8 setlinewidth
1 setlinejoin
0 setlinecap
0 0 m
3.5 0 l

gsave
0.000 setgray
fill
grestore
stroke
grestore
} bind def
972 424.046 o
grestore
gsave
979.000000 417.967589 translate
0.000000 rotate
0.000000 0 m /zero glyphshow
grestore
gsave
/o {
gsave
newpath
translate
0.8 setlinewidth
1 setlinejoin
0 setlinecap
0 0 m
3.5 0 l

gsave
0.000 setgray
fill
grestore
stroke
grestore
} bind def
972 475.817 o
grestore
gsave
979.000000 469.739018 translate
0.000000 rotate
0.000000 0 m /two glyphshow
10.179688 0 m /five glyphshow
grestore
0.000 0.500 0.000 setrgbcolor
gsave
1039.125000 225.815000 translate
90.000000 rotate
0.000000 0 m /A glyphshow
10.695312 0 m /c glyphshow
19.492188 0 m /c glyphshow
28.289062 0 m /e glyphshow
38.132812 0 m /l glyphshow
42.578125 0 m /e glyphshow
52.421875 0 m /r glyphshow
59.000000 0 m /a glyphshow
68.804688 0 m /t glyphshow
75.078125 0 m /i glyphshow
79.523438 0 m /o glyphshow
89.312500 0 m /n glyphshow
99.453125 0 m /space glyphshow
104.539062 0 m /bracketleft glyphshow
110.781250 0 m /g glyphshow
120.937500 0 m /bracketright glyphshow
grestore
2.000 setlinewidth
2 setlinecap
gsave
837 434.9 135 72 clipbox
126.308077 426.116571 m
584.564804 426.04841 l
584.726217 426.282142 l
584.887371 425.794455 l
585.048462 429.221858 l
585.532248 451.857089 l
585.693789 453.628991 l
586.015197 460.659041 l
586.175901 463.648333 l
586.658013 483.83858 l
586.980451 487.265774 l
587.302245 480.411978 l
587.623524 475.29118 l
587.784679 474.297738 l
588.107117 478.775316 l
588.26795 480.025358 l
588.428461 480.075904 l
588.751478 477.266248 l
589.072951 472.423757 l
589.555063 473.570741 l
589.876986 475.264203 l
590.19878 473.733389 l
590.521991 470.675726 l
590.843399 470.505995 l
591.165064 471.255169 l
591.326348 470.90269 l
591.485957 470.21126 l
591.648078 468.783243 l
591.808589 468.853595 l
591.969486 467.882936 l
592.13122 467.829353 l
592.292053 468.427169 l
592.45295 467.807588 l
592.614233 467.910982 l
592.774551 467.719231 l
592.935706 466.57274 l
593.096796 466.344804 l
593.418783 465.276665 l
593.579487 465.012109 l
593.740256 465.091457 l
593.901153 464.973861 l
594.38436 463.447142 l
594.545643 462.65342 l
594.706476 462.686941 l
595.028592 461.665734 l
595.18936 461.866726 l
595.672181 459.800933 l
595.833013 460.039995 l
595.994039 459.409044 l
596.154615 458.247771 l
596.315769 459.162528 l
596.637499 457.56489 l
596.799105 457.528765 l
596.959873 456.993848 l
597.282182 456.687388 l
597.442951 456.247972 l
597.603912 455.061932 l
597.764938 454.850459 l
597.924548 455.790066 l
598.086024 453.827451 l
598.247952 454.673953 l
598.408591 452.908986 l
598.569939 452.438149 l
598.73045 452.636361 l
598.891605 451.602053 l
599.052824 451.427436 l
599.213463 450.215239 l
599.374554 450.772193 l
599.535322 449.785588 l
599.697056 450.415652 l
600.018786 447.899597 l
600.179039 447.958658 l
600.340709 447.375935 l
600.500962 448.371942 l
600.66231 447.114239 l
600.823722 447.127952 l
600.984555 447.306443 l
601.145066 446.160563 l
601.467054 446.136894 l
601.628144 445.763509 l
601.949874 444.206581 l
602.110513 445.382814 l
602.272054 444.008253 l
602.432952 444.082406 l
602.755518 423.506892 l
602.916029 428.183846 l
603.076347 425.484377 l
603.238596 420.131544 l
603.3993 426.672583 l
603.560584 421.313391 l
603.720193 427.256163 l
603.882056 421.515065 l
604.043275 426.616265 l
604.204172 422.619079 l
604.363975 423.253463 l
604.526417 425.255786 l
604.686156 423.227499 l
604.847568 424.546832 l
605.169362 423.747611 l
605.330259 424.41162 l
605.491156 423.577732 l
605.65186 424.357001 l
605.812951 424.099752 l
605.974234 423.59764 l
606.13526 424.667227 l
606.296608 423.464635 l
606.457183 424.536188 l
606.61763 423.640478 l
606.777883 424.306632 l
606.939231 424.265507 l
607.100836 423.394101 l
607.261733 424.817841 l
607.42263 423.595795 l
607.744232 424.25431 l
607.905644 423.606555 l
608.067314 424.389968 l
608.388207 423.703784 l
608.548975 424.496412 l
608.710645 423.650792 l
608.870769 424.266832 l
609.032053 424.135809 l
609.19295 423.748405 l
609.354426 424.313812 l
609.514422 423.773355 l
609.675899 424.345088 l
609.837182 423.904438 l
609.997886 423.964042 l
610.159234 424.183283 l
610.319938 423.931199 l
610.481093 424.169139 l
610.801599 423.906031 l
610.963527 424.318627 l
611.124746 423.810645 l
611.285965 424.095765 l
611.446089 424.133141 l
611.608274 423.84981 l
611.768077 424.229377 l
611.929618 423.971339 l
612.250962 424.19821 l
612.412309 423.788464 l
612.573335 424.313091 l
612.734168 423.789549 l
612.89558 424.19515 l
613.21731 423.922983 l
613.377757 424.285129 l
613.538976 423.865312 l
613.70013 424.173977 l
613.860834 423.966008 l
614.02186 423.977133 l
614.183208 424.227017 l
614.34359 423.857604 l
614.505067 424.202887 l
614.665642 423.976545 l
614.826539 423.98827 l
614.986986 424.194943 l
615.149042 423.996456 l
615.309295 423.989702 l
615.470901 424.094211 l
615.63154 423.962895 l
615.792244 424.148132 l
615.952948 424.016301 l
616.113974 424.124638 l
616.436605 424.013979 l
616.919426 424.061813 l
617.080001 423.968762 l
617.402181 424.165373 l
617.563014 423.912063 l
617.724298 424.086146 l
618.046285 424.029489 l
618.368015 424.078374 l
618.528397 423.963419 l
618.689809 424.132773 l
618.850771 423.953921 l
619.011604 424.127954 l
619.333977 424.014945 l
619.816025 424.097483 l
619.977695 423.981387 l
620.299811 424.06676 l
620.460515 423.94737 l
620.621541 424.157676 l
620.782438 423.943438 l
620.943722 424.123832 l
621.103782 423.981786 l
621.265387 424.133278 l
621.587375 424.00722 l
621.909233 424.054515 l
622.391023 424.012361 l
622.552822 424.175731 l
622.713397 423.928083 l
622.874294 424.120757 l
623.196732 423.954105 l
623.357565 424.086338 l
623.678844 424.064248 l
623.840643 424.118042 l
624.001605 423.945724 l
624.323399 424.07133 l
624.645322 424.018804 l
624.806477 424.09546 l
624.96673 424.007985 l
625.128078 424.127408 l
625.289232 423.991056 l
625.772053 424.040362 l
626.738079 424.066407 l
626.898848 423.981982 l
627.059938 424.113541 l
627.220642 423.992986 l
627.381539 424.104754 l
627.54205 424.011193 l
627.703462 424.091563 l
628.026158 423.998924 l
628.508656 424.062895 l
628.669232 423.995277 l
628.991155 424.117479 l
629.152309 423.991562 l
629.635387 424.083448 l
629.956924 424.027421 l
630.117435 424.116905 l
630.439809 423.981962 l
630.761667 424.0689 l
631.083719 424.013036 l
631.244874 424.110502 l
631.404934 423.987625 l
631.566797 424.125225 l
631.727501 423.983359 l
631.888913 424.075549 l
632.210514 424.038967 l
632.532824 424.028437 l
632.692755 424.023209 l
632.854425 424.130477 l
633.015386 424.001879 l
633.498207 424.104066 l
633.98064 423.992958 l
634.141988 424.146537 l
634.464426 423.979218 l
634.624937 424.091721 l
634.946667 424.069718 l
635.267946 424.014367 l
635.429552 424.154622 l
635.5909 423.944419 l
635.91263 424.073536 l
636.555639 424.033996 l
636.716987 424.1183 l
637.039167 424.024129 l
637.361734 424.04765 l
637.522245 423.977728 l
637.683271 424.105554 l
638.165834 424.019477 l
638.487885 424.028231 l
639.615067 424.059291 l
639.775707 423.993166 l
639.936797 424.100491 l
640.258784 424.041283 l
641.706794 424.07449 l
641.868013 424.09717 l
642.190323 424.023982 l
642.833976 424.050069 l
643.156092 424.101611 l
643.316732 423.962728 l
643.478079 424.087231 l
643.800067 424.034575 l
644.926926 424.051149 l
645.087759 423.983099 l
645.248399 424.092893 l
645.569807 424.006387 l
645.731541 424.142638 l
645.892438 423.968024 l
646.053593 424.067611 l
646.37513 424.056773 l
647.662629 424.071016 l
648.14487 424.064971 l
648.306539 424.09073 l
648.467758 423.974327 l
648.951222 424.043206 l
649.111347 424.009662 l
649.272502 424.095394 l
649.755386 424.003152 l
650.238271 424.0532 l
651.365066 424.02413 l
651.847951 424.063992 l
652.008397 424.005873 l
652.169809 424.106448 l
652.330771 424.017413 l
652.492183 424.06868 l
652.652952 423.988328 l
652.974102 424.051561 l
653.457566 424.10174 l
653.77936 424.019066 l
654.101348 424.064899 l
654.4234 424.054618 l
658.446987 424.020838 l
658.6084 424.11941 l
658.769297 424.000173 l
659.252375 424.047974 l
726.694615 424.012189 l
726.856028 424.140334 l
727.178273 424.025871 l
728.144171 424.141145 l
728.305068 423.993464 l
728.787759 424.047476 l
729.431605 424.117607 l
729.592567 423.978946 l
729.914426 424.028648 l
730.397568 424.068508 l
731.041156 424.033646 l
731.524041 424.061668 l
732.489617 424.011496 l
732.650901 424.086413 l
733.132948 424.029443 l
733.294554 424.112542 l
733.455515 424.001559 l
733.938528 424.100287 l
734.260773 424.042865 l
739.571345 423.999583 l
739.732951 424.148894 l
739.894363 423.987473 l
740.69872 424.056399 l
741.825515 424.018681 l
742.308078 424.084635 l
742.630065 424.043354 l
751.322181 424.139735 l
751.483143 423.982679 l
751.965963 424.063383 l
753.092501 424.067784 l
760.1741 424.031559 l
760.335834 424.121488 l
760.496925 423.982976 l
760.818783 424.046032 l
762.911026 424.097904 l
763.233464 424.03665 l
764.037242 424.054497 l
764.198847 424.128328 l
764.359809 423.998842 l
764.842758 424.073306 l
765.324998 424.051659 l
765.486926 424.106854 l
765.647565 423.971231 l
765.808849 424.075125 l
766.291605 424.010784 l
766.774875 424.108628 l
766.935386 423.956308 l
767.096477 424.087422 l
767.579297 424.03145 l
768.062246 424.117092 l
768.223014 423.98541 l
768.545517 424.027553 l
769.188333 424.03849 l
769.349874 424.112604 l
769.5109 424.003835 l
770.154875 424.051736 l
770.475961 424.018031 l
770.63763 424.140515 l
770.959747 423.995936 l
771.120708 424.083344 l
771.603464 424.05158 l
773.695835 424.041248 l
774.500965 424.081913 l
774.661733 424.003632 l
774.823661 424.059307 l
774.983914 423.982441 l
775.14494 424.095939 l
775.626923 424.024707 l
775.788528 424.118121 l
775.949426 424.006221 l
776.432568 424.072845 l
776.914551 424.0645 l
777.076156 424.105475 l
777.398466 424.037681 l
778.202308 424.067503 l
778.364106 424.100293 l
778.524939 423.991366 l
779.007952 424.061349 l
779.812631 423.939695 l
779.973786 424.098225 l
780.29558 424.053833 l
782.065449 424.03233 l
782.227054 424.11717 l
782.388016 423.988996 l
782.709875 424.042653 l
783.514489 424.121317 l
783.675966 423.997293 l
784.802568 424.104685 l
784.963401 423.977101 l
785.285259 424.042162 l
786.090196 424.074026 l
786.412312 424.044163 l
788.504232 424.029968 l
788.66558 424.10113 l
788.988276 424.046157 l
789.148594 423.989383 l
789.309684 424.094246 l
789.631607 424.04269 l
791.241544 424.092086 l
791.402248 423.981512 l
791.724043 424.029296 l
792.20712 424.048666 l
796.230258 424.03479 l
796.392056 424.131063 l
796.553018 423.9815 l
796.875134 424.04303 l
797.518014 424.034922 l
797.67962 424.110923 l
798.0018 424.028991 l
798.967763 424.091235 l
799.128402 424.004026 l
799.450454 424.037361 l
801.54289 424.08509 l
802.025646 424.008441 l
802.1868 424.085747 l
802.508723 424.019313 l
802.830518 424.103559 l
802.991415 423.991461 l
803.474621 424.06692 l
803.956605 424.048577 l
804.118854 424.101057 l
804.279236 423.959565 l
804.440262 424.083239 l
804.923082 424.044799 l
814.419426 424.111603 l
814.580517 424.000298 l
815.063595 424.09853 l
815.385582 424.033043 l
816.029364 424.066773 l
816.51257 424.019838 l
849.18699 424.103749 l
849.34763 423.952107 l
849.669295 424.063218 l
851.278911 424.041151 l
851.761731 424.128686 l
851.922628 424.008122 l
852.40577 424.054908 l
854.175639 424.033438 l
854.337373 424.118559 l
854.659425 423.99635 l
854.981734 424.050103 l
855.463331 424.037391 l
855.625001 424.107336 l
855.785962 423.995493 l
856.269491 424.047261 l
856.429744 424.000204 l
856.590899 424.095641 l
857.073655 424.010794 l
857.717372 424.043462 l
858.844296 424.054966 l
860.453718 424.044329 l
861.419552 424.054931 l
862.546089 424.014692 l
863.02891 424.043255 l
863.834168 424.051497 l
864.155705 424.067255 l
867.05224 424.04797 l
867.213974 424.121329 l
867.53609 424.000888 l
867.858528 424.050125 l
868.018975 424.005695 l
868.50186 424.124546 l
868.662757 423.979114 l
868.984615 424.053499 l
870.272308 424.043108 l
876.388782 423.960698 l
876.550001 424.096316 l
876.872117 424.011965 l
877.515641 424.094933 l
877.676474 424.005226 l
878.159874 424.03949 l
881.378783 424.114737 l
881.53968 423.988484 l
882.022886 424.048973 l
882.504998 424.043238 l
882.827501 424.021695 l
883.954167 424.078507 l
884.436987 423.992442 l
884.597949 424.090694 l
885.079932 424.042929 l
885.241409 424.119944 l
885.564233 424.018513 l
886.367689 424.072851 l
886.529166 424.108865 l
886.851604 424.029389 l
891.518651 424.01507 l
891.680192 424.132416 l
891.841283 424.011246 l
892.967949 424.112794 l
893.290258 424.012747 l
893.612246 424.062348 l
894.093907 424.039792 l
894.255834 424.111959 l
894.416732 423.985084 l
894.738462 424.056611 l
897.313846 424.018119 l
897.63564 424.041529 l
898.441092 424.038304 l
899.084552 424.019735 l
899.406282 424.107783 l
899.72872 424.034972 l
900.532369 424.073395 l
900.694232 424.119219 l
900.855064 423.986423 l
901.176859 424.040438 l
901.982246 424.089559 l
902.142692 423.962956 l
902.303718 424.082188 l
902.786474 424.064928 l
904.39551 424.011865 l
904.556922 424.120606 l
904.879167 424.02344 l
905.523207 424.035234 l
913.088721 424.035183 l
914.376027 424.049223 l
918.56019 424.025605 l
918.722246 424.118753 l
918.88295 423.959494 l
919.044233 424.07629 l
919.204615 424.016863 l
919.365963 424.096884 l
919.526281 424.015957 l
919.688079 424.086094 l
919.84756 423.992147 l
920.009487 424.159969 l
920.170256 423.968045 l
920.492179 424.052816 l
921.618588 424.05476 l
921.780322 424.081953 l
921.940962 423.99619 l
922.26282 424.069536 l
922.423074 424.029848 l
922.584808 424.104392 l
922.745512 423.994693 l
922.906988 424.067918 l
923.228783 424.064198 l
923.71083 424.003896 l
923.872436 424.14487 l
924.194681 423.989404 l
924.516475 424.069255 l
924.998329 424.042209 l
925.160192 424.127704 l
925.321733 423.973454 l
925.804618 424.08478 l
925.965064 423.994421 l
926.126026 424.095692 l
926.28615 424.040394 l
926.447949 424.11254 l
926.608846 423.982385 l
926.93064 424.044536 l
927.735834 424.090325 l
927.896732 423.997135 l
928.218655 424.042371 l
929.023527 424.087455 l
929.346094 424.058806 l
929.506411 423.991275 l
929.667566 424.096274 l
929.989554 424.059544 l
930.794039 424.038071 l
931.599491 424.110179 l
931.759937 423.958583 l
931.921092 424.086742 l
932.403783 424.011492 l
932.886732 424.112339 l
933.04763 423.978862 l
933.369939 424.021335 l
934.174489 424.084006 l
934.335258 423.992102 l
934.65776 424.031312 l
936.58814 424.019872 l
936.749874 424.143287 l
936.911222 423.983504 l
937.715707 424.065731 l
937.875703 424.03249 l
938.037502 424.125903 l
938.198528 423.985625 l
938.681734 424.067221 l
938.842181 424.007276 l
939.003335 424.092027 l
939.486349 424.017605 l
940.291028 424.078216 l
940.773719 424.010641 l
941.256861 424.065892 l
941.739038 424.038886 l
941.900514 424.099451 l
942.223274 424.034907 l
942.383399 424.002761 l
942.544618 424.109817 l
942.866477 424.051766 l
944.154233 424.04867 l
945.763784 424.067825 l
946.085836 424.05353 l
946.568656 424.064214 l
948.339169 424.115746 l
948.500259 423.997732 l
949.144105 424.055121 l
949.465256 424.032107 l
949.627183 424.128076 l
949.78808 423.977891 l
950.110068 424.042453 l
950.914747 424.097955 l
951.075708 423.999337 l
951.558722 424.038875 l
959.928271 424.123156 l
960.250645 424.00923 l
960.733272 424.055604 l
962.341857 424.028632 l
962.503656 424.129236 l
962.664488 423.985259 l
963.148017 424.059812 l
963.308399 424.005886 l
963.469489 424.090311 l
963.952245 424.00588 l
964.435258 424.064889 l
964.91737 424.015495 l
965.078847 424.113168 l
965.23968 424.005056 l
965.723015 424.089991 l
966.044874 424.032678 l
966.366604 424.107411 l
966.527565 424.005954 l
967.010772 424.075503 l
967.332566 424.02822 l
967.654554 424.103999 l
967.815258 423.975858 l
967.976477 424.071589 l
968.459297 424.040364 l
968.942375 424.11311 l
969.103079 423.962896 l
969.264169 424.075456 l
969.746925 424.049671 l
971.355832 423.996279 l
971.517502 424.149042 l
971.67885 423.994612 l
971.839618 424.018825 l
971.839618 424.018825 l
stroke
grestore
0.800 setlinewidth
0 setlinejoin
[] 0 setdash
0.000 setgray
gsave
135 72 m
135 506.88 l
stroke
grestore
gsave
972 72 m
972 506.88 l
stroke
grestore
gsave
135 72 m
972 72 l
stroke
grestore
gsave
135 506.88 m
972 506.88 l
stroke
grestore
1.000 setlinewidth
0 setlinecap
0.800 setgray
gsave
337.94375 389.066875 m
798.8 389.066875 l
800.933333 389.066875 802 390.133542 802 392.266875 c
802 461.12 l
802 463.253333 800.933333 464.32 798.8 464.32 c
337.94375 464.32 l
335.810417 464.32 334.74375 463.253333 334.74375 461.12 c
334.74375 392.266875 l
334.74375 390.133542 335.810417 389.066875 337.94375 389.066875 c
cl
gsave
1.000 setgray
fill
grestore
stroke
grestore
2.000 setlinewidth
1 setlinejoin
2 setlinecap
[] 0 setdash
0.122 0.467 0.706 setrgbcolor
gsave
341.14375 451.36375 m
373.14375 451.36375 l
stroke
grestore
0.000 setgray
gsave
385.943750 445.763750 translate
0.000000 rotate
0.000000 0 m /S glyphshow
10.156250 0 m /p glyphshow
20.312500 0 m /h glyphshow
30.453125 0 m /e glyphshow
40.296875 0 m /r glyphshow
46.500000 0 m /e glyphshow
56.343750 0 m /quotesingle glyphshow
60.742188 0 m /s glyphshow
69.078125 0 m /space glyphshow
74.164062 0 m /a glyphshow
83.968750 0 m /n glyphshow
94.109375 0 m /g glyphshow
104.265625 0 m /u glyphshow
114.406250 0 m /l glyphshow
118.851562 0 m /a glyphshow
128.656250 0 m /r glyphshow
135.234375 0 m /space glyphshow
140.320312 0 m /v glyphshow
149.789062 0 m /e glyphshow
159.632812 0 m /l glyphshow
164.078125 0 m /o glyphshow
173.867188 0 m /c glyphshow
182.664062 0 m /i glyphshow
187.109375 0 m /t glyphshow
193.382812 0 m /y glyphshow
202.851562 0 m /space glyphshow
207.937500 0 m /a glyphshow
217.742188 0 m /b glyphshow
227.898438 0 m /o glyphshow
237.687500 0 m /u glyphshow
247.828125 0 m /t glyphshow
254.101562 0 m /space glyphshow
259.187500 0 m /Z glyphshow
270.148438 0 m /space glyphshow
275.234375 0 m /a glyphshow
285.039062 0 m /x glyphshow
294.507812 0 m /i glyphshow
298.953125 0 m /s glyphshow
grestore
1.000 0.498 0.055 setrgbcolor
gsave
341.14375 427.879375 m
373.14375 427.879375 l
stroke
grestore
0.000 setgray
gsave
385.943750 422.279375 translate
0.000000 rotate
0.000000 0 m /R glyphshow
10.367188 0 m /e glyphshow
20.210938 0 m /l glyphshow
24.656250 0 m /e glyphshow
34.500000 0 m /a glyphshow
44.304688 0 m /s glyphshow
52.640625 0 m /e glyphshow
62.484375 0 m /space glyphshow
67.570312 0 m /M glyphshow
81.375000 0 m /e glyphshow
91.218750 0 m /c glyphshow
100.015625 0 m /h glyphshow
110.156250 0 m /a glyphshow
119.960938 0 m /n glyphshow
130.101562 0 m /i glyphshow
134.546875 0 m /s glyphshow
142.882812 0 m /m glyphshow
158.468750 0 m /quotesingle glyphshow
162.867188 0 m /s glyphshow
171.203125 0 m /space glyphshow
176.289062 0 m /a glyphshow
186.093750 0 m /n glyphshow
196.234375 0 m /g glyphshow
206.390625 0 m /u glyphshow
216.531250 0 m /l glyphshow
220.976562 0 m /a glyphshow
230.781250 0 m /r glyphshow
237.359375 0 m /space glyphshow
242.445312 0 m /v glyphshow
251.914062 0 m /e glyphshow
261.757812 0 m /l glyphshow
266.203125 0 m /o glyphshow
275.992188 0 m /c glyphshow
284.789062 0 m /i glyphshow
289.234375 0 m /t glyphshow
295.507812 0 m /y glyphshow
304.976562 0 m /space glyphshow
310.062500 0 m /a glyphshow
319.867188 0 m /b glyphshow
330.023438 0 m /o glyphshow
339.812500 0 m /u glyphshow
349.953125 0 m /t glyphshow
356.226562 0 m /space glyphshow
361.312500 0 m /Z glyphshow
372.273438 0 m /space glyphshow
377.359375 0 m /a glyphshow
387.164062 0 m /x glyphshow
396.632812 0 m /i glyphshow
401.078125 0 m /s glyphshow
grestore
0.000 0.500 0.000 setrgbcolor
gsave
341.14375 404.395 m
373.14375 404.395 l
stroke
grestore
0.000 setgray
gsave
385.943750 398.795000 translate
0.000000 rotate
0.000000 0 m /C glyphshow
11.171875 0 m /a glyphshow
20.976562 0 m /p glyphshow
31.132812 0 m /s glyphshow
39.468750 0 m /u glyphshow
49.609375 0 m /l glyphshow
54.054688 0 m /e glyphshow
63.898438 0 m /quotesingle glyphshow
68.296875 0 m /s glyphshow
76.632812 0 m /space glyphshow
81.718750 0 m /a glyphshow
91.523438 0 m /c glyphshow
100.320312 0 m /c glyphshow
109.117188 0 m /e glyphshow
118.960938 0 m /l glyphshow
123.406250 0 m /e glyphshow
133.250000 0 m /r glyphshow
139.453125 0 m /o glyphshow
149.242188 0 m /m glyphshow
164.828125 0 m /e glyphshow
174.671875 0 m /t glyphshow
180.945312 0 m /e glyphshow
190.789062 0 m /r glyphshow
197.367188 0 m /space glyphshow
202.453125 0 m /i glyphshow
206.898438 0 m /n glyphshow
217.039062 0 m /d glyphshow
227.195312 0 m /i glyphshow
231.640625 0 m /c glyphshow
240.437500 0 m /a glyphshow
250.242188 0 m /t glyphshow
256.515625 0 m /i glyphshow
260.960938 0 m /o glyphshow
270.750000 0 m /n glyphshow
280.890625 0 m /space glyphshow
285.976562 0 m /a glyphshow
295.781250 0 m /b glyphshow
305.937500 0 m /o glyphshow
315.726562 0 m /u glyphshow
325.867188 0 m /t glyphshow
332.140625 0 m /space glyphshow
337.226562 0 m /Z glyphshow
348.187500 0 m /space glyphshow
353.273438 0 m /a glyphshow
363.078125 0 m /x glyphshow
372.546875 0 m /i glyphshow
376.992188 0 m /s glyphshow
grestore

end
showpage
