,actual_velocity,current_position,time diff[ms]
0,-1,0,31
1,-1,0,31
2,-1,0,9
3,-1,0,9
4,-1,0,9
5,-1,0,11
6,-1,0,9
7,-1,0,9
8,-1,0,9
9,-1,0,9
10,-1,0,9
11,-1,0,9
12,-1,0,9
13,-1,0,9
14,-1,0,9
15,-1,0,9
16,-1,-1,9
17,-1,-1,9
18,0,0,9
19,-1,1,9
20,-1,0,9
21,-1,0,9
22,-1,0,9
23,0,-1,9
24,-1,0,9
25,0,0,9
26,0,0,9
27,0,0,11
28,0,-1,9
29,0,0,9
30,0,0,9
31,-1,0,9
32,-1,0,9
33,-1,0,9
34,-1,0,9
35,-1,0,9
36,-1,0,9
37,-1,-1,9
38,-1,0,9
39,-1,0,9
40,-1,0,9
41,-1,0,9
42,-1,0,9
43,-1,0,9
44,-1,0,9
45,-1,0,9
46,-1,0,9
47,-1,0,9
48,-1,0,9
49,-1,0,11
50,-1,0,9
51,-1,0,9
52,-1,0,9
53,-1,0,9
54,-1,0,9
55,-1,0,9
56,-1,0,9
57,-1,0,9
58,-1,0,9
59,-1,0,9
60,0,0,9
61,0,0,9
62,0,0,9
63,0,0,9
64,-1,0,9
65,-1,0,9
66,-1,0,9
67,-1,-1,9
68,-1,0,9
69,-1,0,9
70,-1,0,9
71,-1,0,11
72,-1,-1,9
73,0,0,9
74,-1,0,9
75,-1,0,9
76,-1,-1,9
77,-1,0,9
78,-1,0,9
79,-1,-1,9
80,-1,0,9
81,-1,0,9
82,-1,0,9
83,-1,0,9
84,-1,0,9
85,-1,0,9
86,-1,-1,9
87,-1,0,9
88,-1,0,9
89,-1,0,9
90,-1,0,9
91,-1,0,9
92,0,0,9
93,0,-1,11
94,0,0,9
95,-1,0,9
96,0,0,9
97,0,0,9
98,0,0,9
99,0,0,9
100,0,0,9
101,0,0,9
102,0,0,9
103,1,0,9
104,0,0,9
105,0,-1,9
106,0,0,9
107,0,0,9
108,0,0,9
109,0,-1,9
110,0,0,9
111,0,0,9
112,0,0,9
113,0,0,9
114,0,-1,9
115,0,0,11
116,0,0,9
117,0,0,9
118,0,0,9
119,0,0,9
120,0,0,9
121,0,-1,9
122,0,0,9
123,0,0,9
124,0,0,9
125,0,0,9
126,0,0,9
127,0,0,9
128,0,0,9
129,0,0,9
130,0,0,9
131,0,0,9
132,0,0,9
133,0,-1,9
134,0,0,9
135,0,0,11
136,0,0,9
137,0,0,9
138,0,0,9
139,0,0,9
140,0,0,9
141,0,0,9
142,0,0,9
143,0,0,9
144,0,0,9
145,0,0,9
146,0,0,11
147,0,-1,9
148,0,0,9
149,0,-1,9
150,0,0,9
151,0,-1,9
152,0,0,9
153,0,-1,9
154,0,0,9
155,0,0,9
156,0,-1,9
157,-1,0,9
158,-1,0,9
159,-1,0,9
160,-1,-1,9
161,-1,0,9
162,-1,0,9
163,0,0,9
164,0,0,9
165,0,0,9
166,0,0,9
167,0,0,11
168,0,0,9
169,0,0,9
170,0,0,9
171,0,0,9
172,0,0,9
173,0,0,9
174,0,0,9
175,-1,0,9
176,-1,0,9
177,0,0,9
178,0,0,9
179,0,0,11
180,0,0,9
181,0,0,9
182,0,0,9
183,0,0,9
184,0,0,9
185,0,0,9
186,0,0,9
187,0,0,9
188,0,0,9
189,0,0,9
190,0,0,9
191,0,-1,9
192,0,0,9
193,0,-1,9
194,0,0,9
195,0,0,9
196,0,0,9
197,0,0,9
198,-1,-1,9
199,0,0,9
200,0,0,11
201,-1,-4,9
202,-4,-14,9
203,-11,-28,9
204,-19,-47,9
205,-28,-73,9
206,-39,-103,9
207,-48,-139,9
208,-60,-177,9
209,-68,-222,9
210,-80,-272,9
211,-91,-328,9
212,-102,-392,11
213,-114,-459,9
214,-125,-529,9
215,-137,-607,9
216,-149,-689,9
217,-161,-781,9
218,-176,-870,9
219,-187,-969,9
220,-196,-1068,9
221,-204,-1169,9
222,-214,-1291,9
223,-224,-1409,9
224,-238,-1533,9
225,-252,-1660,9
226,-263,-1791,9
227,-272,-1939,11
228,-281,-2078,9
229,-292,-2224,9
230,-305,-2379,9
231,-319,-2536,9
232,-328,-2691,9
233,-334,-2854,9
234,-347,-3049,9
235,-363,-3230,9
236,-375,-3404,9
237,-380,-3586,9
238,-390,-3782,9
239,-407,-3980,9
240,-417,-4174,9
241,-422,-4376,9
242,-434,-4595,9
243,-450,-4808,9
244,-458,-5023,9
245,-465,-5273,11
246,-482,-5508,9
247,-492,-5736,9
248,-500,-5976,9
249,-514,-6229,9
250,-527,-6471,9
251,-532,-6727,9
252,-546,-6993,9
253,-561,-7247,9
254,-563,-7522,9
255,-582,-7828,9
256,-591,-8132,11
257,-601,-8425,9
258,-616,-8710,9
259,-621,-9004,9
260,-637,-9310,9
261,-646,-9605,9
262,-656,-9926,9
263,-670,-10227,9
264,-674,-10554,9
265,-691,-10875,9
266,-699,-11199,9
267,-710,-11575,9
268,-722,-11908,9
269,-731,-12263,9
270,-744,-12601,9
271,-752,-12965,9
272,-768,-13310,9
273,-773,-13685,9
274,-792,-14043,9
275,-794,-14424,9
276,-810,-14790,9
277,-819,-15229,11
278,-834,-15608,9
279,-846,-16055,9
280,-855,-16449,9
281,-867,-16853,9
282,-878,-17261,9
283,-889,-17674,9
284,-898,-18097,9
285,-913,-18513,9
286,-919,-18952,9
287,-932,-19371,9
288,-940,-19816,9
289,-953,-20303,11
290,-965,-20748,9
291,-972,-21212,9
292,-989,-21659,9
293,-999,-22126,9
294,-1005,-22599,9
295,-1023,-23065,9
296,-1028,-23550,9
297,-1042,-24027,9
298,-1053,-24509,9
299,-1060,-25013,9
300,-1076,-25560,9
301,-1086,-26056,9
302,-1095,-26571,9
303,-1106,-27079,9
304,-1117,-27587,9
305,-1127,-28115,9
306,-1135,-28648,9
307,-1153,-29167,9
308,-1163,-29765,11
309,-1172,-30318,9
310,-1183,-30863,9
311,-1198,-31470,9
312,-1206,-32025,9
313,-1217,-32594,9
314,-1230,-33160,9
315,-1240,-33724,9
316,-1249,-34292,9
317,-1261,-34883,9
318,-1270,-35477,9
319,-1282,-36062,9
320,-1296,-36651,9
321,-1303,-37249,9
322,-1317,-37931,11
323,-1328,-38548,9
324,-1336,-39163,9
325,-1352,-39778,9
326,-1358,-40397,9
327,-1374,-41034,9
328,-1381,-41672,9
329,-1391,-42318,9
330,-1405,-43036,9
331,-1420,-44410,19
332,-1436,-45068,9
333,-1454,-45810,11
334,-1460,-46477,9
335,-1476,-47151,9
336,-1483,-47829,9
337,-1494,-48516,9
338,-1502,-49206,9
339,-1519,-49910,9
340,-1524,-50614,9
341,-1541,-51321,9
342,-1543,-52036,9
343,-1567,-52750,9
344,-1568,-53551,9
345,-1588,-54276,9
346,-1589,-55007,9
347,-1604,-55740,9
348,-1615,-56480,9
349,-1621,-57222,9
350,-1640,-57977,9
351,-1640,-58731,9
352,-1660,-59491,9
353,-1668,-60254,9
354,-1676,-61025,9
355,-1698,-61876,11
356,-1697,-62658,9
357,-1716,-63438,9
358,-1726,-64221,9
359,-1727,-65019,9
360,-1750,-65815,9
361,-1759,-66621,9
362,-1764,-67428,9
363,-1782,-68246,9
364,-1790,-69068,9
365,-1794,-69996,9
366,-1815,-70822,9
367,-1826,-71653,9
368,-1827,-72485,9
369,-1846,-73319,9
370,-1864,-74172,9
371,-1864,-75029,9
372,-1869,-75896,9
373,-1890,-76764,9
374,-1904,-77629,9
375,-1905,-78491,9
376,-1916,-79465,11
377,-1936,-80358,9
378,-1953,-81256,9
379,-1955,-82145,9
380,-1958,-83033,9
381,-1977,-83932,9
382,-1993,-84848,9
383,-2004,-85771,9
384,-2006,-86681,9
385,-2010,-87591,9
386,-2026,-88641,9
387,-2046,-89675,11
388,-2063,-90598,9
389,-2069,-91548,9
390,-2073,-92506,9
391,-2079,-93452,9
392,-2094,-94396,9
393,-2108,-95371,9
394,-2127,-96349,9
395,-2139,-97298,9
396,-2147,-98281,9
397,-2150,-99281,9
398,-2159,-100352,9
399,-2168,-101358,9
400,-2179,-102365,9
401,-2191,-103346,9
402,-2203,-104364,9
403,-2218,-105387,9
404,-2233,-106380,9
405,-2243,-107419,9
406,-2257,-108448,9
407,-2268,-109462,9
408,-2277,-110636,11
409,-2290,-111655,9
410,-2298,-112725,9
411,-2308,-113766,9
412,-2319,-114820,9
413,-2331,-116001,9
414,-2341,-117063,9
415,-2350,-118148,9
416,-2360,-119206,9
417,-2371,-120307,9
418,-2378,-121361,9
419,-2382,-122458,9
420,-2387,-123643,11
421,-2389,-124744,9
422,-2391,-125808,9
423,-2394,-126896,9
424,-2392,-127973,9
425,-2397,-129047,9
426,-2398,-130141,9
427,-2395,-131202,9
428,-2398,-132301,9
429,-2398,-133358,9
430,-2398,-134455,9
431,-2402,-135644,9
432,-2403,-136743,9
433,-2403,-137808,9
434,-2403,-138897,9
435,-2405,-139972,9
436,-2404,-141177,11
437,-2405,-142359,9
438,-2407,-143459,9
439,-2402,-144529,9
440,-2402,-145613,9
441,-2402,-146699,9
442,-2399,-147763,9
443,-2400,-148860,9
444,-2399,-149918,9
445,-2398,-151023,9
446,-2397,-152083,9
447,-2397,-153172,9
448,-2396,-154246,9
449,-2395,-155323,9
450,-2397,-156417,9
451,-2394,-157476,9
452,-2395,-158580,9
453,-2398,-159760,11
454,-2395,-160859,9
455,-2397,-161920,9
456,-2398,-163022,9
457,-2397,-164083,9
458,-2400,-165172,9
459,-2401,-166246,9
460,-2401,-167325,9
461,-2401,-168417,9
462,-2403,-169478,9
463,-2404,-170694,9
464,-2402,-171758,9
465,-2404,-172858,9
466,-2403,-174037,11
467,-2402,-175137,9
468,-2406,-176195,9
469,-2401,-177298,9
470,-2402,-178350,9
471,-2403,-179452,9
472,-2401,-180526,9
473,-2401,-181608,9
474,-2399,-182693,9
475,-2397,-183887,9
476,-2396,-184967,9
477,-2396,-186038,9
478,-2397,-187137,9
479,-2394,-188196,9
480,-2397,-189297,9
481,-2395,-190351,9
482,-2393,-191450,9
483,-2397,-192523,9
484,-2395,-193605,9
485,-2396,-194801,11
486,-2399,-195885,9
487,-2397,-196964,9
488,-2398,-198037,9
489,-2400,-199132,9
490,-2401,-200191,9
491,-2401,-201293,9
492,-2404,-202349,9
493,-2404,-203449,9
494,-2403,-204633,9
495,-2405,-205736,9
496,-2405,-206796,9
497,-2403,-208016,11
498,-2407,-209074,9
499,-2405,-210163,9
500,-2401,-211240,9
501,-2402,-212316,9
502,-2399,-213408,9
503,-2398,-214468,9
504,-2398,-215570,9
505,-2397,-216631,9
506,-2396,-217733,9
507,-2396,-218795,9
508,-2396,-220011,9
509,-2393,-221071,9
510,-2396,-222162,9
511,-2396,-223237,9
512,-2394,-224313,9
513,-2398,-225407,9
514,-2397,-226467,9
515,-2397,-227571,9
516,-2399,-228631,9
517,-2400,-229732,9
518,-2400,-230911,11
519,-2402,-232132,9
520,-2402,-233187,9
521,-2401,-234288,9
522,-2403,-235345,9
523,-2405,-236445,9
524,-2403,-237517,9
525,-2405,-238595,9
526,-2406,-239686,9
527,-2403,-240751,9
528,-2404,-241849,9
529,-2402,-242905,9
530,-2400,-244129,11
531,-2402,-245186,9
532,-2401,-246286,9
533,-2400,-247343,9
534,-2398,-248441,9
535,-2398,-249514,9
536,-2395,-250595,9
537,-2395,-251684,9
538,-2396,-252747,9
539,-2392,-253847,9
540,-2394,-255027,9
541,-2396,-256126,9
542,-2394,-257183,9
543,-2398,-258284,9
544,-2397,-259340,9
545,-2396,-260437,9
546,-2400,-261509,9
547,-2400,-262725,11
548,-2401,-263789,9
549,-2402,-264874,9
550,-2402,-265952,9
551,-2400,-267022,9
552,-2402,-268229,9
553,-2406,-269303,9
554,-2401,-270399,9
555,-2404,-271457,9
556,-2406,-272564,9
557,-2402,-273619,9
558,-2405,-274723,9
559,-2404,-275900,11
560,-2401,-277001,9
561,-2401,-278067,9
562,-2399,-279152,9
563,-2397,-280230,9
564,-2398,-281302,9
565,-2398,-282398,9
566,-2395,-283457,9
567,-2394,-284562,9
568,-2396,-285619,9
569,-2393,-286720,9
570,-2395,-287789,9
571,-2398,-288873,9
572,-2394,-289955,9
573,-2397,-291151,9
574,-2399,-292338,11
575,-2398,-293432,9
576,-2401,-294507,9
577,-2401,-295589,9
578,-2400,-296677,9
579,-2400,-297738,9
580,-2403,-298838,9
581,-2403,-299897,9
582,-2403,-300998,9
583,-2405,-302059,9
584,-2404,-303147,9
585,-2405,-304334,9
586,-2408,-305428,9
587,-2403,-306505,9
588,-2403,-307584,9
589,-2404,-308677,9
590,-2401,-309737,9
591,-2402,-310839,9
592,-2399,-311895,9
593,-2397,-312995,9
594,-2395,-314059,9
595,-2396,-315275,11
596,-2396,-316452,9
597,-2396,-317553,9
598,-2396,-318612,9
599,-2392,-319713,9
600,-2395,-320784,9
601,-2397,-321864,9
602,-2394,-322947,9
603,-2397,-324015,9
604,-2399,-325114,9
605,-2398,-326173,9
606,-2400,-327270,9
607,-2401,-328449,11
608,-2402,-329553,9
609,-2404,-330614,9
610,-2405,-331715,9
611,-2405,-332781,9
612,-2404,-333864,9
613,-2406,-334945,9
614,-2403,-336013,9
615,-2401,-337115,9
616,-2405,-338172,9
617,-2402,-339270,9
618,-2402,-340448,9
619,-2402,-341553,9
620,-2401,-342614,9
621,-2400,-343712,9
622,-2397,-344779,9
623,-2398,-345857,9
624,-2396,-346945,9
625,-2396,-348013,9
626,-2396,-349113,9
627,-2394,-350295,11
628,-2397,-351390,9
629,-2395,-352577,9
630,-2394,-353667,9
631,-2397,-354726,9
632,-2396,-355830,9
633,-2397,-356888,9
634,-2399,-357990,9
635,-2399,-359049,9
636,-2400,-360138,9
637,-2401,-361216,9
638,-2401,-362289,9
639,-2402,-363386,9
640,-2404,-364575,11
641,-2405,-365665,9
642,-2402,-366726,9
643,-2406,-367828,9
644,-2403,-368884,9
645,-2400,-369985,9
646,-2405,-371049,9
647,-2403,-372135,9
648,-2401,-373214,9
649,-2401,-374287,9
650,-2399,-375494,9
651,-2398,-376571,9
652,-2396,-377661,9
653,-2397,-378852,11
654,-2395,-379937,9
655,-2395,-381006,9
656,-2397,-382106,9
657,-2394,-383162,9
658,-2396,-384260,9
659,-2397,-385323,9
660,-2395,-386415,9
661,-2397,-387493,9
662,-2397,-388702,9
663,-2397,-389770,9
664,-2400,-390849,9
665,-2400,-391935,9
666,-2400,-393002,9
667,-2402,-394101,9
668,-2402,-395156,9
669,-2400,-396256,9
670,-2404,-397319,9
671,-2407,-398412,9
672,-2403,-399602,11
673,-2405,-400698,9
674,-2404,-401766,9
675,-2402,-402846,9
676,-2405,-403932,9
677,-2403,-404998,9
678,-2402,-406100,9
679,-2402,-407155,9
680,-2399,-408378,9
681,-2398,-409434,9
682,-2398,-410541,9
683,-2397,-411600,9
684,-2394,-412823,11
685,-2394,-413877,9
686,-2396,-414975,9
687,-2393,-416043,9
688,-2396,-417127,9
689,-2396,-418208,9
690,-2394,-419278,9
691,-2398,-420376,9
692,-2397,-421430,9
693,-2396,-422534,9
694,-2400,-423597,9
695,-2401,-424818,9
696,-2402,-425875,9
697,-2403,-426975,9
698,-2404,-428040,9
699,-2403,-429126,9
700,-2406,-430208,9
701,-2408,-431277,9
702,-2403,-432378,9
703,-2405,-433431,9
704,-2406,-434535,9
705,-2401,-435714,11
706,-2402,-436816,9
707,-2401,-437994,9
708,-2399,-439095,9
709,-2399,-440156,9
710,-2399,-441251,9
711,-2396,-442310,9
712,-2395,-443401,9
713,-2397,-444484,9
714,-2397,-445561,9
715,-2396,-446655,9
716,-2397,-447712,9
717,-2391,-448928,11
718,-2394,-449991,9
719,-2396,-451094,9
720,-2395,-452153,9
721,-2400,-453250,9
722,-2400,-454309,9
723,-2397,-455399,9
724,-2400,-456479,9
725,-2400,-457556,9
726,-2400,-458648,9
727,-2401,-459837,9
728,-2404,-460923,9
729,-2403,-461989,9
730,-2404,-463092,9
731,-2406,-464150,9
732,-2404,-465247,9
733,-2403,-466422,11
734,-2405,-467526,9
735,-2400,-468588,9
736,-2403,-469685,9
737,-2402,-470760,9
738,-2401,-471835,9
739,-2399,-473034,9
740,-2397,-474114,9
741,-2396,-475199,9
742,-2394,-476265,9
743,-2395,-477365,9
744,-2393,-478421,9
745,-2393,-479525,9
746,-2395,-480587,9
747,-2393,-481664,9
748,-2301,-481859,9
749,-1494,-481289,9
750,-521,-480365,11
751,349,-479384,9
752,932,-478365,9
753,1364,-477348,9
754,1706,-476257,9
755,1911,-475201,9
756,2077,-474129,9
757,2177,-473033,9
758,2250,-471977,9
759,2300,-470867,9
760,2332,-469694,9
761,2358,-468475,11
762,2369,-467419,9
763,2382,-466313,9
764,2387,-465261,9
765,2391,-464155,9
766,2397,-463089,9
767,2397,-462008,9
768,2400,-460921,9
769,2404,-459857,9
770,2405,-458744,9
771,2407,-457695,9
772,2406,-456471,9
773,2406,-455418,9
774,2404,-454307,9
775,2404,-453253,9
776,2405,-452149,9
777,2399,-451086,9
778,2398,-450002,9
779,2400,-448918,9
780,2396,-447852,9
781,2398,-446741,9
782,2397,-445561,11
783,2395,-444468,9
784,2392,-443416,9
785,2392,-442305,9
786,2393,-441251,9
787,2394,-440146,9
788,2396,-438972,9
789,2393,-437862,9
790,2392,-436806,9
791,2396,-435714,9
792,2396,-434633,9
793,2400,-433560,9
794,2404,-432358,11
795,2402,-431278,9
796,2404,-430189,9
797,2405,-429129,9
798,2406,-428021,9
799,2408,-426970,9
800,2407,-425860,9
801,2405,-424805,9
802,2404,-423713,9
803,2405,-422631,9
804,2404,-421424,9
805,2404,-420353,9
806,2405,-419271,9
807,2398,-418183,9
808,2398,-417124,9
809,2399,-416018,9
810,2393,-414966,9
811,2395,-413853,9
812,2394,-412800,9
813,2392,-411705,9
814,2391,-410527,11
815,2390,-409425,9
816,2392,-408247,9
817,2393,-407137,9
818,2397,-406075,9
819,2396,-404988,9
820,2396,-403907,9
821,2401,-402840,9
822,2398,-401733,9
823,2401,-400680,9
824,2403,-399571,9
825,2402,-398523,9
826,2404,-397422,9
827,2405,-396246,11
828,2404,-395135,9
829,2407,-394074,9
830,2407,-392986,9
831,2406,-391903,9
832,2404,-390838,9
833,2404,-389730,9
834,2403,-388680,9
835,2399,-387571,9
836,2400,-386521,9
837,2397,-385293,9
838,2396,-384244,9
839,2395,-383134,9
840,2392,-382074,9
841,2394,-380984,9
842,2395,-379793,11
843,2395,-378695,9
844,2395,-377623,9
845,2394,-376546,9
846,2395,-375451,9
847,2395,-374395,9
848,2399,-373175,9
849,2398,-372115,9
850,2397,-371013,9
851,2401,-369960,9
852,2398,-368846,9
853,2403,-367789,9
854,2406,-366692,9
855,2406,-365618,9
856,2408,-364542,9
857,2407,-363448,9
858,2405,-362394,9
859,2406,-361173,11
860,2405,-360110,9
861,2405,-359009,9
862,2401,-357955,9
863,2402,-356843,9
864,2401,-355789,9
865,2398,-354691,9
866,2399,-353616,9
867,2398,-352406,9
868,2397,-351340,9
869,2396,-350258,9
870,2393,-349172,9
871,2394,-347975,11
872,2393,-346896,9
873,2395,-345824,9
874,2392,-344721,9
875,2392,-343668,9
876,2395,-342560,9
877,2395,-341511,9
878,2397,-340405,9
879,2399,-339338,9
880,2400,-338252,9
881,2404,-337165,9
882,2403,-335969,9
883,2403,-334892,9
884,2406,-333820,9
885,2407,-332715,9
886,2407,-331661,9
887,2406,-330555,9
888,2405,-329508,9
889,2404,-328401,9
890,2403,-327343,9
891,2392,-326331,9
892,2314,-325309,11
893,2179,-324527,9
894,2005,-323789,9
895,1804,-323251,9
896,1589,-322848,9
897,1336,-322539,9
898,1116,-322365,9
899,832,-322312,9
900,592,-322368,9
901,334,-322544,9
902,65,-322844,9
903,-175,-323261,9
904,-487,-323874,11
905,-746,-324559,9
906,-1042,-325362,9
907,-1301,-326256,9
908,-1530,-327184,9
909,-1699,-328119,9
910,-1809,-329042,9
911,-1915,-329981,9
912,-1975,-330942,9
913,-2023,-331882,9
914,-2049,-332918,9
915,-2060,-333876,9
916,-2067,-334827,9
917,-2075,-335758,9
918,-2088,-336696,9
919,-2098,-337658,9
920,-2102,-338604,9
921,-2099,-339637,11
922,-2095,-340593,9
923,-2092,-341544,9
924,-2093,-342478,9
925,-2099,-343411,9
926,-2104,-344484,9
927,-2106,-345426,9
928,-2101,-346352,9
929,-2096,-347308,9
930,-2093,-348267,9
931,-2094,-349199,9
932,-2100,-350136,9
933,-2108,-351088,9
934,-2106,-352048,9
935,-2101,-352976,9
936,-2092,-353910,9
937,-2091,-354985,11
938,-2095,-355921,9
939,-2106,-356856,9
940,-2110,-357807,9
941,-2106,-358766,9
942,-2098,-359701,9
943,-2091,-360633,9
944,-2093,-361589,9
945,-2099,-362543,9
946,-2108,-363477,9
947,-2110,-364525,9
948,-2105,-365482,9
949,-2093,-366515,11
950,-2090,-367456,9
951,-2092,-368415,9
952,-2102,-369366,9
953,-2108,-370291,9
954,-2108,-371239,9
955,-2099,-372199,9
956,-2095,-373143,9
957,-2091,-374072,9
958,-2097,-375020,9
959,-2103,-376088,9
960,-2110,-377016,9
961,-2106,-377957,9
962,-2099,-378919,9
963,-2093,-379861,9
964,-2092,-380793,9
965,-2097,-381736,9
966,-2102,-382698,9
967,-2107,-383640,9
968,-2105,-384569,9
969,-2099,-385636,11
970,-2093,-386584,9
971,-2094,-387611,9
972,-2099,-388568,9
973,-2105,-389521,9
974,-2107,-390457,9
975,-2102,-391388,9
976,-2096,-392344,9
977,-2091,-393300,9
978,-2092,-394229,9
979,-2099,-395170,9
980,-2108,-396129,9
981,-2108,-397180,11
982,-2104,-398114,9
983,-2093,-399064,9
984,-2091,-400025,9
985,-2093,-400953,9
986,-2103,-401890,9
987,-2108,-402845,9
988,-2106,-403801,9
989,-2098,-404734,9
990,-2091,-405668,9
991,-2091,-406629,9
992,-2096,-407676,9
993,-2106,-408609,9
994,-2109,-409564,9
995,-2106,-410519,9
996,-2097,-411454,9
997,-2093,-412384,9
998,-2092,-413340,9
999,-2100,-414297,9
1000,-2105,-415225,9
1001,-2107,-416167,9
1002,-2100,-417236,11
1003,-2095,-418266,9
1004,-2091,-419213,9
1005,-2097,-420171,9
1006,-2101,-421118,9
1007,-2107,-422048,9
1008,-2105,-422993,9
1009,-2100,-423956,9
1010,-2095,-424894,9
1011,-2094,-425827,9
1012,-2098,-426776,9
1013,-2104,-427736,9
1014,-2108,-428773,11
1015,-2106,-429715,9
1016,-2100,-430676,9
1017,-2095,-431621,9
1018,-2093,-432549,9
1019,-2097,-433494,9
1020,-2102,-434451,9
1021,-2107,-435395,9
1022,-2103,-436319,9
1023,-2096,-437271,9
1024,-2090,-438339,9
1025,-2093,-439266,9
1026,-2099,-440213,9
1027,-2106,-441081,9
1028,-1801,-440719,11
1029,-831,-439708,9
1030,265,-438430,9
1031,1128,-437078,9
1032,1730,-435666,9
1033,2248,-434217,9
1034,2549,-432751,9
1035,2804,-431275,9
1036,2960,-429614,9
1037,3081,-428134,9
1038,3149,-426651,9
1039,3195,-425170,9
1040,3234,-423688,9
1041,3247,-422202,9
1042,3274,-420717,9
1043,3279,-419231,9
1044,3290,-417748,9
1045,3292,-416262,9
1046,3296,-414122,14
1047,3299,-412631,9
1048,3296,-411151,9
1049,3295,-409664,9
1050,3300,-408181,9
1051,3296,-406690,9
1052,3302,-405046,9
1053,3294,-403556,9
1054,3298,-402076,9
1055,3299,-400587,9
1056,3297,-399108,9
1057,3305,-397620,9
1058,3295,-396138,9
1059,3303,-394646,9
1060,3299,-393163,9
1061,3300,-391674,9
1062,3300,-390192,9
1063,3297,-388700,9
1064,3303,-387218,9
1065,3294,-385727,9
1066,3302,-384248,9
1067,3296,-382760,9
1068,3297,-381271,9
1069,3304,-379784,9
1070,3298,-378296,9
1071,3305,-376812,9
1072,3297,-375324,9
1073,3301,-373837,9
1074,3298,-372350,9
1075,3300,-370868,9
1076,3300,-369380,9
1077,3293,-367896,9
1078,3302,-366255,11
1079,3297,-364766,9
1080,3300,-363281,9
1081,3301,-361793,9
1082,3299,-360307,9
1083,3306,-358821,9
1084,3296,-357335,9
1085,3300,-355851,9
1086,3296,-354362,9
1087,3300,-352878,9
1088,3301,-351388,9
1089,3296,-349752,9
1090,3302,-348267,9
1091,3294,-346777,9
1092,3301,-345291,9
1093,3300,-343808,9
1094,3298,-342321,9
1095,3303,-340835,9
1096,3296,-339344,9
1097,3304,-337860,9
1098,3298,-336372,9
1099,3298,-334914,9
1100,3262,-333396,11
1101,3161,-332143,9
1102,3018,-331026,9
1103,2822,-329990,9
1104,2622,-329082,9
1105,2410,-328302,9
1106,2164,-327639,9
1107,1926,-327109,9
1108,1636,-326657,9
1109,1376,-326365,9
1110,1099,-326201,9
1111,841,-326161,9
1112,579,-326237,9
1113,287,-326463,11
1114,22,-326783,9
1115,-260,-327247,9
1116,-509,-327820,9
1117,-804,-328519,9
1118,-1063,-329339,9
1119,-1332,-330240,9
1120,-1561,-331160,9
1121,-1708,-332082,9
1122,-1837,-333022,9
1123,-1920,-333980,9
1124,-1986,-335015,9
1125,-2029,-335952,9
1126,-2050,-336909,9
1127,-2060,-337856,9
1128,-2068,-338789,9
1129,-2079,-339733,9
1130,-2089,-340694,9
1131,-2099,-341636,9
1132,-2103,-342564,9
1133,-2100,-343513,9
1134,-2094,-344576,11
1135,-2090,-345507,9
1136,-2093,-346563,9
1137,-2100,-347518,9
1138,-2109,-348454,9
1139,-2107,-349386,9
1140,-2101,-350340,9
1141,-2091,-351295,9
1142,-2091,-352225,9
1143,-2093,-353166,9
1144,-2104,-354122,9
1145,-2108,-355078,9
1146,-2107,-356108,11
1147,-2097,-357059,9
1148,-2092,-358018,9
1149,-2091,-358949,9
1150,-2101,-359886,9
1151,-2107,-360841,9
1152,-2109,-361796,9
1153,-2103,-362729,9
1154,-2095,-363665,9
1155,-2092,-364625,9
1156,-2094,-365675,9
1157,-2103,-366603,9
1158,-2108,-367557,9
1159,-2106,-368512,9
1160,-2099,-369449,9
1161,-2095,-370493,11
1162,-2092,-371453,9
1163,-2097,-372395,9
1164,-2103,-373321,9
1165,-2108,-374272,9
1166,-2106,-375231,9
1167,-2099,-376169,9
1168,-2094,-377211,9
1169,-2093,-378168,9
1170,-2098,-379117,9
1171,-2104,-380048,9
1172,-2109,-380993,9
1173,-2106,-381951,9
1174,-2098,-382891,9
1175,-2092,-383824,9
1176,-2094,-384773,9
1177,-2098,-385735,9
1178,-2105,-386674,9
1179,-2109,-387709,11
1180,-2104,-388672,9
1181,-2095,-389615,9
1182,-2090,-390542,9
1183,-2092,-391488,9
1184,-2099,-392447,9
1185,-2108,-393392,9
1186,-2108,-394317,9
1187,-2105,-395269,9
1188,-2092,-396227,9
1189,-2090,-397260,9
1190,-2094,-398314,11
1191,-2104,-399275,9
1192,-2110,-400208,9
1193,-2109,-401147,9
1194,-2098,-402101,9
1195,-2093,-403057,9
1196,-2090,-403986,9
1197,-2099,-404922,9
1198,-2105,-405881,9
1199,-2109,-406832,9
1200,-2104,-407765,9
1201,-2097,-408818,9
1202,-2091,-409777,9
1203,-2094,-410711,9
1204,-2100,-411642,9
1205,-2105,-412599,9
1206,-2107,-413552,9
1207,-2100,-414485,9
1208,-2095,-415419,9
1209,-2092,-416377,9
1210,-2095,-417330,9
1211,-2101,-418355,11
1212,-2107,-419310,9
1213,-2105,-420270,9
1214,-2100,-421204,9
1215,-2094,-422250,9
1216,-2093,-423207,9
1217,-2096,-424152,9
1218,-2103,-425084,9
1219,-2109,-426032,9
1220,-2107,-426994,9
1221,-2100,-427929,9
1222,-2093,-428863,9
1223,-2093,-429929,11
1224,-2095,-430872,9
1225,-2105,-431803,9
1226,-2108,-432748,9
1227,-2104,-433710,9
1228,-2096,-434652,9
1229,-2091,-435579,9
1230,-2092,-436527,9
1231,-2096,-437483,9
1232,-2106,-438425,9
1233,-2107,-439353,9
1234,-2104,-440425,9
1235,-2094,-441373,9
1236,-2084,-441853,9
1237,-1481,-441178,9
1238,-462,-439971,9
1239,547,-438758,9
1240,1340,-437402,9
1241,1927,-435951,9
1242,2361,-434474,9
1243,2663,-432836,11
1244,2893,-431353,9
1245,3021,-429688,9
1246,3129,-428206,9
1247,3176,-426721,9
1248,3225,-425232,9
1249,3246,-423750,9
1250,3263,-422265,9
1251,3277,-420780,9
1252,3280,-419295,9
1253,3292,-417812,9
1254,3289,-416326,9
1255,3297,-414842,9
1256,3297,-413181,11
1257,3298,-411697,9
1258,3302,-410215,9
1259,3295,-408733,9
1260,3302,-407247,9
1261,3296,-405763,9
1262,3301,-404279,9
1263,3297,-402796,9
1264,3295,-401312,9
1265,3302,-399827,9
1266,3296,-398164,9
1267,3302,-396682,9
1268,3297,-395199,9
1269,3300,-393531,11
1270,3304,-392050,9
1271,3298,-390561,9
1272,3305,-389081,9
1273,3297,-387596,9
1274,3300,-386113,9
1275,3299,-384626,9
1276,3294,-383146,9
1277,3302,-381662,9
1278,3295,-380000,9
1279,3304,-378511,9
1280,3302,-377031,9
1281,3301,-375544,9
1282,3303,-374060,9
1283,3298,-372575,9
1284,3304,-371095,9
1285,3295,-369610,9
1286,3301,-368126,9
1287,3297,-366637,9
1288,3298,-365154,9
1289,3304,-363494,11
1290,3293,-362011,9
1291,3303,-360524,9
1292,3299,-359043,9
1293,3300,-357557,9
1294,3301,-356074,9
1295,3296,-354589,9
1296,3303,-352936,9
1297,3298,-351446,9
1298,3303,-349965,9
1299,3298,-348478,9
1300,3296,-346833,11
1301,3303,-345347,9
1302,3294,-343864,9
1303,3300,-342376,9
1304,3296,-340894,9
1305,3299,-339403,9
1306,3303,-337919,9
1307,3300,-336433,9
1308,3295,-335010,9
1309,3231,-333694,9
1310,3120,-332494,9
1311,2971,-331255,9
1312,2740,-330314,9
1313,2542,-329465,9
1314,2285,-328730,9
1315,2045,-328121,9
1316,1803,-327621,9
1317,1530,-327272,9
1318,1291,-326955,9
1319,1075,-326708,9
1320,895,-326507,9
1321,737,-326315,11
1322,603,-326186,9
1323,488,-326089,9
1324,376,-326035,9
1325,291,-326009,9
1326,200,-326006,11
1327,136,-326017,9
1328,76,-326023,9
1329,49,-326023,9
1330,32,-326020,9
1331,23,-326020,9
1332,15,-326021,9
1333,9,-326021,11
1334,5,-326021,9
1335,4,-326021,9
1336,3,-326020,9
1337,1,-326021,9
1338,0,-326021,9
1339,0,-326021,9
1340,1,-326021,11
1341,1,-326020,9
1342,1,-326021,9
1343,0,-326020,9
1344,0,-326021,11
1345,0,-326021,9
1346,0,-326021,9
1347,0,-326021,9
1348,0,-326021,11
1349,0,-326021,9
1350,0,-326021,9
1351,0,-326021,9
1352,0,-326021,9
1353,0,-326021,9
1354,0,-326021,9
1355,0,-326021,9
1356,0,-326021,9
1357,0,-326021,9
1358,0,-326021,9
1359,-1,-326021,11
1360,-1,-326021,9
1361,-1,-326021,9
1362,-1,-326021,9
1363,0,-326021,9
1364,0,-326022,9
1365,0,-326021,9
1366,0,-326021,9
1367,-1,-326021,9
1368,-1,-326022,9
1369,0,-326021,9
1370,0,-326021,9
1371,0,-326022,9
1372,-1,-326021,9
1373,-1,-326022,11
1374,0,-326021,9
1375,0,-326021,9
1376,-1,-326020,9
1377,-1,-326021,9
1378,-1,-326021,9
1379,0,-326021,11
1380,0,-326021,9
1381,0,-326021,9
1382,0,-326021,9
1383,0,-326021,9
1384,0,-326021,9
1385,0,-326022,9
1386,-1,-326020,9
1387,-1,-326022,9
1388,0,-326021,9
1389,0,-326021,11
1390,0,-326021,9
1391,0,-326021,9
1392,0,-326021,9
1393,-1,-326022,9
1394,-1,-326021,9
1395,0,-326022,9
1396,0,-326021,11
1397,0,-326020,9
1398,0,-326021,9
1399,0,-326020,9
1400,0,-326021,9
1401,0,-326021,9
1402,0,-326022,9
1403,0,-326022,11
1404,0,-326021,9
1405,0,-326021,11
1406,0,-326022,9
1407,0,-326021,9
1408,0,-326021,11
1409,0,-326022,9
1410,-1,-326021,9
1411,-1,-326022,9
1412,0,-326021,9
1413,0,-326021,9
1414,0,-326021,9
1415,0,-326021,11
1416,0,-326020,9
1417,0,-326021,9
1418,0,-326022,9
1419,0,-326021,9
1420,0,-326021,11
1421,0,-326021,9
1422,0,-326022,9
1423,0,-326021,9
1424,0,-326021,9
1425,0,-326021,9
1426,0,-326022,11
1427,0,-326021,9
1428,0,-326021,9
1429,0,-326021,9
1430,-1,-326020,9
1431,-1,-326021,9
1432,-1,-326021,11
1433,0,-326021,9
1434,0,-326020,9
1435,0,-326021,9
1436,0,-326021,9
1437,-1,-326021,9
1438,-1,-326021,9
1439,-1,-326021,9
1440,-1,-326021,9
1441,0,-326021,9
1442,-1,-326021,9
1443,0,-326021,9
1444,-1,-326020,9
1445,-1,-326021,9
1446,-1,-326020,9
1447,-1,-326021,9
1448,0,-326021,9
1449,0,-326021,9
1450,-1,-326021,9
1451,-1,-326021,9
1452,-1,-326021,9
1453,-1,-326021,9
1454,-1,-326021,11
1455,-1,-326021,9
1456,-1,-326021,9
1457,-1,-326021,9
1458,-1,-326021,9
1459,-1,-326021,9
1460,-1,-326021,9
1461,-1,-326021,11
1462,-1,-326021,9
1463,-1,-326021,9
1464,0,-326020,9
1465,0,-326020,9
1466,-1,-326021,9
1467,-1,-326021,9
1468,0,-326021,9
1469,0,-326021,9
1470,0,-326021,9
1471,0,-326021,9
1472,0,-326021,9
1473,0,-326021,9
1474,0,-326021,9
1475,0,-326021,9
1476,0,-326021,9
1477,0,-326021,9
1478,0,-326021,9
1479,0,-326021,11
1480,0,-326020,9
1481,-1,-326021,11
1482,0,-326020,9
1483,0,-326022,9
1484,-1,-326020,9
1485,-1,-326021,9
1486,-1,-326020,9
1487,-1,-326021,9
1488,0,-326022,11
1489,0,-326021,9
1490,-1,-326021,9
1491,0,-326021,9
1492,0,-326021,9
1493,-1,-326022,11
1494,-1,-326021,9
1495,0,-326021,9
1496,-1,-326021,11
1497,0,-326021,9
1498,0,-326021,9
1499,0,-326021,9
1500,0,-326021,9
1501,0,-326021,9
1502,0,-326021,9
1503,0,-326021,9
1504,0,-326021,9
1505,0,-326020,9
1506,0,-326021,9
1507,0,-326021,9
1508,0,-326021,9
1509,0,-326021,9
1510,0,-326021,9
1511,0,-326021,9
1512,0,-326021,9
1513,0,-326021,9
1514,0,-326021,9
1515,0,-326020,9
1516,0,-326021,11
1517,-1,-326021,9
1518,0,-326021,9
1519,0,-326021,9
1520,-1,-326021,9
1521,-1,-326021,9
1522,0,-326021,11
1523,0,-326021,9
1524,0,-326022,9
1525,0,-326021,9
1526,0,-326021,9
1527,0,-326021,9
1528,0,-326021,9
1529,0,-326021,9
1530,0,-326020,9
1531,0,-326020,9
1532,0,-326021,11
1533,0,-326021,9
1534,0,-326021,9
1535,0,-326021,9
1536,0,-326021,9
1537,0,-326021,9
1538,0,-326021,9
1539,0,-326021,9
1540,0,-326021,9
1541,0,-326021,9
1542,0,-326021,9
1543,0,-326021,9
1544,0,-326021,11
1545,0,-326022,9
1546,-1,-326021,9
1547,-1,-326021,9
1548,-1,-326021,9
1549,-1,-326021,9
1550,0,-326021,9
1551,0,-326021,9
1552,-1,-326021,9
1553,-1,-326021,9
1554,-1,-326021,9
1555,0,-326021,9
1556,0,-326021,9
1557,0,-326021,11
1558,0,-326021,9
1559,0,-326022,9
1560,0,-326021,9
1561,0,-326022,9
1562,0,-326021,9
1563,0,-326021,9
1564,0,-326020,9
1565,0,-326021,9
1566,0,-326021,11
1567,0,-326022,9
1568,0,-326021,9
1569,-1,-326021,9
1570,-1,-326022,9
1571,-1,-326021,11
1572,-1,-326022,9
1573,-1,-326021,9
1574,-1,-326021,9
1575,-1,-326021,9
1576,-1,-326021,9
1577,-1,-326021,9
1578,0,-326021,9
1579,0,-326021,9
1580,-1,-326021,9
1581,-1,-326021,9
1582,-1,-326021,9
1583,-1,-326021,9
1584,-1,-326021,9
1585,-1,-326022,9
1586,-1,-326021,9
1587,-1,-326022,9
1588,0,-326021,11
1589,0,-326021,9
1590,-1,-326021,9
1591,0,-326021,9
1592,0,-326021,9
1593,-1,-326021,9
1594,-1,-326021,9
1595,-1,-326021,9
1596,-1,-326021,9
1597,0,-326021,9
1598,0,-326021,11
1599,0,-326022,9
1600,0,-326021,9
1601,0,-326021,9
1602,-1,-326021,9
1603,-1,-326021,9
1604,-1,-326021,9
1605,-1,-326021,9
1606,-1,-326020,9
1607,-1,-326021,9
1608,-1,-326020,9
1609,-1,-326021,11
1610,-1,-326020,9
1611,-1,-326021,9
1612,-1,-326021,9
1613,-1,-326021,9
1614,-1,-326021,9
1615,0,-326022,9
1616,0,-326021,9
1617,0,-326021,9
1618,0,-326021,9
1619,0,-326021,9
1620,0,-326021,9
1621,0,-326021,9
1622,-1,-326021,9
1623,-1,-326021,11
1624,-1,-326021,9
1625,-1,-326021,9
1626,-1,-326021,9
1627,-1,-326021,9
1628,0,-326021,9
1629,0,-326021,9
1630,0,-326021,9
1631,0,-326021,9
1632,0,-326021,11
1633,-1,-326021,9
1634,-1,-326021,9
1635,-1,-326021,9
1636,-1,-326021,9
1637,-1,-326021,9
1638,0,-326021,9
1639,0,-326021,9
1640,-1,-326021,9
1641,-1,-326021,11
1642,0,-326021,9
1643,-1,-326021,11
1644,0,-326022,9
1645,0,-326021,9
1646,0,-326021,9
1647,0,-326022,9
1648,0,-326022,9
1649,0,-326020,9
1650,0,-326021,9
1651,0,-326021,11
1652,0,-326021,9
1653,0,-326021,9
1654,0,-326021,9
1655,0,-326020,9
1656,0,-326021,9
1657,0,-326021,9
1658,0,-326021,9
1659,0,-326021,9
1660,0,-326021,9
1661,0,-326021,9
1662,0,-326021,9
1663,0,-326021,9
1664,0,-326021,9
1665,0,-326021,9
1666,0,-326021,9
1667,0,-326020,9
1668,0,-326021,9
1669,0,-326021,11
1670,0,-326021,9
1671,0,-326021,9
1672,0,-326020,9
1673,-1,-326021,9
1674,-1,-326021,9
1675,-1,-326021,9
1676,-1,-326021,11
1677,0,-326020,9
1678,0,-326021,11
1679,0,-326021,9
1680,0,-326021,9
1681,0,-326020,14
1682,-1,-326022,9
1683,0,-326021,9
1684,0,-326021,9
1685,0,-326021,9
1686,0,-326021,9
1687,-1,-326021,9
1688,-1,-326021,9
1689,-1,-326021,9
1690,-1,-326021,9
1691,-1,-326022,9
1692,-1,-326020,9
1693,0,-326021,9
1694,0,-326020,9
1695,0,-326021,9
1696,0,-326020,9
1697,0,-326021,9
1698,0,-326021,9
1699,0,-326021,9
1700,0,-326021,9
1701,0,-326021,9
1702,0,-326021,9
1703,-1,-326021,9
1704,-1,-326021,9
1705,-1,-326020,9
1706,-1,-326021,9
1707,-1,-326021,9
1708,-1,-326021,9
1709,-1,-326021,11
1710,-1,-326020,9
1711,-1,-326021,9
1712,-1,-326021,9
1713,-1,-326021,9
1714,-1,-326021,9
1715,-1,-326021,9
1716,0,-326021,9
1717,0,-326021,9
1718,0,-326021,9
1719,0,-326021,9
1720,-1,-326021,9
1721,-1,-326021,9
1722,-1,-326021,9
1723,-1,-326021,9
1724,-1,-326021,9
1725,-1,-326021,9
1726,-1,-326021,9
1727,-1,-326021,9
1728,-1,-326022,9
1729,0,-326021,9
1730,0,-326021,9
1731,0,-326021,11
1732,0,-326021,9
1733,0,-326020,9
1734,0,-326021,9
1735,-1,-326021,9
1736,-1,-326020,9
1737,-1,-326021,9
1738,-1,-326021,9
1739,-1,-326021,9
1740,-1,-326020,9
1741,0,-326021,9
1742,0,-326021,9
1743,0,-326020,9
1744,0,-326021,9
1745,0,-326020,9
1746,0,-326021,9
1747,-1,-326021,9
1748,0,-326021,9
1749,0,-326020,9
1750,0,-326021,9
1751,0,-326021,9
1752,0,-326021,9
1753,0,-326021,11
1754,0,-326021,9
1755,1,-326021,9
1756,1,-326020,9
1757,0,-326021,9
1758,0,-326021,9
1759,0,-326021,9
1760,-1,-326021,9
1761,-1,-326021,9
1762,-1,-326021,9
1763,-1,-326021,9
1764,-1,-326021,9
1765,-1,-326020,9
1766,0,-326021,9
1767,0,-326021,9
1768,0,-326021,9
1769,0,-326021,9
1770,0,-326021,9
1771,0,-326021,9
1772,0,-326021,9
1773,0,-326021,9
1774,0,-326020,9
1775,0,-326020,11
1776,0,-326021,9
1777,0,-326021,9
1778,0,-326021,9
1779,-1,-326021,9
1780,-1,-326021,9
1781,-1,-326021,9
1782,0,-326021,9
1783,0,-326021,9
1784,0,-326021,9
1785,0,-326021,9
1786,0,-326021,9
1787,-1,-326020,9
1788,0,-326021,9
1789,0,-326021,9
1790,0,-326020,9
1791,0,-326022,9
1792,0,-326021,9
1793,0,-326021,9
1794,0,-326021,9
1795,-1,-326021,9
1796,-1,-326021,9
1797,-1,-326021,11
1798,-1,-326020,9
1799,-1,-326021,9
1800,-1,-326022,9
1801,-1,-326021,9
1802,-1,-326021,9
1803,-1,-326021,9
1804,-1,-326021,9
1805,0,-326020,9
1806,-1,-326021,9
1807,-1,-326021,9
1808,0,-326021,9
1809,0,-326021,9
1810,0,-326021,9
1811,0,-326020,9
1812,0,-326021,9
1813,0,-326021,9
1814,0,-326020,9
1815,0,-326021,9
1816,0,-326021,9
1817,0,-326021,9
1818,0,-326021,9
1819,0,-326021,11
1820,0,-326021,9
1821,0,-326021,9
1822,0,-326021,9
1823,0,-326022,9
1824,0,-326021,9
1825,0,-326021,9
1826,0,-326020,9
1827,0,-326021,9
1828,0,-326021,9
1829,0,-326021,9
1830,0,-326021,9
1831,0,-326021,9
1832,0,-326021,9
1833,0,-326021,9
1834,0,-326021,9
1835,-1,-326020,9
1836,-1,-326021,9
1837,-1,-326021,9
1838,-1,-326021,9
1839,-1,-326021,9
1840,0,-326020,9
1841,0,-326021,11
1842,0,-326020,9
1843,0,-326021,9
1844,0,-326021,9
1845,0,-326021,9
1846,0,-326021,9
1847,0,-326021,9
1848,0,-326021,9
1849,0,-326021,9
1850,0,-326020,9
1851,0,-326021,9
1852,0,-326021,9
1853,0,-326021,11
1854,0,-326022,9
1855,0,-326021,9
1856,0,-326021,11
1857,0,-326021,9
1858,0,-326021,9
1859,0,-326021,9
1860,0,-326021,9
1861,0,-326021,9
1862,0,-326021,9
1863,0,-326021,9
1864,-1,-326021,9
1865,-1,-326021,9
1866,-1,-326021,9
1867,-1,-326021,9
1868,0,-326021,9
1869,0,-326021,9
1870,0,-326021,9
1871,-1,-326021,9
1872,-1,-326020,9
1873,0,-326021,9
1874,0,-326021,9
1875,0,-326021,9
1876,0,-326021,9
1877,0,-326021,9
1878,0,-326021,9
1879,0,-326021,9
1880,0,-326021,9
1881,0,-326021,9
1882,0,-326021,9
1883,0,-326021,9
1884,0,-326021,9
1885,0,-326021,9
1886,0,-326021,9
1887,0,-326021,9
1888,0,-326021,9
1889,0,-326021,9
1890,0,-326022,9
1891,0,-326021,9
1892,0,-326021,9
1893,0,-326021,9
1894,0,-326021,9
1895,0,-326021,9
1896,0,-326021,9
1897,0,-326021,9
1898,0,-326021,9
1899,0,-326021,9
1900,0,-326021,9
1901,0,-326021,9
1902,0,-326022,9
1903,0,-326021,9
1904,0,-326021,9
1905,0,-326021,9
1906,0,-326021,9
1907,0,-326021,11
1908,0,-326021,9
1909,0,-326020,9
1910,-1,-326021,9
1911,-1,-326020,9
1912,-1,-326021,9
1913,-1,-326021,9
1914,-1,-326020,9
1915,-1,-326021,9
1916,-1,-326021,9
1917,-1,-326021,9
1918,-1,-326020,9
1919,-1,-326021,9
1920,-1,-326021,9
1921,-1,-326021,9
1922,0,-326021,9
1923,0,-326021,9
1924,0,-326021,9
1925,0,-326021,9
1926,0,-326021,9
1927,-1,-326021,9
1928,-1,-326020,9
1929,-1,-326021,11
1930,-1,-326021,9
1931,0,-326021,9
1932,0,-326021,9
1933,0,-326022,9
1934,0,-326021,9
1935,0,-326021,9
1936,-1,-326021,9
1937,-1,-326021,9
1938,-1,-326021,9
1939,0,-326022,9
1940,0,-326021,9
1941,0,-326021,9
1942,-1,-326021,11
1943,-1,-326021,9
1944,-1,-326020,9
1945,-1,-326021,9
1946,-1,-326021,9
1947,0,-326021,9
1948,0,-326020,9
1949,0,-326021,9
1950,0,-326021,9
1951,0,-326021,9
1952,0,-326021,9
1953,0,-326020,9
1954,0,-326021,9
1955,-1,-326021,9
1956,-1,-326021,9
1957,-1,-326021,9
1958,-1,-326021,9
1959,-1,-326021,9
1960,-1,-326021,9
1961,-1,-326021,9
1962,-1,-326021,9
1963,-1,-326021,9
1964,-1,-326021,9
1965,-1,-326022,9
1966,-1,-326021,9
1967,-1,-326022,9
1968,-1,-326021,9
1969,-1,-326020,9
1970,-1,-326021,9
1971,-1,-326021,9
1972,-1,-326021,9
1973,0,-326021,11
1974,0,-326021,9
1975,0,-326021,9
1976,0,-326020,9
1977,0,-326021,9
1978,0,-326021,9
1979,0,-326020,9
1980,0,-326021,9
1981,0,-326021,9
1982,0,-326021,9
1983,0,-326020,9
1984,-1,-326021,9
1985,-1,-326021,9
1986,-1,-326020,9
1987,-1,-326021,9
1988,0,-326022,9
1989,0,-326021,9
1990,0,-326021,11
1991,0,-326021,9
1992,0,-326020,9
1993,0,-326020,9
1994,-1,-326021,9
1995,-1,-326021,9
1996,-1,-326021,9
1997,-1,-326022,9
1998,-1,-326021,9
1999,-1,-326021,9
2000,-1,-326021,9
2001,-1,-326021,9
2002,0,-326021,9
2003,0,-326020,9
2004,0,-326021,11
2005,0,-326020,9
2006,0,-326021,9
2007,0,-326021,11
2008,0,-326021,9
2009,0,-326021,9
2010,0,-326020,9
2011,0,-326021,9
2012,0,-326021,9
2013,0,-326021,9
2014,0,-326021,9
2015,0,-326021,9
2016,0,-326021,9
2017,0,-326021,9
2018,0,-326020,9
2019,0,-326021,9
2020,0,-326021,11
2021,0,-326022,9
2022,0,-326021,9
2023,0,-326021,9
2024,0,-326021,9
2025,0,-326021,9
2026,0,-326021,9
2027,0,-326020,9
2028,-1,-326021,9
2029,0,-326021,9
2030,-1,-326021,9
2031,-1,-326021,9
2032,0,-326021,9
2033,0,-326021,9
2034,-1,-326020,9
2035,-1,-326021,9
2036,-1,-326020,9
2037,-1,-326021,9
2038,-1,-326021,9
2039,-1,-326021,9
2040,-1,-326021,9
2041,-1,-326021,9
2042,-1,-326020,9
2043,0,-326021,9
2044,0,-326021,9
2045,0,-326021,9
2046,0,-326021,9
2047,0,-326021,9
2048,0,-326021,9
2049,0,-326021,9
2050,0,-326021,9
2051,0,-326021,9
2052,0,-326021,9
2053,0,-326022,9
2054,0,-326021,9
2055,0,-326021,9
2056,0,-326020,9
2057,0,-326021,9
2058,0,-326020,9
2059,0,-326021,9
2060,-1,-326021,9
2061,-1,-326021,9
2062,-1,-326020,9
2063,0,-326020,9
2064,0,-326021,9
2065,-1,-326022,9
2066,0,-326021,9
2067,0,-326021,9
2068,0,-326021,9
2069,0,-326021,9
2070,0,-326021,9
2071,-1,-326021,11
2072,-1,-326020,9
2073,0,-326021,9
2074,0,-326021,9
2075,0,-326021,9
2076,0,-326021,9
2077,0,-326021,9
2078,0,-326021,9
2079,-1,-326021,9
2080,-1,-326021,9
2081,-1,-326021,9
2082,-1,-326021,9
2083,-1,-326021,9
2084,-1,-326021,9
2085,-1,-326021,9
2086,0,-326021,9
2087,0,-326021,9
2088,0,-326021,9
2089,0,-326021,9
2090,0,-326021,9
2091,-1,-326021,9
2092,0,-326021,11
2093,0,-326021,9
2094,-1,-326020,9
2095,-1,-326021,9
2096,-1,-326021,9
2097,-1,-326021,9
2098,-1,-326021,9
2099,-1,-326022,9
2100,-1,-326021,9
2101,-1,-326021,9
2102,-1,-326022,9
2103,-1,-326021,9
2104,-1,-326020,9
2105,-1,-326022,9
2106,-1,-326021,9
2107,-1,-326021,9
2108,-1,-326022,9
2109,-1,-326021,9
2110,-1,-326021,9
2111,-1,-326021,11
2112,-1,-326021,9
2113,0,-326020,9
2114,0,-326021,9
2115,-1,-326021,9
2116,-1,-326021,9
2117,-1,-326021,9
2118,0,-326021,9
2119,0,-326021,9
2120,0,-326021,9
2121,0,-326021,9
2122,0,-326021,11
2123,0,-326021,9
2124,0,-326020,9
2125,0,-326021,9
2126,0,-326021,9
2127,0,-326021,9
2128,0,-326021,9
2129,0,-326021,9
2130,0,-326021,9
2131,0,-326021,9
2132,0,-326021,9
2133,0,-326021,9
2134,0,-326021,9
2135,-1,-326021,9
2136,-1,-326022,9
2137,-1,-326020,9
2138,0,-326021,9
2139,0,-326020,9
2140,-1,-326021,9
2141,-1,-326021,9
2142,-1,-326021,9
2143,-1,-326021,11
2144,-1,-326021,9
2145,0,-326021,9
2146,0,-326021,9
2147,0,-326021,9
2148,0,-326021,9
2149,0,-326021,9
2150,0,-326021,9
2151,0,-326021,9
2152,0,-326021,9
2153,0,-326021,9
2154,0,-326021,9
2155,0,-326022,11
2156,0,-326021,9
2157,0,-326021,9
2158,0,-326021,9
2159,0,-326021,9
2160,0,-326020,9
2161,-1,-326021,9
2162,-1,-326022,9
2163,0,-326021,9
2164,0,-326020,9
2165,0,-326021,9
2166,-1,-326021,9
2167,-1,-326022,9
2168,-1,-326021,9
2169,-1,-326021,11
2170,-1,-326021,9
2171,-1,-326020,9
2172,-1,-326021,9
2173,0,-326021,9
2174,0,-326021,9
2175,0,-326021,9
2176,0,-326020,9
2177,0,-326021,9
2178,0,-326022,9
2179,0,-326020,9
2180,-1,-326021,9
2181,-1,-326020,9
2182,-1,-326021,9
2183,-1,-326020,9
2184,-1,-326021,9
2185,-1,-326020,9
2186,0,-326021,9
2187,0,-326021,9
2188,-1,-326021,11
2189,0,-326021,9
2190,0,-326021,9
2191,-1,-326021,9
2192,0,-326021,9
2193,0,-326021,9
2194,-1,-326021,9
2195,-1,-326021,9
2196,-1,-326021,9
2197,-1,-326021,9
2198,0,-326021,9
2199,0,-326021,9
2200,0,-326021,11
2201,0,-326021,9
2202,0,-326021,9
2203,0,-326021,9
2204,0,-326021,9
2205,0,-326021,9
2206,0,-326021,9
2207,0,-326021,9
2208,0,-326021,9
2209,0,-326020,9
2210,0,-326020,9
2211,0,-326020,9
2212,0,-326021,9
2213,0,-326021,9
2214,0,-326021,9
2215,0,-326020,9
2216,0,-326021,9
2217,0,-326021,9
2218,0,-326020,9
2219,0,-326021,9
2220,0,-326021,11
2221,0,-326020,9
2222,0,-326021,9
2223,0,-326021,9
2224,0,-326021,9
2225,0,-326021,9
2226,0,-326021,9
2227,0,-326021,9
2228,-1,-326021,9
2229,-1,-326021,9
2230,-1,-326022,9
2231,0,-326021,9
2232,0,-326021,11
2233,0,-326021,9
2234,0,-326021,9
2235,0,-326021,9
2236,0,-326021,9
2237,0,-326022,9
2238,-1,-326021,9
2239,-1,-326021,9
2240,-1,-326021,9
2241,-1,-326020,9
2242,0,-326021,9
2243,0,-326021,11
2244,0,-326020,9
2245,0,-326021,9
2246,0,-326021,9
2247,0,-326021,9
2248,0,-326021,9
2249,0,-326022,9
2250,-1,-326021,9
2251,0,-326020,9
2252,0,-326021,9
2253,0,-326021,9
2254,0,-326021,9
2255,0,-326021,9
2256,0,-326021,9
2257,0,-326021,9
2258,0,-326021,9
2259,0,-326021,9
2260,0,-326021,9
2261,0,-326021,9
2262,0,-326021,9
2263,0,-326021,9
2264,0,-326021,9
2265,0,-326020,11
2266,0,-326021,9
2267,0,-326021,9
2268,0,-326021,9
2269,0,-326021,11
2270,0,-326021,9
2271,0,-326021,9
2272,0,-326021,9
2273,0,-326021,9
2274,0,-326021,9
2275,0,-326021,9
2276,0,-326021,9
2277,0,-326020,9
2278,0,-326021,11
2279,0,-326021,9
2280,0,-326021,9
2281,-1,-326021,9
2282,-1,-326021,9
2283,0,-326021,9
2284,0,-326021,9
2285,-1,-326021,9
2286,-1,-326021,9
2287,-1,-326021,9
2288,-1,-326021,9
2289,0,-326021,9
2290,0,-326022,9
2291,0,-326021,9
2292,-1,-326021,9
2293,-1,-326021,9
2294,-1,-326021,9
2295,-1,-326020,9
2296,-1,-326021,9
2297,-1,-326021,9
2298,-1,-326021,9
2299,-1,-326021,9
2300,-1,-326022,9
2301,-1,-326021,9
2302,0,-326021,9
2303,0,-326021,9
2304,0,-326021,9
2305,0,-326021,9
2306,0,-326020,9
2307,0,-326021,9
2308,0,-326021,9
2309,0,-326020,11
2310,0,-326021,9
2311,0,-326021,9
2312,0,-326021,9
2313,-1,-326021,9
2314,-1,-326021,9
2315,-1,-326021,9
2316,-1,-326021,9
2317,-1,-326020,9
2318,-1,-326021,9
2319,0,-326021,9
2320,0,-326021,9
2321,0,-326021,9
2322,0,-326021,9
2323,0,-326020,9
2324,0,-326021,9
2325,0,-326021,9
2326,-1,-326021,9
2327,-1,-326021,9
2328,-1,-326021,9
2329,-1,-326021,9
2330,0,-326021,9
2331,0,-326020,11
2332,0,-326021,9
2333,0,-326021,9
2334,0,-326021,9
2335,0,-326021,9
2336,0,-326021,9
2337,0,-326021,9
2338,0,-326021,9
2339,-1,-326021,9
2340,-1,-326021,9
2341,-1,-326021,9
2342,-1,-326021,11
2343,-1,-326021,9
2344,-1,-326021,9
2345,0,-326021,9
2346,0,-326022,9
2347,0,-326021,9
2348,-1,-326021,9
2349,-1,-326021,9
2350,-1,-326021,9
2351,-1,-326021,9
2352,-1,-326021,9
2353,-1,-326022,9
2354,-1,-326021,9
2355,-1,-326021,9
2356,-1,-326021,9
2357,0,-326021,9
2358,0,-326021,9
2359,0,-326021,9
2360,0,-326021,9
2361,0,-326021,9
2362,0,-326021,11
2363,0,-326021,9
2364,0,-326021,9
2365,0,-326021,9
2366,0,-326021,9
2367,-1,-326021,9
2368,0,-326021,9
2369,0,-326020,9
2370,0,-326021,9
2371,0,-326020,11
2372,0,-326021,9
2373,-1,-326021,9
2374,-1,-326022,9
2375,0,-326021,9
2376,0,-326022,9
2377,0,-326020,9
2378,-1,-326021,9
2379,0,-326020,9
2380,0,-326021,9
2381,-1,-326021,9
2382,-1,-326021,11
2383,-1,-326021,9
2384,-1,-326021,9
2385,-1,-326021,9
2386,0,-326021,9
2387,0,-326021,9
2388,-1,-326021,9
2389,-1,-326021,9
2390,-1,-326021,9
2391,0,-326021,9
2392,0,-326020,9
2393,0,-326021,9
2394,0,-326021,9
2395,0,-326021,9
2396,0,-326021,11
2397,0,-326020,9
2398,0,-326022,9
2399,0,-326020,9
2400,0,-326021,9
2401,0,-326021,9
2402,0,-326021,9
2403,0,-326021,9
2404,0,-326021,9
2405,0,-326021,9
2406,-1,-326021,9
2407,-1,-326021,9
2408,0,-326021,9
2409,0,-326021,9
2410,-1,-326021,9
2411,-1,-326021,9
2412,-1,-326021,9
2413,-1,-326022,9
2414,-1,-326020,9
2415,-1,-326021,9
2416,0,-326020,11
2417,0,-326021,9
2418,0,-326020,9
2419,0,-326021,9
2420,0,-326021,9
2421,0,-326020,9
2422,0,-326021,9
2423,0,-326021,9
2424,0,-326021,9
2425,0,-326020,9
2426,0,-326021,9
2427,0,-326021,9
2428,0,-326021,9
2429,0,-326021,9
2430,-1,-326020,9
2431,-1,-326021,9
2432,-1,-326020,9
2433,-1,-326021,9
2434,-1,-326020,9
2435,-1,-326021,9
2436,-1,-326021,9
2437,-1,-326021,9
2438,-1,-326021,9
2439,-1,-326021,9
2440,-1,-326021,11
2441,-1,-326021,9
2442,-1,-326021,9
2443,-1,-326021,9
2444,-1,-326022,9
2445,-1,-326021,9
2446,0,-326021,9
2447,0,-326021,9
2448,0,-326020,9
2449,0,-326020,9
2450,0,-326021,9
2451,0,-326022,9
2452,0,-326021,11
2453,0,-326020,9
2454,0,-326021,9
2455,0,-326020,9
2456,0,-326021,9
2457,0,-326021,9
2458,0,-326020,9
2459,-1,-326021,9
2460,-1,-326021,9
2461,-1,-326021,9
2462,-1,-326022,9
2463,-1,-326021,9
2464,0,-326021,9
2465,0,-326021,9
2466,-1,-326021,9
2467,-1,-326020,11
2468,-1,-326021,9
2469,-1,-326021,9
2470,-1,-326022,9
2471,-1,-326021,9
2472,-1,-326021,9
2473,-1,-326021,9
2474,0,-326021,9
2475,0,-326021,9
2476,0,-326021,9
2477,0,-326021,9
2478,0,-326021,9
2479,0,-326022,9
2480,0,-326021,9
2481,0,-326021,9
2482,0,-326021,9
2483,0,-326021,9
2484,0,-326021,9
2485,0,-326021,11
2486,0,-326020,9
2487,0,-326021,9
2488,0,-326021,9
2489,0,-326021,9
2490,0,-326021,9
2491,0,-326022,9
2492,0,-326021,9
2493,0,-326021,9
2494,-1,-326021,9
2495,-1,-326021,9
2496,-1,-326022,11
2497,-1,-326021,9
2498,-1,-326021,9
2499,-1,-326021,9
2500,-1,-326021,9
2501,0,-326021,9
2502,0,-326021,9
2503,0,-326021,9
2504,0,-326021,9
2505,0,-326021,9
2506,0,-326020,9
2507,0,-326020,9
2508,0,-326021,9
2509,0,-326021,9
2510,0,-326021,9
2511,0,-326021,9
2512,0,-326020,9
2513,0,-326021,9
2514,-1,-326021,9
2515,-1,-326020,9
2516,-1,-326021,9
2517,-1,-326021,11
2518,-1,-326021,9
2519,-1,-326021,9
2520,-1,-326021,9
2521,-1,-326021,11
2522,-1,-326021,9
2523,0,-326021,9
2524,-1,-326021,9
2525,-1,-326020,9
2526,-1,-326021,9
2527,-1,-326021,9
2528,0,-326021,9
2529,0,-326021,9
2530,0,-326021,9
2531,0,-326021,9
2532,0,-326021,9
2533,0,-326020,9
2534,0,-326021,9
2535,0,-326020,9
2536,0,-326021,9
2537,0,-326021,9
2538,0,-326021,9
2539,0,-326021,9
2540,0,-326022,9
2541,-1,-326021,9
2542,-1,-326021,9
2543,-1,-326021,11
2544,-1,-326020,9
2545,-1,-326021,9
2546,-1,-326022,11
2547,0,-326021,9
2548,0,-326021,9
2549,0,-326020,9
2550,0,-326021,9
2551,0,-326021,9
2552,0,-326021,9
2553,0,-326021,9
2554,0,-326021,9
2555,0,-326021,9
2556,0,-326020,9
2557,0,-326021,9
2558,0,-326021,9
2559,0,-326021,11
2560,0,-326022,9
2561,0,-326021,9
2562,0,-326021,9
2563,0,-326020,9
2564,0,-326021,9
2565,0,-326020,9
2566,0,-326021,9
2567,-1,-326021,9
2568,-1,-326022,9
2569,-1,-326021,9
2570,0,-326021,9
2571,-1,-326021,9
2572,-1,-326021,9
2573,-1,-326021,9
2574,0,-326021,9
2575,0,-326021,9
2576,0,-326021,9
2577,0,-326021,9
2578,0,-326021,9
2579,0,-326021,9
2580,0,-326021,9
2581,0,-326021,9
2582,0,-326021,9
2583,0,-326021,9
2584,0,-326021,9
2585,0,-326021,9
2586,0,-326021,9
2587,0,-326021,9
2588,-1,-326021,9
2589,-1,-326021,9
2590,-1,-326020,9
2591,-1,-326021,9
2592,-1,-326021,9
2593,-1,-326020,9
2594,-1,-326021,11
2595,-1,-326021,9
2596,-1,-326021,9
2597,-1,-326021,9
2598,-1,-326020,9
2599,-1,-326021,9
2600,-1,-326021,9
2601,0,-326020,9
2602,0,-326021,9
2603,0,-326020,9
2604,0,-326022,9
2605,0,-326022,9
2606,0,-326021,11
2607,-1,-326022,9
2608,-1,-326021,9
2609,-1,-326021,9
2610,-1,-326021,9
2611,0,-326022,9
2612,0,-326021,9
2613,0,-326021,9
2614,0,-326021,9
2615,0,-326021,9
2616,-1,-326021,9
2617,0,-326021,9
2618,0,-326022,9
2619,0,-326021,11
2620,0,-326021,9
2621,0,-326021,9
2622,0,-326020,9
2623,0,-326021,9
2624,-1,-326021,9
2625,-1,-326021,9
2626,-1,-326021,9
2627,0,-326020,9
2628,0,-326020,9
2629,0,-326021,9
2630,0,-326021,9
2631,0,-326020,9
2632,0,-326021,9
2633,0,-326021,9
2634,0,-326021,9
2635,0,-326021,9
2636,0,-326021,9
2637,0,-326021,9
2638,0,-326021,9
2639,0,-326021,11
2640,0,-326020,9
2641,0,-326021,9
2642,0,-326021,9
2643,0,-326022,9
2644,0,-326020,9
2645,1,-326021,9
2646,0,-326021,9
2647,0,-326021,9
2648,0,-326020,9
2649,0,-326021,9
2650,0,-326021,9
2651,0,-326020,9
2652,0,-326021,11
2653,-1,-326020,9
2654,-1,-326021,9
2655,-1,-326021,9
2656,-1,-326022,9
2657,0,-326021,9
2658,0,-326021,9
2659,0,-326021,9
2660,0,-326022,9
2661,0,-326021,9
2662,0,-326021,9
2663,-1,-326021,9
2664,-1,-326020,9
2665,-1,-326021,9
2666,-1,-326021,9
2667,0,-326021,9
2668,0,-326021,9
2669,0,-326020,9
2670,0,-326021,9
2671,0,-326021,9
2672,0,-326021,11
2673,0,-326021,9
2674,0,-326021,9
2675,0,-326022,9
2676,0,-326021,9
2677,0,-326022,9
2678,-1,-326021,9
2679,0,-326022,9
2680,0,-326021,9
2681,0,-326021,9
2682,0,-326021,9
2683,0,-326021,11
2684,0,-326021,9
2685,0,-326022,9
2686,0,-326021,9
2687,0,-326021,9
2688,0,-326020,9
2689,0,-326021,9
2690,0,-326021,9
2691,0,-326021,9
2692,0,-326020,9
2693,0,-326021,9
2694,0,-326021,9
2695,0,-326021,11
2696,0,-326021,9
2697,0,-326021,9
2698,0,-326020,9
2699,0,-326021,9
2700,0,-326021,9
2701,0,-326021,9
2702,0,-326021,9
2703,0,-326021,9
2704,0,-326020,9
2705,0,-326022,9
2706,0,-326021,9
2707,0,-326021,9
2708,0,-326021,9
2709,0,-326021,9
2710,0,-326020,9
2711,0,-326021,9
2712,0,-326021,9
2713,0,-326021,9
2714,0,-326020,9
2715,0,-326021,9
2716,0,-326020,11
2717,0,-326021,9
2718,0,-326021,9
2719,0,-326021,9
2720,0,-326021,9
2721,0,-326022,9
2722,0,-326021,9
2723,0,-326022,9
2724,0,-326020,9
2725,0,-326021,9
2726,0,-326020,9
2727,0,-326021,9
2728,0,-326021,9
2729,-1,-326021,9
2730,0,-326020,9
2731,0,-326021,9
2732,0,-326021,9
2733,0,-326021,9
2734,0,-326021,11
2735,0,-326021,9
2736,-1,-326021,9
2737,-1,-326021,9
2738,-1,-326021,9
2739,0,-326021,9
2740,0,-326021,9
2741,-1,-326021,9
2742,-1,-326021,9
2743,-1,-326021,9
2744,0,-326021,9
2745,0,-326021,9
2746,-1,-326020,9
2747,-1,-326022,9
2748,-1,-326021,9
2749,0,-326021,11
2750,0,-326021,9
2751,1,-326021,9
2752,0,-326021,9
2753,0,-326020,9
2754,0,-326021,9
2755,0,-326021,9
2756,0,-326022,9
2757,0,-326021,9
2758,0,-326020,9
2759,0,-326021,9
2760,0,-326020,9
2761,0,-326021,9
2762,0,-326021,11
2763,0,-326021,9
2764,0,-326021,9
2765,0,-326021,9
2766,0,-326021,9
2767,-1,-326020,9
2768,-1,-326020,9
2769,-1,-326021,9
2770,-1,-326021,9
2771,-1,-326021,9
2772,-1,-326021,9
2773,-1,-326021,11
2774,-1,-326021,9
2775,-1,-326021,9
2776,0,-326021,9
2777,0,-326021,9
2778,0,-326020,9
2779,0,-326021,9
2780,-1,-326021,9
2781,-1,-326021,9
2782,-1,-326021,9
2783,-1,-326021,9
2784,-1,-326021,9
2785,-1,-326021,9
2786,-1,-326022,9
2787,-1,-326021,9
2788,-1,-326021,9
2789,-1,-326021,9
2790,-1,-326021,9
2791,-1,-326022,9
2792,-1,-326021,9
2793,0,-326021,11
2794,0,-326021,9
2795,0,-326021,9
2796,0,-326021,9
2797,0,-326021,9
2798,0,-326021,9
2799,0,-326021,9
2800,0,-326021,9
2801,0,-326021,9
2802,0,-326021,9
2803,0,-326021,9
2804,0,-326021,9
2805,0,-326021,9
2806,0,-326021,11
2807,0,-326020,9
2808,0,-326021,9
2809,-1,-326020,9
2810,0,-326021,9
2811,0,-326021,9
2812,0,-326021,9
2813,-1,-326021,9
2814,-1,-326021,9
2815,-1,-326021,9
2816,-1,-326021,9
2817,-1,-326021,11
2818,-1,-326021,9
2819,-1,-326022,9
2820,-1,-326021,9
2821,-1,-326021,9
2822,-1,-326021,9
2823,-1,-326022,9
2824,-1,-326021,9
2825,-1,-326021,9
2826,-1,-326021,9
2827,0,-326021,9
2828,0,-326021,9
2829,-1,-326021,9
2830,-1,-326021,9
2831,-1,-326021,9
2832,0,-326021,9
2833,0,-326021,9
2834,0,-326021,11
2835,0,-326021,9
2836,-1,-326021,9
2837,0,-326021,9
2838,0,-326020,9
2839,0,-326021,9
2840,0,-326021,9
2841,0,-326021,11
2842,0,-326021,9
2843,0,-326021,9
2844,0,-326021,11
2845,0,-326020,9
2846,0,-326021,9
2847,0,-326020,9
2848,0,-326021,9
2849,-1,-326021,9
2850,0,-326021,9
2851,0,-326021,9
2852,0,-326021,9
2853,0,-326021,9
2854,0,-326020,9
2855,0,-326021,9
2856,0,-326020,9
2857,0,-326021,9
2858,0,-326021,9
2859,-1,-326021,9
2860,-1,-326021,9
2861,0,-326021,9
2862,0,-326021,9
2863,-1,-326021,9
2864,-1,-326020,9
2865,0,-326020,9
2866,0,-326021,9
2867,0,-326021,9
2868,0,-326021,9
2869,0,-326021,9
2870,0,-326021,9
2871,-1,-326021,9
2872,-1,-326021,9
2873,-1,-326021,9
2874,0,-326021,9
2875,0,-326021,9
2876,0,-326021,9
2877,0,-326021,9
2878,0,-326021,9
2879,0,-326021,9
2880,0,-326021,9
2881,0,-326021,9
2882,0,-326022,9
2883,0,-326021,9
2884,0,-326021,9
2885,0,-326021,9
2886,0,-326021,9
2887,0,-326021,9
2888,0,-326021,9
2889,0,-326021,9
2890,0,-326021,9
2891,0,-326021,9
2892,0,-326021,11
2893,0,-326022,9
2894,0,-326021,9
2895,0,-326022,9
2896,0,-326020,9
2897,-1,-326021,9
2898,-1,-326021,9
2899,-1,-326021,9
2900,-1,-326021,9
2901,-1,-326021,9
2902,0,-326020,9
2903,0,-326021,11
2904,-1,-326021,9
2905,-1,-326021,9
2906,0,-326021,9
2907,0,-326021,9
2908,0,-326021,9
2909,0,-326021,9
2910,0,-326022,9
2911,0,-326021,9
2912,0,-326021,9
2913,0,-326021,9
2914,0,-326022,9
2915,0,-326020,9
2916,0,-326021,9
2917,-1,-326021,9
2918,-1,-326021,9
2919,-1,-326021,9
2920,0,-326020,9
2921,0,-326020,9
2922,0,-326021,9
2923,-1,-326020,11
2924,0,-326021,9
2925,0,-326021,9
2926,0,-326021,11
2927,0,-326021,9
2928,0,-326021,9
2929,0,-326021,11
2930,0,-326021,9
2931,0,-326021,9
2932,0,-326021,9
2933,0,-326021,9
2934,0,-326020,9
2935,0,-326021,9
2936,0,-326021,9
2937,0,-326021,11
2938,0,-326020,9
2939,0,-326021,9
2940,0,-326021,9
2941,0,-326021,9
2942,0,-326021,9
2943,0,-326021,9
2944,0,-326021,9
2945,0,-326021,9
2946,0,-326021,9
2947,0,-326022,9
2948,0,-326021,9
2949,0,-326021,9
2950,0,-326021,9
2951,0,-326020,9
2952,0,-326022,9
2953,0,-326021,9
2954,0,-326020,9
2955,0,-326021,9
2956,0,-326020,9
2957,0,-326021,9
2958,0,-326021,9
2959,0,-326021,11
2960,0,-326021,9
2961,0,-326022,9
2962,0,-326021,9
2963,0,-326021,9
2964,0,-326021,9
2965,0,-326021,9
2966,0,-326021,9
2967,0,-326021,9
2968,0,-326021,9
2969,0,-326020,9
2970,0,-326021,9
2971,0,-326021,9
2972,0,-326021,9
2973,0,-326021,9
2974,0,-326021,9
2975,0,-326022,9
2976,0,-326021,9
2977,0,-326021,9
2978,0,-326021,9
2979,0,-326020,9
2980,0,-326021,9
2981,0,-326021,11
2982,0,-326021,9
2983,-1,-326021,9
2984,-1,-326020,9
2985,-1,-326021,11
2986,-1,-326021,9
2987,-1,-326021,9
2988,0,-326021,9
2989,0,-326020,9
2990,0,-326021,9
2991,-1,-326022,9
2992,-1,-326021,9
2993,0,-326021,9
2994,0,-326021,9
2995,-1,-326021,9
2996,-1,-326021,9
2997,-1,-326021,9
2998,-1,-326021,11
2999,-1,-326020,9
3000,0,-326021,9
3001,0,-326020,9
3002,0,-326021,9
3003,0,-326021,9
3004,0,-326022,9
3005,-1,-326021,9
3006,-1,-326022,9
3007,-1,-326022,9
3008,-1,-326022,9
3009,-1,-326022,9
3010,-1,-326022,9
3011,-1,-326022,9
3012,-1,-326022,9
3013,-1,-326021,9
3014,0,-326022,9
3015,0,-326022,9
3016,-1,-326021,9
3017,-1,-326023,9
3018,0,-326021,9
3019,0,-326021,9
3020,0,-326021,9
3021,0,-326021,9
3022,0,-326020,9
3023,0,-326021,9
3024,0,-326022,9
3025,0,-326021,9
3026,0,-326021,9
3027,0,-326022,9
3028,0,-326021,9
3029,0,-326022,9
3030,0,-326021,9
3031,-1,-326022,9
3032,0,-326021,9
3033,0,-326021,9
3034,0,-326021,9
3035,0,-326021,9
3036,0,-326021,9
3037,0,-326021,9
3038,0,-326021,9
3039,0,-326021,9
3040,0,-326021,9
3041,0,-326021,9
3042,0,-326021,9
3043,0,-326021,9
3044,0,-326021,9
3045,0,-326021,9
3046,-1,-326021,11
3047,-1,-326021,9
3048,-1,-326021,9
3049,-1,-326022,9
3050,-1,-326021,9
3051,-1,-326021,9
3052,0,-326021,9
3053,0,-326022,9
3054,0,-326021,9
3055,-1,-326021,9
3056,-1,-326021,11
3057,-1,-326020,9
3058,-1,-326021,9
3059,-1,-326021,9
3060,-1,-326021,11
3061,0,-326022,9
3062,0,-326021,9
3063,-1,-326021,9
3064,0,-326021,9
3065,0,-326021,9
3066,0,-326022,9
3067,0,-326021,9
3068,0,-326022,9
3069,0,-326022,9
3070,-1,-326021,9
3071,-1,-326022,9
3072,-1,-326021,11
3073,-1,-326021,9
3074,-1,-326021,9
3075,-1,-326022,9
3076,-1,-326022,9
3077,0,-326021,9
3078,0,-326021,9
3079,-1,-326021,9
3080,-1,-326021,9
3081,0,-326021,9
3082,0,-326020,9
3083,0,-326020,9
3084,0,-326021,9
3085,0,-326021,9
3086,0,-326020,9
3087,0,-326021,9
3088,0,-326021,9
3089,0,-326021,9
3090,0,-326020,9
3091,0,-326020,9
3092,0,-326021,9
3093,0,-326021,9
3094,0,-326020,9
3095,0,-326021,9
3096,0,-326020,9
3097,0,-326021,9
3098,0,-326021,9
3099,-1,-326020,9
3100,-1,-326021,9
3101,-1,-326020,9
3102,0,-326021,9
3103,0,-326021,9
3104,0,-326021,9
3105,0,-326020,9
3106,0,-326020,9
3107,0,-326021,9
3108,0,-326020,9
3109,0,-326021,11
3110,-1,-326021,9
3111,0,-326021,9
3112,0,-326021,9
3113,0,-326021,9
3114,0,-326021,9
3115,0,-326021,9
3116,-1,-326021,9
3117,0,-326021,9
3118,0,-326020,9
3119,0,-326021,9
3120,0,-326020,9
3121,0,-326021,9
3122,0,-326021,9
3123,0,-326021,11
3124,-1,-326020,9
3125,-1,-326021,9
3126,-1,-326021,9
3127,-1,-326021,9
3128,-1,-326021,9
3129,0,-326021,9
3130,-1,-326021,9
3131,-1,-326021,9
3132,-1,-326021,9
3133,-1,-326021,9
3134,-1,-326021,11
3135,-1,-326020,9
3136,-1,-326021,9
3137,-1,-326020,9
3138,-1,-326021,9
3139,-1,-326021,9
3140,-1,-326020,9
3141,-1,-326020,9
3142,0,-326021,9
3143,0,-326020,9
3144,-1,-326021,9
3145,0,-326020,11
3146,0,-326021,9
3147,0,-326020,9
3148,0,-326021,11
3149,-1,-326021,9
3150,-1,-326020,9
3151,-1,-326021,9
3152,0,-326021,9
3153,0,-326021,9
3154,-1,-326021,9
3155,-1,-326021,9
3156,0,-326021,9
3157,0,-326021,9
3158,0,-326021,9
3159,-1,-326021,9
3160,-1,-326021,9
3161,-1,-326021,9
3162,0,-326021,9
3163,0,-326021,9
3164,0,-326020,9
3165,0,-326021,9
3166,0,-326021,9
3167,0,-326021,9
3168,0,-326020,9
3169,0,-326020,9
3170,0,-326020,9
3171,0,-326020,9
3172,0,-326021,9
3173,0,-326021,9
3174,-1,-326021,9
3175,-1,-326020,9
3176,-1,-326021,9
3177,-1,-326021,9
3178,0,-326020,9
3179,0,-326021,11
3180,0,-326020,9
3181,0,-326021,9
3182,0,-326021,9
3183,0,-326021,9
3184,0,-326021,9
3185,0,-326021,9
3186,0,-326021,9
3187,0,-326021,9
3188,0,-326021,9
3189,0,-326021,9
3190,0,-326021,11
3191,0,-326020,9
3192,0,-326021,9
3193,0,-326021,9
3194,0,-326021,9
3195,0,-326021,9
3196,0,-326021,9
3197,0,-326021,9
3198,0,-326021,9
3199,0,-326021,9
3200,0,-326021,9
3201,0,-326021,9
3202,0,-326021,9
3203,0,-326021,9
3204,0,-326021,9
3205,0,-326021,9
3206,0,-326021,9
3207,0,-326021,9
3208,0,-326020,9
3209,0,-326021,9
3210,0,-326021,9
3211,0,-326021,9
3212,0,-326021,9
3213,-1,-326021,9
3214,-1,-326021,11
3215,0,-326021,9
3216,0,-326021,11
3217,0,-326021,9
3218,0,-326021,9
3219,0,-326021,9
3220,0,-326021,9
3221,0,-326021,9
3222,0,-326021,9
3223,1,-326021,9
3224,0,-326021,9
3225,0,-326021,9
3226,0,-326020,9
3227,0,-326021,9
3228,0,-326021,9
3229,0,-326021,9
3230,0,-326021,9
3231,0,-326020,9
3232,0,-326021,9
3233,0,-326021,11
3234,0,-326020,9
3235,0,-326021,9
3236,0,-326021,9
3237,-1,-326021,9
3238,-1,-326021,9
3239,-1,-326021,9
3240,-1,-326021,9
3241,0,-326021,9
3242,0,-326021,9
3243,0,-326021,9
3244,0,-326021,9
3245,0,-326021,9
3246,0,-326021,9
3247,1,-326021,9
3248,0,-326021,9
3249,0,-326021,9
3250,-1,-326021,9
3251,-1,-326021,9
3252,-1,-326021,9
3253,-1,-326021,9
3254,-1,-326021,9
3255,-1,-326020,11
3256,-1,-326020,9
3257,-1,-326021,9
3258,-1,-326020,9
3259,-1,-326021,9
3260,-1,-326021,9
3261,0,-326021,9
3262,0,-326021,9
3263,0,-326021,9
3264,0,-326020,9
3265,0,-326021,9
