%!PS-Adobe-3.0 EPSF-3.0
%%Title: pics\gyro_vs_motor.eps
%%Creator: matplotlib version 3.2.1, http://matplotlib.org/
%%CreationDate: Mon Mar 29 18:26:54 2021
%%Orientation: portrait
%%BoundingBox: 18.0 216.0 594.0 576.0
%%EndComments
%%BeginProlog
/mpldict 8 dict def
mpldict begin
/m { moveto } bind def
/l { lineto } bind def
/r { rlineto } bind def
/c { curveto } bind def
/cl { closepath } bind def
/box {
m
1 index 0 r
0 exch r
neg 0 r
cl
} bind def
/clipbox {
box
clip
newpath
} bind def
%!PS-Adobe-3.0 Resource-Font
%%Title: DejaVu Sans
%%Copyright: Copyright (c) 2003 by Bitstream, Inc. All Rights Reserved. Copyright (c) 2006 by Tavmjong Bah. All Rights Reserved. DejaVu changes are in public domain 
%%Creator: Converted from TrueType to type 3 by PPR
25 dict begin
/_d{bind def}bind def
/_m{moveto}_d
/_l{lineto}_d
/_cl{closepath eofill}_d
/_c{curveto}_d
/_sc{7 -1 roll{setcachedevice}{pop pop pop pop pop pop}ifelse}_d
/_e{exec}_d
/FontName /DejaVuSans def
/PaintType 0 def
/FontMatrix[.001 0 0 .001 0 0]def
/FontBBox[-1021 -463 1793 1232]def
/FontType 3 def
/Encoding [ /space /quotesingle /zero /one /two /three /four /six /eight /A /H /M /R /S /T /Z /bracketleft /bracketright /a /b /c /e /g /h /i /l /m /n /o /p /r /s /t /u /v /x /y /z /minus ] def
/FontInfo 10 dict dup begin
/FamilyName (DejaVu Sans) def
/FullName (DejaVu Sans) def
/Notice (Copyright (c) 2003 by Bitstream, Inc. All Rights Reserved. Copyright (c) 2006 by Tavmjong Bah. All Rights Reserved. DejaVu changes are in public domain ) def
/Weight (Book) def
/Version (Version 2.35) def
/ItalicAngle 0.0 def
/isFixedPitch false def
/UnderlinePosition -130 def
/UnderlineThickness 90 def
end readonly def
/CharStrings 40 dict dup begin
/.notdef 0 def
/space{318 0 0 0 0 0 _sc
}_d
/quotesingle{275 0 96 458 179 729 _sc
179 729 _m
179 458 _l
96 458 _l
96 729 _l
179 729 _l
_cl}_d
/zero{636 0 66 -13 570 742 _sc
318 664 _m
267 664 229 639 203 589 _c
177 539 165 464 165 364 _c
165 264 177 189 203 139 _c
229 89 267 64 318 64 _c
369 64 407 89 433 139 _c
458 189 471 264 471 364 _c
471 464 458 539 433 589 _c
407 639 369 664 318 664 _c
318 742 _m
399 742 461 709 505 645 _c
548 580 570 486 570 364 _c
570 241 548 147 505 83 _c
461 19 399 -13 318 -13 _c
236 -13 173 19 130 83 _c
87 147 66 241 66 364 _c
66 486 87 580 130 645 _c
173 709 236 742 318 742 _c
_cl}_d
/one{636 0 110 0 544 729 _sc
124 83 _m
285 83 _l
285 639 _l
110 604 _l
110 694 _l
284 729 _l
383 729 _l
383 83 _l
544 83 _l
544 0 _l
124 0 _l
124 83 _l
_cl}_d
/two{{636 0 73 0 536 742 _sc
192 83 _m
536 83 _l
536 0 _l
73 0 _l
73 83 _l
110 121 161 173 226 239 _c
290 304 331 346 348 365 _c
380 400 402 430 414 455 _c
426 479 433 504 433 528 _c
433 566 419 598 392 622 _c
365 646 330 659 286 659 _c
255 659 222 653 188 643 _c
154 632 117 616 78 594 _c
78 694 _l
118 710 155 722 189 730 _c
223 738 255 742 284 742 _c
}_e{359 742 419 723 464 685 _c
509 647 532 597 532 534 _c
532 504 526 475 515 449 _c
504 422 484 390 454 354 _c
446 344 420 317 376 272 _c
332 227 271 164 192 83 _c
_cl}_e}_d
/three{{636 0 76 -13 556 742 _sc
406 393 _m
453 383 490 362 516 330 _c
542 298 556 258 556 212 _c
556 140 531 84 482 45 _c
432 6 362 -13 271 -13 _c
240 -13 208 -10 176 -4 _c
144 1 110 10 76 22 _c
76 117 _l
103 101 133 89 166 81 _c
198 73 232 69 268 69 _c
330 69 377 81 409 105 _c
441 129 458 165 458 212 _c
458 254 443 288 413 312 _c
383 336 341 349 287 349 _c
}_e{202 349 _l
202 430 _l
291 430 _l
339 430 376 439 402 459 _c
428 478 441 506 441 543 _c
441 580 427 609 401 629 _c
374 649 336 659 287 659 _c
260 659 231 656 200 650 _c
169 644 135 635 98 623 _c
98 711 _l
135 721 170 729 203 734 _c
235 739 266 742 296 742 _c
370 742 429 725 473 691 _c
517 657 539 611 539 553 _c
539 513 527 479 504 451 _c
481 423 448 403 406 393 _c
_cl}_e}_d
/four{636 0 49 0 580 729 _sc
378 643 _m
129 254 _l
378 254 _l
378 643 _l
352 729 _m
476 729 _l
476 254 _l
580 254 _l
580 172 _l
476 172 _l
476 0 _l
378 0 _l
378 172 _l
49 172 _l
49 267 _l
352 729 _l
_cl}_d
/six{{636 0 70 -13 573 742 _sc
330 404 _m
286 404 251 388 225 358 _c
199 328 186 286 186 234 _c
186 181 199 139 225 109 _c
251 79 286 64 330 64 _c
374 64 409 79 435 109 _c
461 139 474 181 474 234 _c
474 286 461 328 435 358 _c
409 388 374 404 330 404 _c
526 713 _m
526 623 _l
501 635 476 644 451 650 _c
425 656 400 659 376 659 _c
310 659 260 637 226 593 _c
}_e{192 549 172 482 168 394 _c
187 422 211 444 240 459 _c
269 474 301 482 336 482 _c
409 482 467 459 509 415 _c
551 371 573 310 573 234 _c
573 159 550 99 506 54 _c
462 9 403 -13 330 -13 _c
246 -13 181 19 137 83 _c
92 147 70 241 70 364 _c
70 479 97 571 152 639 _c
206 707 280 742 372 742 _c
396 742 421 739 447 735 _c
472 730 498 723 526 713 _c
_cl}_e}_d
/eight{{636 0 68 -13 568 742 _sc
318 346 _m
271 346 234 333 207 308 _c
180 283 167 249 167 205 _c
167 161 180 126 207 101 _c
234 76 271 64 318 64 _c
364 64 401 76 428 102 _c
455 127 469 161 469 205 _c
469 249 455 283 429 308 _c
402 333 365 346 318 346 _c
219 388 _m
177 398 144 418 120 447 _c
96 476 85 511 85 553 _c
85 611 105 657 147 691 _c
188 725 245 742 318 742 _c
}_e{390 742 447 725 489 691 _c
530 657 551 611 551 553 _c
551 511 539 476 515 447 _c
491 418 459 398 417 388 _c
464 377 501 355 528 323 _c
554 291 568 251 568 205 _c
568 134 546 80 503 43 _c
459 5 398 -13 318 -13 _c
237 -13 175 5 132 43 _c
89 80 68 134 68 205 _c
68 251 81 291 108 323 _c
134 355 171 377 219 388 _c
183 544 _m
183 506 194 476 218 455 _c
}_e{242 434 275 424 318 424 _c
360 424 393 434 417 455 _c
441 476 453 506 453 544 _c
453 582 441 611 417 632 _c
393 653 360 664 318 664 _c
275 664 242 653 218 632 _c
194 611 183 582 183 544 _c
_cl}_e}_d
/A{684 0 8 0 676 729 _sc
342 632 _m
208 269 _l
476 269 _l
342 632 _l
286 729 _m
398 729 _l
676 0 _l
573 0 _l
507 187 _l
178 187 _l
112 0 _l
8 0 _l
286 729 _l
_cl}_d
/H{752 0 98 0 654 729 _sc
98 729 _m
197 729 _l
197 430 _l
555 430 _l
555 729 _l
654 729 _l
654 0 _l
555 0 _l
555 347 _l
197 347 _l
197 0 _l
98 0 _l
98 729 _l
_cl}_d
/M{863 0 98 0 765 729 _sc
98 729 _m
245 729 _l
431 233 _l
618 729 _l
765 729 _l
765 0 _l
669 0 _l
669 640 _l
481 140 _l
382 140 _l
194 640 _l
194 0 _l
98 0 _l
98 729 _l
_cl}_d
/R{{695 0 98 0 666 729 _sc
444 342 _m
465 334 486 319 506 296 _c
526 272 546 240 566 199 _c
666 0 _l
560 0 _l
467 187 _l
443 235 419 268 397 284 _c
374 300 343 308 304 308 _c
197 308 _l
197 0 _l
98 0 _l
98 729 _l
321 729 _l
404 729 466 711 507 677 _c
548 642 569 589 569 519 _c
569 473 558 434 537 404 _c
515 374 484 353 444 342 _c
197 648 _m
197 389 _l
321 389 _l
}_e{368 389 404 400 428 422 _c
452 444 465 476 465 519 _c
465 561 452 593 428 615 _c
404 637 368 648 321 648 _c
197 648 _l
_cl}_e}_d
/S{{635 0 66 -13 579 742 _sc
535 705 _m
535 609 _l
497 627 462 640 429 649 _c
395 657 363 662 333 662 _c
279 662 237 651 208 631 _c
179 610 165 580 165 542 _c
165 510 174 485 194 469 _c
213 452 250 439 304 429 _c
364 417 _l
437 403 491 378 526 343 _c
561 307 579 260 579 201 _c
579 130 555 77 508 41 _c
460 5 391 -13 300 -13 _c
265 -13 228 -9 189 -2 _c
}_e{150 5 110 16 69 32 _c
69 134 _l
109 111 148 94 186 83 _c
224 71 262 66 300 66 _c
356 66 399 77 430 99 _c
460 121 476 152 476 194 _c
476 230 465 258 443 278 _c
421 298 385 313 335 323 _c
275 335 _l
201 349 148 372 115 404 _c
82 435 66 478 66 534 _c
66 598 88 649 134 686 _c
179 723 242 742 322 742 _c
356 742 390 739 426 733 _c
461 727 497 717 535 705 _c
}_e{_cl}_e}_d
/T{611 0 -2 0 614 729 _sc
-2 729 _m
614 729 _l
614 646 _l
355 646 _l
355 0 _l
256 0 _l
256 646 _l
-2 646 _l
-2 729 _l
_cl}_d
/Z{685 0 45 0 640 729 _sc
56 729 _m
629 729 _l
629 654 _l
168 83 _l
640 83 _l
640 0 _l
45 0 _l
45 75 _l
506 646 _l
56 646 _l
56 729 _l
_cl}_d
/bracketleft{390 0 86 -131 293 760 _sc
86 760 _m
293 760 _l
293 690 _l
176 690 _l
176 -61 _l
293 -61 _l
293 -131 _l
86 -131 _l
86 760 _l
_cl}_d
/bracketright{390 0 97 -131 304 760 _sc
304 760 _m
304 -131 _l
97 -131 _l
97 -61 _l
214 -61 _l
214 690 _l
97 690 _l
97 760 _l
304 760 _l
_cl}_d
/a{{613 0 60 -13 522 560 _sc
343 275 _m
270 275 220 266 192 250 _c
164 233 150 205 150 165 _c
150 133 160 107 181 89 _c
202 70 231 61 267 61 _c
317 61 357 78 387 114 _c
417 149 432 196 432 255 _c
432 275 _l
343 275 _l
522 312 _m
522 0 _l
432 0 _l
432 83 _l
411 49 385 25 355 10 _c
325 -5 287 -13 243 -13 _c
187 -13 142 2 109 33 _c
76 64 60 106 60 159 _c
}_e{60 220 80 266 122 298 _c
163 329 224 345 306 345 _c
432 345 _l
432 354 _l
432 395 418 427 391 450 _c
364 472 326 484 277 484 _c
245 484 215 480 185 472 _c
155 464 127 453 100 439 _c
100 522 _l
132 534 164 544 195 550 _c
226 556 256 560 286 560 _c
365 560 424 539 463 498 _c
502 457 522 395 522 312 _c
_cl}_e}_d
/b{{635 0 91 -13 580 760 _sc
487 273 _m
487 339 473 390 446 428 _c
418 466 381 485 334 485 _c
286 485 249 466 222 428 _c
194 390 181 339 181 273 _c
181 207 194 155 222 117 _c
249 79 286 61 334 61 _c
381 61 418 79 446 117 _c
473 155 487 207 487 273 _c
181 464 _m
199 496 223 520 252 536 _c
281 552 316 560 356 560 _c
422 560 476 533 518 481 _c
559 428 580 359 580 273 _c
}_e{580 187 559 117 518 65 _c
476 13 422 -13 356 -13 _c
316 -13 281 -5 252 10 _c
223 25 199 49 181 82 _c
181 0 _l
91 0 _l
91 760 _l
181 760 _l
181 464 _l
_cl}_e}_d
/c{{550 0 55 -13 488 560 _sc
488 526 _m
488 442 _l
462 456 437 466 411 473 _c
385 480 360 484 334 484 _c
276 484 230 465 198 428 _c
166 391 150 339 150 273 _c
150 206 166 154 198 117 _c
230 80 276 62 334 62 _c
360 62 385 65 411 72 _c
437 79 462 90 488 104 _c
488 21 _l
462 9 436 0 410 -5 _c
383 -10 354 -13 324 -13 _c
242 -13 176 12 128 64 _c
}_e{79 115 55 185 55 273 _c
55 362 79 432 128 483 _c
177 534 244 560 330 560 _c
358 560 385 557 411 551 _c
437 545 463 537 488 526 _c
_cl}_e}_d
/e{{615 0 55 -13 562 560 _sc
562 296 _m
562 252 _l
149 252 _l
153 190 171 142 205 110 _c
238 78 284 62 344 62 _c
378 62 412 66 444 74 _c
476 82 509 95 541 113 _c
541 28 _l
509 14 476 3 442 -3 _c
408 -9 373 -13 339 -13 _c
251 -13 182 12 131 62 _c
80 112 55 181 55 268 _c
55 357 79 428 127 481 _c
175 533 241 560 323 560 _c
397 560 455 536 498 489 _c
}_e{540 441 562 377 562 296 _c
472 322 _m
471 371 457 410 431 440 _c
404 469 368 484 324 484 _c
274 484 234 469 204 441 _c
174 413 156 373 152 322 _c
472 322 _l
_cl}_e}_d
/g{{635 0 55 -207 544 560 _sc
454 280 _m
454 344 440 395 414 431 _c
387 467 349 485 301 485 _c
253 485 215 467 188 431 _c
161 395 148 344 148 280 _c
148 215 161 165 188 129 _c
215 93 253 75 301 75 _c
349 75 387 93 414 129 _c
440 165 454 215 454 280 _c
544 68 _m
544 -24 523 -93 482 -139 _c
440 -184 377 -207 292 -207 _c
260 -207 231 -204 203 -200 _c
175 -195 147 -188 121 -178 _c
}_e{121 -91 _l
147 -105 173 -115 199 -122 _c
225 -129 251 -133 278 -133 _c
336 -133 380 -117 410 -87 _c
439 -56 454 -10 454 52 _c
454 96 _l
435 64 411 40 382 24 _c
353 8 319 0 279 0 _c
211 0 157 25 116 76 _c
75 127 55 195 55 280 _c
55 364 75 432 116 483 _c
157 534 211 560 279 560 _c
319 560 353 552 382 536 _c
411 520 435 496 454 464 _c
454 547 _l
544 547 _l
}_e{544 68 _l
_cl}_e}_d
/h{634 0 91 0 549 760 _sc
549 330 _m
549 0 _l
459 0 _l
459 327 _l
459 379 448 417 428 443 _c
408 469 378 482 338 482 _c
289 482 251 466 223 435 _c
195 404 181 362 181 309 _c
181 0 _l
91 0 _l
91 760 _l
181 760 _l
181 462 _l
202 494 227 519 257 535 _c
286 551 320 560 358 560 _c
420 560 468 540 500 501 _c
532 462 549 405 549 330 _c
_cl}_d
/i{278 0 94 0 184 760 _sc
94 547 _m
184 547 _l
184 0 _l
94 0 _l
94 547 _l
94 760 _m
184 760 _l
184 646 _l
94 646 _l
94 760 _l
_cl}_d
/l{278 0 94 0 184 760 _sc
94 760 _m
184 760 _l
184 0 _l
94 0 _l
94 760 _l
_cl}_d
/m{{974 0 91 0 889 560 _sc
520 442 _m
542 482 569 511 600 531 _c
631 550 668 560 711 560 _c
767 560 811 540 842 500 _c
873 460 889 403 889 330 _c
889 0 _l
799 0 _l
799 327 _l
799 379 789 418 771 444 _c
752 469 724 482 686 482 _c
639 482 602 466 575 435 _c
548 404 535 362 535 309 _c
535 0 _l
445 0 _l
445 327 _l
445 379 435 418 417 444 _c
398 469 369 482 331 482 _c
}_e{285 482 248 466 221 435 _c
194 404 181 362 181 309 _c
181 0 _l
91 0 _l
91 547 _l
181 547 _l
181 462 _l
201 495 226 520 255 536 _c
283 552 317 560 357 560 _c
397 560 430 550 458 530 _c
486 510 506 480 520 442 _c
_cl}_e}_d
/n{634 0 91 0 549 560 _sc
549 330 _m
549 0 _l
459 0 _l
459 327 _l
459 379 448 417 428 443 _c
408 469 378 482 338 482 _c
289 482 251 466 223 435 _c
195 404 181 362 181 309 _c
181 0 _l
91 0 _l
91 547 _l
181 547 _l
181 462 _l
202 494 227 519 257 535 _c
286 551 320 560 358 560 _c
420 560 468 540 500 501 _c
532 462 549 405 549 330 _c
_cl}_d
/o{612 0 55 -13 557 560 _sc
306 484 _m
258 484 220 465 192 427 _c
164 389 150 338 150 273 _c
150 207 163 156 191 118 _c
219 80 257 62 306 62 _c
354 62 392 80 420 118 _c
448 156 462 207 462 273 _c
462 337 448 389 420 427 _c
392 465 354 484 306 484 _c
306 560 _m
384 560 445 534 490 484 _c
534 433 557 363 557 273 _c
557 183 534 113 490 63 _c
445 12 384 -13 306 -13 _c
227 -13 165 12 121 63 _c
77 113 55 183 55 273 _c
55 363 77 433 121 484 _c
165 534 227 560 306 560 _c
_cl}_d
/p{{635 0 91 -207 580 560 _sc
181 82 _m
181 -207 _l
91 -207 _l
91 547 _l
181 547 _l
181 464 _l
199 496 223 520 252 536 _c
281 552 316 560 356 560 _c
422 560 476 533 518 481 _c
559 428 580 359 580 273 _c
580 187 559 117 518 65 _c
476 13 422 -13 356 -13 _c
316 -13 281 -5 252 10 _c
223 25 199 49 181 82 _c
487 273 _m
487 339 473 390 446 428 _c
418 466 381 485 334 485 _c
}_e{286 485 249 466 222 428 _c
194 390 181 339 181 273 _c
181 207 194 155 222 117 _c
249 79 286 61 334 61 _c
381 61 418 79 446 117 _c
473 155 487 207 487 273 _c
_cl}_e}_d
/r{411 0 91 0 411 560 _sc
411 463 _m
401 469 390 473 378 476 _c
366 478 353 480 339 480 _c
288 480 249 463 222 430 _c
194 397 181 350 181 288 _c
181 0 _l
91 0 _l
91 547 _l
181 547 _l
181 462 _l
199 495 224 520 254 536 _c
284 552 321 560 365 560 _c
371 560 378 559 386 559 _c
393 558 401 557 411 555 _c
411 463 _l
_cl}_d
/s{{521 0 54 -13 472 560 _sc
443 531 _m
443 446 _l
417 458 391 468 364 475 _c
336 481 308 485 279 485 _c
234 485 200 478 178 464 _c
156 450 145 430 145 403 _c
145 382 153 366 169 354 _c
185 342 217 330 265 320 _c
296 313 _l
360 299 405 279 432 255 _c
458 230 472 195 472 151 _c
472 100 452 60 412 31 _c
372 1 316 -13 246 -13 _c
216 -13 186 -10 154 -5 _c
}_e{122 0 89 8 54 20 _c
54 113 _l
87 95 120 82 152 74 _c
184 65 216 61 248 61 _c
290 61 323 68 346 82 _c
368 96 380 117 380 144 _c
380 168 371 187 355 200 _c
339 213 303 226 247 238 _c
216 245 _l
160 257 119 275 95 299 _c
70 323 58 356 58 399 _c
58 450 76 490 112 518 _c
148 546 200 560 268 560 _c
301 560 332 557 362 552 _c
391 547 418 540 443 531 _c
}_e{_cl}_e}_d
/t{392 0 27 0 368 702 _sc
183 702 _m
183 547 _l
368 547 _l
368 477 _l
183 477 _l
183 180 _l
183 135 189 106 201 94 _c
213 81 238 75 276 75 _c
368 75 _l
368 0 _l
276 0 _l
206 0 158 13 132 39 _c
106 65 93 112 93 180 _c
93 477 _l
27 477 _l
27 547 _l
93 547 _l
93 702 _l
183 702 _l
_cl}_d
/u{634 0 85 -13 543 560 _sc
85 216 _m
85 547 _l
175 547 _l
175 219 _l
175 167 185 129 205 103 _c
225 77 255 64 296 64 _c
344 64 383 79 411 110 _c
439 141 453 183 453 237 _c
453 547 _l
543 547 _l
543 0 _l
453 0 _l
453 84 _l
431 50 405 26 377 10 _c
348 -5 315 -13 277 -13 _c
214 -13 166 6 134 45 _c
101 83 85 140 85 216 _c
311 560 _m
311 560 _l
_cl}_d
/v{592 0 30 0 562 547 _sc
30 547 _m
125 547 _l
296 88 _l
467 547 _l
562 547 _l
357 0 _l
235 0 _l
30 547 _l
_cl}_d
/x{592 0 29 0 559 547 _sc
549 547 _m
351 281 _l
559 0 _l
453 0 _l
294 215 _l
135 0 _l
29 0 _l
241 286 _l
47 547 _l
153 547 _l
298 352 _l
443 547 _l
549 547 _l
_cl}_d
/y{592 0 30 -207 562 547 _sc
322 -50 _m
296 -114 271 -157 247 -177 _c
223 -197 191 -207 151 -207 _c
79 -207 _l
79 -132 _l
132 -132 _l
156 -132 175 -126 189 -114 _c
203 -102 218 -75 235 -31 _c
251 9 _l
30 547 _l
125 547 _l
296 119 _l
467 547 _l
562 547 _l
322 -50 _l
_cl}_d
/z{525 0 43 0 482 547 _sc
55 547 _m
482 547 _l
482 465 _l
144 72 _l
482 72 _l
482 0 _l
43 0 _l
43 82 _l
381 475 _l
55 475 _l
55 547 _l
_cl}_d
/minus{838 0 106 272 732 355 _sc
106 355 _m
732 355 _l
732 272 _l
106 272 _l
106 355 _l
_cl}_d
end readonly def

/BuildGlyph
 {exch begin
 CharStrings exch
 2 copy known not{pop /.notdef}if
 true 3 1 roll get exec
 end}_d

/BuildChar {
 1 index /Encoding get exch get
 1 index /BuildGlyph get exec
}_d

FontName currentdict end definefont pop
end
%%EndProlog
mpldict begin
18 216 translate
576 360 0 0 clipbox
gsave
0 0 m
576 0 l
576 360 l
0 360 l
cl
1.000 setgray
fill
grestore
gsave
72 45 m
518.4 45 l
518.4 316.8 l
72 316.8 l
cl
1.000 setgray
fill
grestore
0.800 setlinewidth
1 setlinejoin
0 setlinecap
[] 0 setdash
0.000 setgray
gsave
/o {
gsave
newpath
translate
0.8 setlinewidth
1 setlinejoin
0 setlinecap
0 0 m
0 -3.5 l

gsave
0.000 setgray
fill
grestore
stroke
grestore
} bind def
96.4379 45 o
grestore
/DejaVuSans findfont
10.000 scalefont
setfont
gsave
93.258179 30.406250 translate
0.000000 rotate
0.000000 0 m /zero glyphshow
grestore
gsave
/o {
gsave
newpath
translate
0.8 setlinewidth
1 setlinejoin
0 setlinecap
0 0 m
0 -3.5 l

gsave
0.000 setgray
fill
grestore
stroke
grestore
} bind def
157.874 45 o
grestore
gsave
145.155523 30.406250 translate
0.000000 rotate
0.000000 0 m /two glyphshow
6.362305 0 m /zero glyphshow
12.724609 0 m /zero glyphshow
19.086914 0 m /zero glyphshow
grestore
gsave
/o {
gsave
newpath
translate
0.8 setlinewidth
1 setlinejoin
0 setlinecap
0 0 m
0 -3.5 l

gsave
0.000 setgray
fill
grestore
stroke
grestore
} bind def
219.311 45 o
grestore
gsave
206.591929 30.406250 translate
0.000000 rotate
0.000000 0 m /four glyphshow
6.362305 0 m /zero glyphshow
12.724609 0 m /zero glyphshow
19.086914 0 m /zero glyphshow
grestore
gsave
/o {
gsave
newpath
translate
0.8 setlinewidth
1 setlinejoin
0 setlinecap
0 0 m
0 -3.5 l

gsave
0.000 setgray
fill
grestore
stroke
grestore
} bind def
280.747 45 o
grestore
gsave
268.028335 30.406250 translate
0.000000 rotate
0.000000 0 m /six glyphshow
6.362305 0 m /zero glyphshow
12.724609 0 m /zero glyphshow
19.086914 0 m /zero glyphshow
grestore
gsave
/o {
gsave
newpath
translate
0.8 setlinewidth
1 setlinejoin
0 setlinecap
0 0 m
0 -3.5 l

gsave
0.000 setgray
fill
grestore
stroke
grestore
} bind def
342.183 45 o
grestore
gsave
329.464742 30.406250 translate
0.000000 rotate
0.000000 0 m /eight glyphshow
6.362305 0 m /zero glyphshow
12.724609 0 m /zero glyphshow
19.086914 0 m /zero glyphshow
grestore
gsave
/o {
gsave
newpath
translate
0.8 setlinewidth
1 setlinejoin
0 setlinecap
0 0 m
0 -3.5 l

gsave
0.000 setgray
fill
grestore
stroke
grestore
} bind def
403.62 45 o
grestore
gsave
387.721461 30.406250 translate
0.000000 rotate
0.000000 0 m /one glyphshow
6.362305 0 m /zero glyphshow
12.724609 0 m /zero glyphshow
19.086914 0 m /zero glyphshow
25.449219 0 m /zero glyphshow
grestore
gsave
/o {
gsave
newpath
translate
0.8 setlinewidth
1 setlinejoin
0 setlinecap
0 0 m
0 -3.5 l

gsave
0.000 setgray
fill
grestore
stroke
grestore
} bind def
465.056 45 o
grestore
gsave
449.157867 30.406250 translate
0.000000 rotate
0.000000 0 m /one glyphshow
6.362305 0 m /two glyphshow
12.724609 0 m /zero glyphshow
19.086914 0 m /zero glyphshow
25.449219 0 m /zero glyphshow
grestore
gsave
269.942187 16.734375 translate
0.000000 rotate
0.000000 0 m /T glyphshow
5.858398 0 m /i glyphshow
8.636719 0 m /m glyphshow
18.377930 0 m /e glyphshow
24.530273 0 m /space glyphshow
27.708984 0 m /bracketleft glyphshow
31.610352 0 m /m glyphshow
41.351562 0 m /s glyphshow
46.561523 0 m /bracketright glyphshow
grestore
gsave
/o {
gsave
newpath
translate
0.8 setlinewidth
1 setlinejoin
0 setlinecap
0 0 m
-3.5 0 l

gsave
0.000 setgray
fill
grestore
stroke
grestore
} bind def
72 58.2056 o
grestore
gsave
50.265625 54.408681 translate
0.000000 rotate
0.000000 0 m /minus glyphshow
8.378906 0 m /two glyphshow
grestore
gsave
/o {
gsave
newpath
translate
0.8 setlinewidth
1 setlinejoin
0 setlinecap
0 0 m
-3.5 0 l

gsave
0.000 setgray
fill
grestore
stroke
grestore
} bind def
72 109.266 o
grestore
gsave
50.265625 105.469329 translate
0.000000 rotate
0.000000 0 m /minus glyphshow
8.378906 0 m /one glyphshow
grestore
gsave
/o {
gsave
newpath
translate
0.8 setlinewidth
1 setlinejoin
0 setlinecap
0 0 m
-3.5 0 l

gsave
0.000 setgray
fill
grestore
stroke
grestore
} bind def
72 160.327 o
grestore
gsave
58.640625 156.529977 translate
0.000000 rotate
0.000000 0 m /zero glyphshow
grestore
gsave
/o {
gsave
newpath
translate
0.8 setlinewidth
1 setlinejoin
0 setlinecap
0 0 m
-3.5 0 l

gsave
0.000 setgray
fill
grestore
stroke
grestore
} bind def
72 211.387 o
grestore
gsave
58.640625 207.590625 translate
0.000000 rotate
0.000000 0 m /one glyphshow
grestore
gsave
/o {
gsave
newpath
translate
0.8 setlinewidth
1 setlinejoin
0 setlinecap
0 0 m
-3.5 0 l

gsave
0.000 setgray
fill
grestore
stroke
grestore
} bind def
72 262.448 o
grestore
gsave
58.640625 258.651273 translate
0.000000 rotate
0.000000 0 m /two glyphshow
grestore
gsave
/o {
gsave
newpath
translate
0.8 setlinewidth
1 setlinejoin
0 setlinecap
0 0 m
-3.5 0 l

gsave
0.000 setgray
fill
grestore
stroke
grestore
} bind def
72 313.509 o
grestore
gsave
58.640625 309.711921 translate
0.000000 rotate
0.000000 0 m /three glyphshow
grestore
gsave
44.187500 128.423438 translate
90.000000 rotate
0.000000 0 m /A glyphshow
6.840820 0 m /n glyphshow
13.178711 0 m /g glyphshow
19.526367 0 m /u glyphshow
25.864258 0 m /l glyphshow
28.642578 0 m /a glyphshow
34.770508 0 m /r glyphshow
38.881836 0 m /space glyphshow
42.060547 0 m /v glyphshow
47.978516 0 m /e glyphshow
54.130859 0 m /l glyphshow
56.909180 0 m /o glyphshow
63.027344 0 m /c glyphshow
68.525391 0 m /i glyphshow
71.303711 0 m /t glyphshow
75.224609 0 m /y glyphshow
81.142578 0 m /space glyphshow
84.321289 0 m /bracketleft glyphshow
88.222656 0 m /H glyphshow
95.742188 0 m /z glyphshow
100.991211 0 m /bracketright glyphshow
grestore
1.000 setlinewidth
2 setlinecap
0.122 0.467 0.706 setrgbcolor
gsave
446.4 271.8 72 45 clipbox
92.383064 160.366853 m
96.007812 160.356853 l
97.605158 160.366853 l
153.389415 160.458522 l
153.696597 160.621859 l
154.771734 162.453572 l
155.078916 163.581933 l
156.123335 165.443647 l
156.829854 167.662035 l
157.167754 168.537057 l
157.567091 170.397104 l
158.795819 173.04217 l
159.748083 174.608876 l
160.516038 176.400587 l
160.853939 176.807264 l
161.161121 178.302301 l
161.898357 179.288993 l
162.205539 180.439021 l
162.850622 181.262375 l
163.495704 182.412404 l
163.987195 184.140781 l
164.294377 184.140781 l
164.601559 185.137472 l
165.338796 186.064162 l
165.645978 187.690869 l
166.567524 189.187573 l
168.410616 192.737662 l
168.717799 193.19434 l
170.560891 197.406112 l
170.898791 197.691119 l
171.205973 198.871149 l
171.636028 199.431163 l
171.94321 200.071179 l
172.28111 201.394545 l
172.956911 202.482906 l
173.786302 204.39462 l
174.492821 205.687986 l
175.137903 206.734679 l
175.445085 207.70137 l
176.182322 209.034736 l
176.520222 210.264767 l
177.441768 211.516465 l
177.779668 212.218149 l
178.08685 213.479847 l
178.824087 214.446538 l
179.46917 215.961576 l
180.267843 217.558283 l
180.882207 218.373303 l
181.220107 218.993319 l
181.588726 220.570025 l
182.233808 221.231708 l
183.4011 224.40512 l
184.0769 225.106805 l
184.4148 226.581842 l
184.752701 227.416862 l
185.428501 228.128547 l
185.735683 229.196907 l
186.13502 230.040261 l
187.578775 232.471989 l
187.885957 234.038695 l
188.86894 235.452063 l
189.20684 236.388753 l
189.790486 237.253775 l
191.08065 239.968843 l
191.695014 241.678886 l
192.309379 242.462238 l
193.077334 244.363953 l
194.091034 246.287334 l
194.428935 246.500673 l
195.135453 248.149047 l
195.964845 249.369078 l
196.272027 250.2641 l
196.609927 251.647468 l
196.947827 252.125813 l
197.562191 253.794188 l
197.869373 254.049195 l
198.60661 255.635901 l
199.405283 257.690952 l
199.712466 258.147631 l
200.66473 260.37602 l
201.279094 261.484381 l
202.139204 263.774438 l
202.87644 264.069445 l
203.214341 265.411145 l
203.890141 266.082829 l
204.25876 267.252858 l
204.565942 267.691202 l
205.395333 269.826256 l
205.702515 270.152931 l
206.316879 271.769638 l
206.961961 273.274675 l
207.299862 273.61135 l
207.607044 274.089696 l
208.374999 276.621426 l
208.682181 276.621426 l
208.989363 277.893124 l
209.388699 278.728145 l
209.695882 279.033153 l
210.003064 279.174823 l
210.310246 280.416521 l
210.709582 280.711528 l
211.846156 282.898249 l
212.153338 283.763271 l
213.197757 285.471647 l
213.504939 286.866682 l
214.180739 287.955042 l
214.948694 288.605059 l
216.607477 288.880065 l
216.914659 288.433388 l
217.713333 287.975043 l
218.112669 288.086712 l
218.419851 287.873374 l
219.064933 287.771704 l
219.372116 287.670035 l
219.740734 287.771704 l
220.078634 287.690036 l
220.385816 287.893374 l
220.938744 287.945042 l
221.307362 288.148381 l
221.921726 287.995043 l
223.611228 288.056712 l
224.102719 288.13838 l
224.440619 288.361719 l
224.747801 288.310051 l
225.085701 288.463388 l
225.700065 287.985043 l
226.037966 287.821706 l
226.375866 287.486697 l
226.713766 287.385028 l
227.174539 287.913375 l
227.481721 287.995043 l
227.881058 287.945042 l
228.18824 288.096713 l
229.816305 287.985043 l
230.338514 288.27005 l
232.45807 288.126713 l
232.79597 288.178381 l
233.164589 287.903374 l
233.65608 287.710036 l
234.024698 287.730037 l
234.700499 288.086712 l
235.314863 287.975043 l
235.652763 288.066712 l
236.39 287.425029 l
236.820055 287.375028 l
238.110219 288.696728 l
239.093202 288.178381 l
239.400384 287.893374 l
239.98403 287.811705 l
240.383366 288.158381 l
240.690549 288.27005 l
241.059167 288.015044 l
241.366349 287.955042 l
241.704249 287.720036 l
242.042149 287.853373 l
242.410768 287.628368 l
243.823805 287.913375 l
244.130987 288.39172 l
244.745351 288.116713 l
245.083252 288.25005 l
245.697616 287.913375 l
246.404134 287.933375 l
246.895626 288.208382 l
247.202808 288.168381 l
247.540708 288.27005 l
247.878608 287.995043 l
248.18579 287.965043 l
249.168773 287.558366 l
249.598827 287.506698 l
251.472638 288.27005 l
251.810538 288.066712 l
252.824239 288.240049 l
253.285012 288.025044 l
253.622912 288.218382 l
253.930094 287.975043 l
254.544458 288.25005 l
255.496722 287.720036 l
256.295396 287.903374 l
257.616278 287.933375 l
258.384234 287.853373 l
258.722134 288.178381 l
259.060034 288.148381 l
259.551525 288.341719 l
259.889425 288.331718 l
260.50379 288.025044 l
261.486772 287.506698 l
261.793954 287.650035 l
262.131854 288.433388 l
263.57561 287.873374 l
264.220692 287.435029 l
264.589311 287.476697 l
264.896493 287.690036 l
265.695166 288.545057 l
266.002348 288.40172 l
266.340248 288.116713 l
267.353949 287.771704 l
268.889859 288.310051 l
269.227759 288.27005 l
269.872842 288.015044 l
271.132288 287.680035 l
272.238143 288.178381 l
272.852507 288.066712 l
273.896926 287.496698 l
274.234826 287.435029 l
274.542008 287.660035 l
275.0335 288.310051 l
275.3714 288.39172 l
275.7093 288.351719 l
276.016482 288.473389 l
276.354382 288.463388 l
276.999465 287.883374 l
277.306647 287.781705 l
278.166756 287.933375 l
278.504657 288.218382 l
278.811839 288.066712 l
279.119021 287.781705 l
279.426203 287.751704 l
280.040567 288.005044 l
280.747085 287.761704 l
281.207858 287.913375 l
281.607195 287.893374 l
281.945095 288.148381 l
282.958796 288.158381 l
283.941779 288.230049 l
284.43327 287.975043 l
285.047634 288.036711 l
285.385534 287.821706 l
286.092053 287.995043 l
286.706417 287.628368 l
287.105753 287.548366 l
287.566527 287.781705 l
287.873709 287.781705 l
288.180891 288.046711 l
289.839674 288.371719 l
290.208292 288.168381 l
290.669065 288.168381 l
291.713484 287.781705 l
292.051384 287.985043 l
292.727185 288.025044 l
293.034367 288.116713 l
295.000332 287.821706 l
295.36895 287.923375 l
295.676132 287.801705 l
296.014032 288.036711 l
296.382651 288.005044 l
296.720551 288.25005 l
297.549943 288.168381 l
298.225743 287.945042 l
298.563643 287.913375 l
298.932262 287.720036 l
299.608062 287.588367 l
300.314581 288.341719 l
301.635464 287.771704 l
303.662865 288.240049 l
304.676566 287.965043 l
305.352366 287.893374 l
306.48894 288.116713 l
306.796122 287.975043 l
307.471922 288.178381 l
308.792805 287.791705 l
310.144406 288.076712 l
310.789488 288.015044 l
311.158107 287.466697 l
311.803189 269.572916 l
312.202525 273.021336 l
313.001199 289.876757 l
313.646281 290.385103 l
313.984181 288.300051 l
314.659982 287.588367 l
315.274346 288.036711 l
315.796555 288.046711 l
316.503074 288.605059 l
316.810256 289.246741 l
317.117438 289.440079 l
317.42462 289.348411 l
317.793238 289.490081 l
318.131139 289.876757 l
318.530475 290.080095 l
318.991248 289.673419 l
319.359867 291.666802 l
319.974231 303.072087 l
320.281413 304.262117 l
320.650031 304.445455 l
320.987932 304.393787 l
321.602296 301.962059 l
322.093787 301.118705 l
322.400969 300.915366 l
323.015333 299.296993 l
323.691133 298.116963 l
325.104171 286.815014 l
325.411353 286.520006 l
325.749253 285.939992 l
326.087153 272.77633 l
326.425054 264.80113 l
326.762954 262.227733 l
327.100854 261.892724 l
327.438754 260.926033 l
328.268146 251.872474 l
328.606046 251.810806 l
328.943946 252.594158 l
329.251128 252.960834 l
329.55831 252.919167 l
329.89621 253.040836 l
330.940629 252.552491 l
331.432121 252.817497 l
332.384385 252.237483 l
332.691567 252.715828 l
333.766704 252.075812 l
338.097971 252.309151 l
339.019517 252.450822 l
340.063936 252.38082 l
340.432554 252.53249 l
343.442938 252.440821 l
343.75012 252.482489 l
344.518075 252.349152 l
345.562494 252.38082 l
346.514758 252.26915 l
346.883377 252.329152 l
347.712768 252.289151 l
354.593646 251.922475 l
355.607346 251.882474 l
357.08182 251.830806 l
358.095521 251.810806 l
359.354967 251.729137 l
360.122922 251.699136 l
365.775072 251.44413 l
367.065236 251.352461 l
367.741037 251.384128 l
368.355401 251.282459 l
374.990533 251.089121 l
375.666333 251.109121 l
375.973515 251.027453 l
376.925779 251.077454 l
384.543894 250.935784 l
385.956931 250.915783 l
388.015051 250.945784 l
389.274497 250.925783 l
391.056153 250.915783 l
391.363335 250.987452 l
392.039135 250.935784 l
394.988083 250.987452 l
398.889295 251.027453 l
399.718686 251.047453 l
402.974816 251.149122 l
403.343434 251.139122 l
404.602881 250.610776 l
405.46299 250.600775 l
405.770172 250.620776 l
406.384536 251.362461 l
406.691718 251.109121 l
407.029619 250.670777 l
408.749838 246.255667 l
409.087738 245.960659 l
409.456357 247.415696 l
410.439339 244.63896 l
410.807958 244.200615 l
411.176576 243.957276 l
411.668067 243.845606 l
411.975249 244.292284 l
412.405304 241.718887 l
412.712486 242.583908 l
413.388287 251.565799 l
413.726187 252.054145 l
414.033369 252.044145 l
414.463424 252.665827 l
415.108506 252.64416 l
415.815025 252.319152 l
416.122207 252.339152 l
416.460107 252.145814 l
416.798007 252.207482 l
417.135907 251.699136 l
417.658117 250.509106 l
417.965299 250.172431 l
418.303199 250.355769 l
418.702536 251.34246 l
419.009718 252.594158 l
419.3169 252.757496 l
419.624082 252.584158 l
420.269164 252.502489 l
420.791374 251.577466 l
421.098556 251.485797 l
421.743638 251.565799 l
422.419438 251.475797 l
422.72662 251.627468 l
423.033802 251.577466 l
423.371703 251.394128 l
423.863194 251.962476 l
424.846176 251.902474 l
425.153358 251.657468 l
425.491259 251.617467 l
426.965732 251.932475 l
427.610815 251.952476 l
428.255897 252.054145 l
437.809258 251.962476 l
441.649034 251.820806 l
442.447707 251.840806 l
443.799308 251.872474 l
445.949582 251.840806 l
448.345602 251.759138 l
448.683502 251.810806 l
449.359303 251.719137 l
450.311567 251.667469 l
451.755322 251.637468 l
454.151342 251.535799 l
480.108224 250.742445 l
480.968334 250.762446 l
484.316618 250.680777 l
486.528328 250.732445 l
489.845894 250.712445 l
491.535395 250.762446 l
493.040587 250.752446 l
494.054288 250.752446 l
496.112408 250.762446 l
496.75749 250.804114 l
497.771191 250.772446 l
498.109091 250.844115 l
498.109091 250.844115 l
stroke
grestore
1.500 setlinewidth
1.000 0.498 0.055 setrgbcolor
gsave
446.4 271.8 72 45 clipbox
92.290909 162.831377 m
251.564055 162.816291 l
251.641772 162.944152 l
251.718445 162.712278 l
251.795425 162.859165 l
251.872067 162.814133 l
252.102484 162.858191 l
252.792968 162.854874 l
252.87047 162.902757 l
252.947327 162.7274 l
253.024306 162.854796 l
253.100733 162.798917 l
253.177713 162.889873 l
253.25414 162.813043 l
253.407762 162.816403 l
253.945515 162.847127 l
254.252912 162.80714 l
254.55994 162.850164 l
255.020498 162.819171 l
255.174181 162.862488 l
255.404506 162.783779 l
255.635046 162.884972 l
255.788515 162.828139 l
255.942413 162.856896 l
256.019116 162.77272 l
256.095482 162.851046 l
256.24938 162.806929 l
257.247906 162.841732 l
257.324179 162.77294 l
257.401282 162.898326 l
257.554903 162.805734 l
257.785321 162.905482 l
257.862024 162.787161 l
257.938973 162.855421 l
258.246155 162.808758 l
258.476265 162.81997 l
258.70702 162.875403 l
258.783632 162.772242 l
259.014202 162.891204 l
259.090844 162.784057 l
259.167302 162.842016 l
259.398149 162.824926 l
259.935595 162.82417 l
260.165644 162.814917 l
260.242869 162.891266 l
260.31945 162.783112 l
260.396214 162.861056 l
260.933844 162.797975 l
261.010978 162.86084 l
261.08762 162.779194 l
261.241364 162.8109 l
261.548423 162.794008 l
262.008613 162.835107 l
262.085961 162.900247 l
262.162695 162.756012 l
262.239675 162.846314 l
262.470062 162.818817 l
262.777305 162.788157 l
263.545045 162.804309 l
263.698452 162.822211 l
263.928992 162.89682 l
264.082767 162.799568 l
264.313215 162.833695 l
268.152684 162.789249 l
268.229602 162.904287 l
268.306551 162.822138 l
268.766894 162.842425 l
268.997588 162.843559 l
270.610109 162.825448 l
270.687304 162.879714 l
270.763731 162.789956 l
270.917568 162.826147 l
271.224412 162.816741 l
271.301484 162.905461 l
271.378248 162.793726 l
271.454829 162.847556 l
272.45314 162.804985 l
272.606854 162.827619 l
275.602001 162.911926 l
275.678674 162.72518 l
275.832419 162.830338 l
276.292854 162.756698 l
276.370049 162.870954 l
276.446414 162.774557 l
276.600005 162.867039 l
276.753381 162.844076 l
277.367561 162.779022 l
277.444817 162.895021 l
277.521643 162.776168 l
277.598715 162.83368 l
277.828518 162.813644 l
277.905744 162.879301 l
277.982048 162.787312 l
278.059243 162.88055 l
278.212895 162.841954 l
278.59678 162.796064 l
278.827136 162.851724 l
279.82514 162.797828 l
279.902273 162.895429 l
279.978946 162.786811 l
280.056018 162.860594 l
280.132414 162.790337 l
280.286189 162.827492 l
280.900492 162.787265 l
281.131063 162.88046 l
281.284347 162.851893 l
281.745181 162.883764 l
281.898649 162.845846 l
282.282412 162.846774 l
282.359791 162.903411 l
282.436095 162.772147 l
282.590178 162.82557 l
282.666789 162.777452 l
282.820349 162.830356 l
283.127654 162.872867 l
283.281276 162.848231 l
283.511171 162.801934 l
283.588273 162.914556 l
283.741772 162.814933 l
283.818783 162.868971 l
283.895363 162.780197 l
283.972435 162.883385 l
284.125596 162.85084 l
284.356628 162.819848 l
284.433178 162.764226 l
284.586707 162.840926 l
285.968627 162.804534 l
286.045853 162.918648 l
286.122617 162.770109 l
286.199444 162.834146 l
287.351346 162.813096 l
287.735108 162.809059 l
287.888822 162.861452 l
288.042659 162.832742 l
288.656931 162.821391 l
288.964205 162.85208 l
289.040447 162.777631 l
289.117704 162.91364 l
289.194376 162.767952 l
289.347937 162.818298 l
289.654934 162.844044 l
293.955268 162.833144 l
294.032647 162.896042 l
294.109074 162.754162 l
294.185992 162.883099 l
294.262818 162.813291 l
294.646673 162.899128 l
294.723008 162.805635 l
294.800356 162.900218 l
294.877213 162.74952 l
294.95407 162.827415 l
295.875248 162.882018 l
296.106003 162.778239 l
296.25987 162.807057 l
296.490103 162.904303 l
296.643663 162.810943 l
296.950815 162.84576 l
297.641391 162.806979 l
297.718555 162.921227 l
297.872392 162.773081 l
298.026228 162.853595 l
298.179512 162.852632 l
300.713272 162.802214 l
300.79059 162.904429 l
300.867478 162.767706 l
300.94415 162.815197 l
301.097926 162.846644 l
301.328067 162.830434 l
301.942062 162.783519 l
302.019226 162.898013 l
302.096022 162.785276 l
302.172848 162.845008 l
302.710478 162.782409 l
302.940526 162.823976 l
303.094578 162.82604 l
303.170882 162.790697 l
303.247985 162.909928 l
303.324811 162.785372 l
303.401668 162.851685 l
303.708912 162.823081 l
304.245989 162.816832 l
304.323214 162.875679 l
304.399703 162.788869 l
304.553447 162.819179 l
305.091231 162.895764 l
305.167873 162.760035 l
305.321156 162.835757 l
305.705318 162.882646 l
305.858848 162.848294 l
306.24258 162.846028 l
306.319529 162.902914 l
306.5501 162.765153 l
306.627079 162.863389 l
306.703752 162.802798 l
306.934016 162.884031 l
307.087607 162.839568 l
308.699729 162.833279 l
308.776954 162.918926 l
308.853781 162.770386 l
308.93076 162.828672 l
309.314185 162.827427 l
309.391349 162.894597 l
309.545032 162.827302 l
310.927351 162.748942 l
311.004362 163.03162 l
311.08125 162.441804 l
311.235547 176.184249 l
312.003011 235.555651 l
312.079868 236.786113 l
312.463569 221.102381 l
312.69414 228.029449 l
312.77072 228.090579 l
313.001137 221.845034 l
313.078209 218.835961 l
313.155005 219.24435 l
313.308227 220.22314 l
313.461818 222.271238 l
313.615348 220.419849 l
313.769553 216.721867 l
313.922898 216.516592 l
314.076367 217.422654 l
314.229466 216.160135 l
314.46016 213.344226 l
314.537324 213.279423 l
314.614058 214.00243 l
314.690823 213.2531 l
314.767772 213.378145 l
314.84426 213.146239 l
315.074954 210.726566 l
315.228299 209.872206 l
315.305003 209.96817 l
315.381767 209.825949 l
315.919674 205.825052 l
315.996377 206.068134 l
316.456904 201.691318 l
316.533792 202.797638 l
316.764394 200.821742 l
316.994872 199.804167 l
317.071576 199.272731 l
317.225197 197.582559 l
317.301348 198.718934 l
317.378389 196.345318 l
317.455645 197.36909 l
317.609267 194.665075 l
317.685848 194.904796 l
317.916296 191.976657 l
317.993152 192.650244 l
318.069856 191.45703 l
318.14702 192.219038 l
318.45411 188.542761 l
318.530567 189.747346 l
318.607547 188.226261 l
318.684558 188.242847 l
318.761292 188.458717 l
318.837872 187.072872 l
318.91476 187.126655 l
318.991494 187.044247 l
319.068351 186.592669 l
319.22185 184.709698 l
319.298492 186.132251 l
319.375564 184.469837 l
319.452329 184.559518 l
319.606227 159.675193 l
319.682807 165.331568 l
319.836705 155.592997 l
319.913378 163.503825 l
319.990327 157.02234 l
320.066478 164.209616 l
320.143703 157.266248 l
320.220622 163.435714 l
320.297386 158.601459 l
320.373629 159.368692 l
320.451131 161.790331 l
320.527343 159.337291 l
320.604353 160.932911 l
320.680965 160.468966 l
320.757883 159.966322 l
320.834648 160.769383 l
320.911413 159.760868 l
320.988085 160.703327 l
321.064942 160.392206 l
321.141891 159.784944 l
321.218717 161.078518 l
321.295697 159.624086 l
321.372308 160.920038 l
321.448858 159.836753 l
321.525316 160.64241 l
321.602296 160.592673 l
321.679398 159.538782 l
321.756163 161.260674 l
321.832928 159.782712 l
321.909508 160.383896 l
321.986365 160.57913 l
322.063376 159.795727 l
322.140509 160.743197 l
322.21666 160.420581 l
322.293609 159.913316 l
322.370312 160.871932 l
322.447446 159.849228 l
322.523842 160.594275 l
322.600791 160.435814 l
322.677556 159.967282 l
322.754597 160.651093 l
322.830932 159.997456 l
322.907973 160.688919 l
322.984922 160.155991 l
323.061595 160.228076 l
323.138574 160.49323 l
323.215247 160.188356 l
323.292135 160.476124 l
323.44505 160.157918 l
323.522306 160.656917 l
323.599225 160.042556 l
323.752539 160.432587 l
323.829918 160.089923 l
323.906161 160.548976 l
323.983233 160.236901 l
324.059445 160.36014 l
324.136547 160.511283 l
324.213527 160.01573 l
324.290353 160.650222 l
324.367087 160.017042 l
324.444098 160.507582 l
324.520678 160.284428 l
324.597597 160.178419 l
324.674147 160.616403 l
324.751065 160.108671 l
324.827953 160.481975 l
324.981452 160.243909 l
325.058431 160.546122 l
325.13495 160.099349 l
325.211992 160.516939 l
325.365368 160.257379 l
325.441917 160.507331 l
325.595693 160.25911 l
325.672795 160.385505 l
325.749437 160.226689 l
325.82611 160.450717 l
325.902783 160.291279 l
325.979609 160.422304 l
326.133538 160.288471 l
326.363894 160.346322 l
326.440505 160.233785 l
326.594219 160.471569 l
326.670953 160.165212 l
326.747902 160.375751 l
326.82439 160.325078 l
327.131541 160.227323 l
327.208552 160.432142 l
327.285347 160.215836 l
327.362082 160.426314 l
327.515888 160.28964 l
327.745875 160.389462 l
327.823008 160.249054 l
327.976691 160.352305 l
328.053364 160.207913 l
328.13019 160.46226 l
328.206955 160.203158 l
328.283904 160.421328 l
328.36027 160.249536 l
328.437372 160.432753 l
328.590994 160.280296 l
328.744554 160.337496 l
328.974419 160.286514 l
329.051613 160.484096 l
329.128225 160.184587 l
329.204989 160.41761 l
329.281939 160.353323 l
329.358826 160.216058 l
329.43556 160.375983 l
329.512325 160.305651 l
329.666039 160.414327 l
329.742834 160.205922 l
329.896364 160.357832 l
330.049955 160.294306 l
330.126843 160.387015 l
330.2033 160.281222 l
330.28028 160.425654 l
330.357168 160.260748 l
330.43384 160.320798 l
331.04842 160.351879 l
331.125123 160.249774 l
331.20198 160.408882 l
331.278652 160.263081 l
331.355417 160.398255 l
331.431998 160.285101 l
331.509008 160.382302 l
331.585927 160.309863 l
331.739487 160.32779 l
331.89317 160.347631 l
331.969781 160.265852 l
332.123372 160.413645 l
332.20026 160.26136 l
332.277056 160.329182 l
332.584145 160.304728 l
332.660726 160.412951 l
332.737921 160.331638 l
332.814532 160.249749 l
332.968092 160.354894 l
333.121745 160.28733 l
333.198632 160.405207 l
333.274998 160.256598 l
333.352223 160.423013 l
333.428896 160.251439 l
333.505907 160.362935 l
333.582641 160.297721 l
333.966557 160.429365 l
334.043352 160.273837 l
334.120332 160.322179 l
334.196974 160.267562 l
334.273708 160.397424 l
334.350596 160.322363 l
334.503879 160.263048 l
334.580859 160.448789 l
334.734696 160.24643 l
334.811277 160.382493 l
334.888041 160.313738 l
335.041755 160.343278 l
335.118059 160.28894 l
335.195162 160.458566 l
335.272142 160.204344 l
335.348814 160.312234 l
335.502651 160.319848 l
335.732423 160.31268 l
335.809403 160.414638 l
335.963117 160.300747 l
336.117015 160.329193 l
336.193596 160.244629 l
336.270422 160.399223 l
336.347064 160.32252 l
336.577604 160.354302 l
336.731226 160.325449 l
336.884878 160.338983 l
336.961459 160.276923 l
337.115142 160.333074 l
337.729444 160.328524 l
337.883066 160.320082 l
338.266982 160.389083 l
338.420758 160.300569 l
338.651021 160.312447 l
338.881531 160.394454 l
338.958173 160.226487 l
339.035152 160.377063 l
339.188774 160.31338 l
339.495833 160.383508 l
339.649363 160.326409 l
340.110289 160.444072 l
340.187054 160.232893 l
340.263942 160.353334 l
340.340645 160.293867 l
340.571278 160.3253 l
340.647367 160.269006 l
340.7245 160.451262 l
340.878306 160.287392 l
341.185058 160.345423 l
341.338833 160.381294 l
341.415752 160.240516 l
341.492547 160.31413 l
341.646415 160.323819 l
341.722811 160.283249 l
341.876095 160.331098 l
341.953167 160.382541 l
342.030085 160.275377 l
342.106819 160.336412 l
342.337206 160.313966 l
342.567684 160.351267 l
342.798071 160.300748 l
343.028457 160.348957 l
343.105007 160.278667 l
343.182018 160.400304 l
343.412527 160.257448 l
343.565749 160.333923 l
343.796412 160.39461 l
343.949942 160.294623 l
344.103564 160.350054 l
344.257216 160.33762 l
344.410961 160.429122 l
344.487572 160.206977 l
344.641071 160.32803 l
345.025294 160.383039 l
345.102028 160.24188 l
345.255588 160.36567 l
345.409149 160.326934 l
345.79328 160.362929 l
345.946717 160.313851 l
346.100401 160.323319 l
346.176889 160.296767 l
346.253899 160.415981 l
346.330664 160.271773 l
346.407521 160.331665 l
346.791161 160.322006 l
346.868356 160.403563 l
346.945274 160.258405 l
347.022039 160.307867 l
347.329098 160.365748 l
347.559392 160.269541 l
347.712983 160.326887 l
348.404296 160.329438 l
348.941865 160.341617 l
349.248801 160.320675 l
349.32575 160.394037 l
349.479649 160.302515 l
350.477345 160.319822 l
350.554663 160.3789 l
350.631151 160.235767 l
350.784681 160.326723 l
351.168781 160.402808 l
351.245454 160.245361 l
351.322341 160.36727 l
351.399137 160.304526 l
351.629769 160.32836 l
351.705858 160.287279 l
351.783084 160.451456 l
351.859818 160.266347 l
351.936736 160.327747 l
352.320284 160.276753 l
352.397386 160.437079 l
352.551162 160.285323 l
352.704691 160.34618 l
352.934648 160.366095 l
353.011781 160.378673 l
353.088822 160.248201 l
353.165495 160.308355 l
353.472708 160.349399 l
353.856593 160.319712 l
354.240571 160.416117 l
354.317397 160.253826 l
354.394254 160.328262 l
354.777924 160.28542 l
354.854996 160.415127 l
354.931761 160.280572 l
355.008833 160.335984 l
355.085414 160.257928 l
355.162424 160.397301 l
355.239005 160.272107 l
355.469514 160.44545 l
355.546094 160.220482 l
355.699716 160.315392 l
355.93041 160.394358 l
356.006622 160.28266 l
356.083632 160.441906 l
356.160581 160.268625 l
356.237315 160.317528 l
356.698027 160.391513 l
356.774792 160.274955 l
356.851649 160.333999 l
357.082066 160.26837 l
357.1588 160.385556 l
357.235319 160.31337 l
357.312299 160.407132 l
357.388941 160.281298 l
357.466013 160.351187 l
357.619665 160.328806 l
358.54115 160.415429 l
358.618038 160.261784 l
358.69511 160.306806 l
358.771536 160.288644 l
358.848455 160.393054 l
358.925189 160.310242 l
359.155514 160.410829 l
359.23234 160.252132 l
359.309259 160.348164 l
359.539768 160.307312 l
359.692775 160.372936 l
359.770032 160.398961 l
359.846674 160.248868 l
359.923592 160.365461 l
360.000387 160.29335 l
360.230713 160.358341 l
360.461068 160.276598 l
360.614997 160.30144 l
360.921534 160.310318 l
360.998606 160.422917 l
361.075432 160.269569 l
361.15232 160.334252 l
361.459564 160.337481 l
361.99704 160.321306 l
364.070457 160.395165 l
364.147253 160.267216 l
364.224294 160.343095 l
364.300844 160.27518 l
364.454558 160.331804 l
364.607657 160.3345 l
364.684698 160.405219 l
364.838474 160.295092 l
365.145594 160.332321 l
365.222052 160.30619 l
365.299308 160.406637 l
365.375889 160.233732 l
365.452807 160.360599 l
365.529388 160.313616 l
365.759836 160.338439 l
365.913734 160.381877 l
365.990314 160.215647 l
366.067171 160.376083 l
366.144059 160.293888 l
366.52776 160.374548 l
366.681474 160.335691 l
366.835095 160.298417 l
366.988748 160.337821 l
367.065113 160.297472 l
367.142216 160.415028 l
367.21895 160.269899 l
367.295869 160.34619 l
367.526163 160.322299 l
367.679447 160.282521 l
367.756488 160.435114 l
367.910202 160.296563 l
368.217384 160.338788 l
368.293749 160.317088 l
368.371006 160.418942 l
368.447832 160.250543 l
368.524597 160.311652 l
368.678403 160.333217 l
368.754922 160.271074 l
368.908267 160.342454 l
369.138869 160.320197 l
370.213883 160.406938 l
370.444331 160.246518 l
370.521249 160.398251 l
370.598168 160.306315 l
370.751206 160.369628 l
370.828278 160.401259 l
370.905104 160.272878 l
370.981991 160.326227 l
371.3656 160.320708 l
371.442765 160.41726 l
371.519499 160.2568 l
371.596417 160.336233 l
371.979995 160.33024 l
372.057251 160.384692 l
372.133924 160.237263 l
372.21075 160.36068 l
372.287669 160.308669 l
373.285918 160.43308 l
373.362837 160.267574 l
373.439632 160.307133 l
373.746814 160.313569 l
374.514677 160.41534 l
374.59138 160.254019 l
374.668237 160.331573 l
378.738153 160.286307 l
378.815164 160.441287 l
378.968909 160.302853 l
379.429743 160.442267 l
379.506508 160.263659 l
379.583334 160.321813 l
380.043984 160.4138 l
380.12078 160.246102 l
380.197667 160.333496 l
380.4279 160.315339 l
380.658379 160.401365 l
380.735205 160.265064 l
380.811909 160.312256 l
381.042295 160.346146 l
381.19561 160.326749 l
381.272651 160.393623 l
381.349385 160.267759 l
381.426457 160.331731 l
381.502976 160.285468 l
381.656629 160.313376 l
382.040944 160.329822 l
382.117402 160.273308 l
382.194259 160.392853 l
382.348003 160.323406 l
384.267307 160.312448 l
384.344441 160.419805 l
384.421175 160.262564 l
384.498185 160.338653 l
384.728387 160.306543 l
384.958805 160.451639 l
385.035815 160.256414 l
385.112488 160.298927 l
385.419578 160.339774 l
385.803525 160.322743 l
386.18741 160.373923 l
386.341032 160.323998 l
388.644928 160.41439 l
388.721631 160.250653 l
388.875222 160.315645 l
389.259292 160.377991 l
389.336026 160.261749 l
389.412913 160.336925 l
389.796584 160.298301 l
389.873625 160.413138 l
389.95039 160.280689 l
390.027339 160.330441 l
390.410886 160.291196 l
390.488081 160.440562 l
390.564877 160.250616 l
390.641734 160.316535 l
393.790534 160.334773 l
393.867145 160.272909 l
394.020552 160.359228 l
394.327857 160.288241 l
394.48157 160.344393 l
394.711373 160.309732 l
394.788537 160.418494 l
394.865394 160.250975 l
394.942159 160.330112 l
396.554496 160.337474 l
396.631599 160.426766 l
396.708394 160.270164 l
396.785313 160.328443 l
397.092464 160.316707 l
397.246147 160.400796 l
397.322789 160.23677 l
397.399738 160.362422 l
397.476319 160.29709 l
397.55336 160.371661 l
397.630063 160.284606 l
397.70689 160.353177 l
397.937215 160.218723 l
398.014072 160.377294 l
398.090867 160.311821 l
398.474845 160.413177 l
398.551548 160.25392 l
398.628497 160.343127 l
398.782088 160.297991 l
398.93571 160.341126 l
399.319595 160.319382 l
399.703573 160.441506 l
399.857256 160.266649 l
400.010786 160.319286 l
400.317968 160.404765 l
400.394763 160.256309 l
400.471589 160.326089 l
401.700748 160.343291 l
401.777205 160.250329 l
401.854031 160.387594 l
401.930704 160.329348 l
402.545222 160.313778 l
403.236258 160.312872 l
403.389911 160.392861 l
403.466645 160.261123 l
403.543563 160.336591 l
403.850592 160.317547 l
404.004551 160.392535 l
404.081009 160.198631 l
404.157897 160.390359 l
404.234661 160.307187 l
404.618547 160.397825 l
404.772261 160.320459 l
405.155839 160.310665 l
405.232942 160.413271 l
405.309737 160.258256 l
405.386533 160.333699 l
405.770111 160.304796 l
405.847183 160.418287 l
406.000989 160.291208 l
406.308079 160.368498 l
406.384506 160.311281 l
406.461731 160.398172 l
406.538465 160.243871 l
406.692026 160.322556 l
407.076064 160.361093 l
407.229748 160.324976 l
408.227813 160.307808 l
408.304793 160.393872 l
408.535241 160.258725 l
408.612098 160.385548 l
408.688954 160.315546 l
409.533797 160.382935 l
409.61047 160.249205 l
409.763999 160.306996 l
409.994478 160.330421 l
411.299664 160.285037 l
411.376767 160.428418 l
411.530419 160.28223 l
411.683979 160.326828 l
411.991131 160.430074 l
412.067926 160.24919 l
412.144752 160.329325 l
412.989503 160.278957 l
413.14294 160.319405 l
413.220012 160.381906 l
413.296654 160.276433 l
413.373542 160.35109 l
413.603867 160.317537 l
413.834315 160.359912 l
414.064671 160.301182 l
414.218262 160.342462 l
414.678943 160.281773 l
414.832779 160.316225 l
414.985817 160.363014 l
415.062951 160.39681 l
415.139716 160.261237 l
415.216665 160.336568 l
415.523816 160.333367 l
416.828879 160.312479 l
416.906012 160.418761 l
416.982685 160.270421 l
417.059757 160.355483 l
417.213256 160.355793 l
417.443243 160.313051 l
417.520407 160.410625 l
417.674121 160.289442 l
417.904415 160.332448 l
418.671879 160.3203 l
418.749105 160.403844 l
418.825962 160.252519 l
418.902726 160.322538 l
420.131454 160.354028 l
420.361718 160.307512 l
420.592074 160.406539 l
420.668931 160.271925 l
420.746003 160.317326 l
420.822522 160.276214 l
420.89941 160.390729 l
421.053031 160.311527 l
421.206499 160.416961 l
421.283203 160.271519 l
421.360183 160.352321 l
421.590723 160.295556 l
423.586976 160.246088 l
423.663956 160.426421 l
423.81767 160.327555 l
424.201217 160.304914 l
424.278228 160.417753 l
424.432095 160.273537 l
424.585778 160.36496 l
424.662389 160.27806 l
424.892745 160.406676 l
424.969449 160.249568 l
425.12307 160.295407 l
425.200204 160.363075 l
425.276723 160.259282 l
425.353549 160.385636 l
425.43016 160.31807 l
425.583935 160.29493 l
425.967821 160.350203 l
426.351829 160.289631 l
426.582246 160.357977 l
426.658673 160.306013 l
426.735653 160.404573 l
426.889643 160.319195 l
426.96607 160.256921 l
427.042897 160.403921 l
427.119784 160.316428 l
430.421868 160.407558 l
430.575643 160.270496 l
430.729388 160.337183 l
430.805907 160.291424 l
431.036324 160.416886 l
431.113089 160.233925 l
431.189823 160.334963 l
432.802099 160.335742 l
432.879263 160.4127 l
432.956181 160.258301 l
433.032946 160.302449 l
433.340097 160.327688 l
433.416463 160.307481 l
433.493627 160.408412 l
433.570515 160.265128 l
433.647279 160.30653 l
433.954431 160.357909 l
434.030735 160.30878 l
434.107991 160.430958 l
434.184664 160.232575 l
434.338316 160.327542 l
435.873858 160.30593 l
435.950899 160.394368 l
436.104797 160.3194 l
436.181224 160.283184 l
436.258142 160.393667 l
436.334969 160.318322 l
437.179842 160.39704 l
437.256484 160.213642 l
437.409952 160.348021 l
438.177907 160.321333 l
438.408263 160.427199 l
438.485028 160.281387 l
438.561977 160.329448 l
438.945647 160.288281 l
439.022658 160.418518 l
439.176464 160.26781 l
439.406697 160.348518 l
439.55995 160.312005 l
439.637114 160.414952 l
439.790767 160.26715 l
439.944542 160.332159 l
440.174314 160.316786 l
440.251447 160.401378 l
440.328243 160.266114 l
440.405038 160.323805 l
440.865842 160.369942 l
441.019341 160.327221 l
441.480053 160.345958 l
441.787388 160.338042 l
442.017345 160.314529 l
442.094386 160.403272 l
442.248284 160.306566 l
442.63174 160.343725 l
442.708812 160.387706 l
442.862495 160.327113 l
443.246042 160.358279 l
443.323268 160.40048 l
443.399848 160.255177 l
443.476828 160.362094 l
443.553531 160.289333 l
443.783887 160.323878 l
443.937478 160.378819 l
444.091039 160.322517 l
444.551904 160.383954 l
444.628638 160.27218 l
444.705556 160.330081 l
445.089196 160.322672 l
445.166268 160.384455 l
445.320012 160.290583 l
445.550307 160.348789 l
445.703437 160.329581 l
445.780601 160.418301 l
445.934284 160.272638 l
446.088121 160.332187 l
446.164671 160.278452 l
446.395057 160.422192 l
446.471822 160.246304 l
446.548618 160.329279 l
447.623724 160.344381 l
447.854172 160.314351 l
448.238057 160.397036 l
448.392017 160.305643 l
448.468505 160.281578 l
448.62225 160.337674 l
448.775349 160.35686 l
448.85236 160.388685 l
449.006166 160.299579 l
449.466878 160.387852 l
449.543612 160.262155 l
449.620469 160.340322 l
450.004078 160.344232 l
450.081457 160.385475 l
450.157945 160.224032 l
450.234863 160.38805 l
450.311813 160.316907 l
450.465189 160.343785 l
451.156594 160.346313 l
451.232867 160.310629 l
451.310031 160.420045 l
451.386735 160.268909 l
451.463622 160.339895 l
451.84717 160.307557 l
451.924334 160.418133 l
452.078017 160.286656 l
452.231608 160.343162 l
452.461472 160.317823 l
452.538698 160.410329 l
452.615463 160.257637 l
452.692258 160.324087 l
453.38351 160.325246 l
457.376477 160.28979 l
457.453549 160.43171 l
457.607232 160.315382 l
458.067944 160.407979 l
458.221719 160.286981 l
458.375341 160.34697 l
458.605144 160.31969 l
458.6824 160.40697 l
458.759165 160.253525 l
458.83593 160.330334 l
459.296703 160.394041 l
459.450294 160.326795 l
460.679206 160.31789 l
460.986204 160.295432 l
461.139703 160.401919 l
461.293539 160.313861 l
461.676964 160.36033 l
461.75419 160.415749 l
461.830924 160.255144 l
461.907781 160.335116 l
462.291328 160.337734 l
462.368707 160.379879 l
462.445257 160.226763 l
462.522083 160.370964 l
462.599002 160.328515 l
462.829204 160.34367 l
463.520087 160.285914 l
463.597098 160.417427 l
463.750842 160.299914 l
464.058116 160.314177 l
464.134359 160.316733 l
464.211554 160.431252 l
464.288472 160.26249 l
464.365268 160.300954 l
464.518951 160.344741 l
464.672388 160.360225 l
465.056335 160.323757 l
465.901208 160.350099 l
466.131503 160.307434 l
466.515603 160.356674 l
466.823 160.307686 l
467.129937 160.321361 l
467.437272 160.314319 l
467.744301 160.299903 l
467.898107 160.40606 l
467.974687 160.216846 l
468.128278 160.328097 l
469.741137 160.414998 l
469.817687 160.220054 l
469.894698 160.371687 l
469.971309 160.292958 l
470.201788 160.372789 l
470.278122 160.302532 l
470.35544 160.415186 l
470.432113 160.222575 l
470.509062 160.363831 l
470.585581 160.291958 l
470.662561 160.388737 l
470.739049 160.290863 l
470.816244 160.375688 l
470.892333 160.262067 l
470.969589 160.465033 l
471.046292 160.232918 l
471.123211 160.341472 l
472.121122 160.307663 l
472.198287 160.397817 l
472.274959 160.265147 l
472.352 160.353706 l
472.50553 160.349207 l
472.735517 160.276276 l
472.81262 160.446772 l
472.966365 160.25875 l
473.119894 160.355322 l
473.349789 160.322613 l
473.427015 160.426012 l
473.504087 160.239459 l
473.58079 160.298675 l
473.734473 160.374098 l
473.811023 160.264817 l
473.887818 160.387296 l
473.964215 160.320417 l
474.041409 160.407672 l
474.118174 160.250261 l
474.195 160.334652 l
475.039751 160.31052 l
475.27023 160.377334 l
475.500616 160.261012 l
475.577504 160.387999 l
475.654269 160.310483 l
475.884502 160.415368 l
476.038246 160.321342 l
477.036158 160.328654 l
477.113383 160.407429 l
477.190148 160.246 l
477.267097 160.338871 l
477.497299 160.333407 l
477.727778 160.373163 l
477.804481 160.262013 l
477.958349 160.309433 l
478.26504 160.307761 l
478.342142 160.393506 l
478.418876 160.264237 l
478.495733 160.350435 l
478.72612 160.334396 l
478.879342 160.295598 l
478.956506 160.444858 l
479.033486 160.251614 l
479.110067 160.298209 l
479.263719 160.340805 l
479.493645 160.310859 l
479.57084 160.423834 l
479.647666 160.254179 l
479.724431 160.320458 l
480.646007 160.366161 l
480.876302 160.284434 l
481.106811 160.351255 l
481.33686 160.318593 l
481.413901 160.391842 l
481.567891 160.313782 l
481.644288 160.274904 l
481.721206 160.404378 l
481.874766 160.334171 l
482.412396 160.312969 l
482.642814 160.411986 l
482.719517 160.24012 l
482.796374 160.340057 l
483.180075 160.352821 l
485.100331 160.426461 l
485.177096 160.244825 l
485.253953 160.331555 l
486.098458 160.320377 l
486.328906 160.350892 l
486.559477 160.297029 l
486.789863 160.3375 l
486.86629 160.302084 l
486.94327 160.394724 l
487.173779 160.27218 l
487.327493 160.315979 l
488.172152 160.412501 l
488.248886 160.252187 l
488.325743 160.33687 l
488.709382 160.348893 l
488.786577 160.383416 l
488.86328 160.251274 l
489.016841 160.321233 l
489.861653 160.319451 l
489.937957 160.313203 l
490.015029 160.420511 l
490.168835 160.282727 l
490.399098 160.338812 l
491.166562 160.306193 l
491.243757 160.427864 l
491.320491 160.253737 l
491.397379 160.328703 l
492.241945 160.300381 l
492.318925 160.375748 l
492.395352 160.290304 l
492.472393 160.408432 l
492.549127 160.277679 l
492.626168 160.344355 l
492.702687 160.281446 l
492.779728 160.3804 l
492.933289 160.311086 l
493.086788 160.401468 l
493.163583 160.278766 l
493.240501 160.327558 l
493.547653 160.305694 l
493.701275 160.397342 l
493.777947 160.242367 l
493.931569 160.308203 l
494.162017 160.334582 l
494.852839 160.30739 l
494.929849 160.412418 l
495.006645 160.277587 l
495.083624 160.339288 l
495.313888 160.321367 l
495.544305 160.451818 l
495.697988 160.294332 l
495.697988 160.294332 l
stroke
grestore
1.000 setlinewidth
0.173 0.627 0.173 setrgbcolor
gsave
446.4 271.8 72 45 clipbox
97.390131 160.326852 m
153.420133 160.38004 l
153.696597 160.592793 l
154.249525 161.390616 l
154.802453 162.560755 l
155.908308 165.220164 l
157.352063 168.145514 l
159.010846 172.081439 l
160.116702 173.943025 l
160.946093 176.017364 l
161.499021 176.815186 l
162.051948 178.304455 l
162.88134 179.9001 l
163.434268 181.176617 l
163.987195 182.187192 l
164.263659 183.091391 l
164.878023 184.048778 l
165.430951 185.378482 l
165.707415 185.697611 l
166.81327 188.197456 l
167.15117 188.94209 l
167.427634 189.261219 l
168.809953 192.239757 l
169.086417 192.718451 l
169.362881 193.569461 l
169.639345 193.994967 l
170.7452 196.494811 l
171.021664 196.867128 l
171.574591 198.090456 l
176.335913 207.983457 l
176.612377 208.46215 l
176.888841 209.366349 l
177.165304 209.738667 l
184.353364 224.79092 l
185.244192 226.386565 l
185.797119 227.71627 l
186.073583 228.088587 l
187.179439 230.747996 l
187.455902 231.173501 l
188.561758 233.673345 l
188.838222 234.098851 l
189.114685 234.737109 l
189.452586 235.215802 l
189.729049 236.013625 l
190.343414 237.183765 l
191.172805 238.992163 l
191.449269 239.417668 l
192.27866 241.438819 l
192.555124 241.811136 l
193.660979 244.257792 l
193.937443 244.630109 l
194.213907 245.48112 l
194.490371 245.853437 l
194.766835 246.598072 l
195.043299 246.970389 l
198.760201 254.842239 l
199.098101 255.267744 l
199.374565 256.171943 l
199.988929 257.182519 l
200.265393 258.033529 l
201.094785 259.682363 l
201.371248 260.426997 l
201.985613 261.278008 l
202.53854 262.98003 l
203.091468 263.671476 l
203.920859 265.639438 l
204.473787 266.543637 l
205.303178 268.617976 l
206.13257 270.107245 l
207.299862 272.713466 l
207.852789 273.511288 l
208.129253 274.309111 l
208.467153 274.894181 l
208.743617 275.745192 l
209.296545 276.862143 l
209.849473 277.979095 l
210.4024 278.936482 l
210.893891 279.734305 l
211.170355 280.478939 l
211.969029 282.127773 l
212.521956 283.404289 l
214.365048 287.127461 l
214.641512 287.552966 l
215.53234 287.978472 l
216.146704 288.03166 l
216.423168 288.138036 l
216.699632 288.03166 l
217.25256 288.03166 l
218.081951 287.765719 l
220.140071 287.872095 l
221.52239 288.084848 l
222.075317 288.084848 l
222.689681 288.084848 l
223.242609 288.03166 l
223.519073 287.925284 l
224.133437 287.978472 l
224.962828 287.925284 l
226.683048 287.818907 l
227.235976 287.765719 l
227.788903 287.872095 l
228.894759 287.978472 l
230.000614 288.084848 l
230.614978 288.084848 l
233.103152 287.978472 l
233.99398 287.925284 l
236.820055 287.818907 l
237.372983 287.818907 l
238.540274 288.084848 l
241.85784 287.978472 l
243.240159 287.818907 l
243.516623 287.872095 l
243.854523 287.765719 l
245.636179 288.03166 l
246.527007 287.925284 l
247.141371 288.03166 l
249.906009 287.978472 l
250.458937 287.818907 l
254.114403 287.925284 l
254.667331 288.03166 l
258.44567 287.925284 l
259.275061 287.872095 l
262.7155 287.978472 l
263.268428 288.084848 l
264.097819 288.138036 l
265.203675 288.03166 l
266.033066 288.084848 l
266.370966 288.03166 l
266.64743 287.872095 l
270.302896 287.978472 l
270.855824 288.084848 l
271.961679 287.978472 l
272.238143 288.084848 l
272.791071 288.03166 l
273.067535 288.084848 l
275.064218 287.872095 l
275.617145 287.872095 l
279.057584 287.978472 l
280.16344 288.084848 l
283.327414 288.03166 l
283.603878 287.925284 l
285.10907 287.872095 l
285.661998 287.765719 l
287.597245 288.084848 l
288.150172 287.978472 l
288.488073 288.084848 l
288.764536 288.03166 l
289.041 288.138036 l
289.870392 288.084848 l
291.314147 287.978472 l
291.590611 287.872095 l
292.143539 287.872095 l
293.249394 287.765719 l
293.525858 287.872095 l
294.078786 287.818907 l
296.014032 288.084848 l
296.56696 287.925284 l
297.119888 288.084848 l
298.840107 288.03166 l
299.393035 287.925284 l
300.560326 287.818907 l
303.171374 287.925284 l
304.615129 288.138036 l
305.444521 288.084848 l
307.994132 287.978472 l
309.161423 287.765719 l
309.437887 287.872095 l
310.267279 287.818907 l
310.543742 287.818907 l
310.820206 287.978472 l
311.09667 288.829483 l
311.373134 288.935859 l
311.926062 286.329638 l
312.202525 286.116886 l
312.540426 286.542391 l
313.093353 288.244413 l
313.646281 288.669918 l
314.537109 288.244413 l
315.090037 288.03166 l
316.472356 287.925284 l
316.74882 287.872095 l
317.363184 287.925284 l
317.916111 287.872095 l
318.745503 287.925284 l
319.29843 287.021085 l
319.851358 288.191224 l
320.127822 288.457165 l
320.404286 285.053122 l
320.68075 257.927153 l
321.233677 169.315654 l
321.786605 113.521258 l
322.339532 85.118773 l
322.89246 70.545213 l
323.168924 66.715664 l
323.998315 60.864965 l
324.274779 60.545836 l
324.551243 60.013954 l
325.165607 58.311933 l
325.442071 58.790626 l
325.718535 59.748013 l
325.994999 59.428884 l
326.271462 58.631062 l
327.16229 57.354545 l
327.715218 58.68425 l
328.268146 57.460922 l
328.54461 57.620486 l
328.821073 58.152368 l
329.374001 57.726863 l
329.926929 58.471497 l
330.479856 57.939615 l
330.75632 58.311933 l
331.032784 58.471497 l
331.585712 57.833239 l
332.138639 58.524685 l
332.691567 57.780051 l
333.244495 58.631062 l
333.797422 57.939615 l
334.073886 58.365121 l
334.411786 58.631062 l
334.68825 58.045992 l
334.964714 57.992804 l
335.241178 58.471497 l
335.517642 58.524685 l
335.794105 58.09918 l
336.070569 57.992804 l
336.40847 58.471497 l
336.684933 58.365121 l
336.961397 57.886427 l
337.237861 57.939615 l
337.514325 58.524685 l
337.790789 58.418309 l
338.067252 57.886427 l
338.343716 58.045992 l
338.62018 58.471497 l
338.896644 58.258744 l
339.173108 57.886427 l
339.726035 58.524685 l
340.002499 58.311933 l
340.278963 57.833239 l
340.555427 58.09918 l
340.831891 58.631062 l
341.446255 57.939615 l
341.999182 58.631062 l
342.275646 58.045992 l
342.613547 57.939615 l
343.043601 58.524685 l
343.657965 57.992804 l
343.934429 58.471497 l
344.27233 58.524685 l
344.548793 57.992804 l
344.825257 58.045992 l
345.163157 58.577873 l
345.439621 58.365121 l
345.716085 57.939615 l
346.330449 58.577873 l
346.944813 57.939615 l
347.221277 58.418309 l
347.559177 58.365121 l
347.835641 57.886427 l
348.112105 57.992804 l
348.388569 58.471497 l
348.665033 58.418309 l
348.941496 57.939615 l
349.21796 58.152368 l
349.494424 58.68425 l
350.108788 57.939615 l
350.661716 58.577873 l
351.27608 57.886427 l
351.552544 58.311933 l
351.829008 58.471497 l
352.105471 58.045992 l
352.381935 57.886427 l
352.658399 58.418309 l
352.934863 58.524685 l
353.211327 58.045992 l
353.48779 57.939615 l
353.764254 58.418309 l
354.040718 58.471497 l
354.317182 57.992804 l
354.593646 57.886427 l
354.87011 58.418309 l
355.146573 58.418309 l
355.423037 57.939615 l
355.699501 57.992804 l
355.975965 58.471497 l
356.252429 58.471497 l
356.528893 57.992804 l
356.805356 58.045992 l
357.08182 58.524685 l
357.41972 58.524685 l
357.41972 58.524685 l
stroke
grestore
0.800 setlinewidth
0 setlinejoin
[] 0 setdash
0.000 setgray
gsave
72 45 m
72 316.8 l
stroke
grestore
gsave
518.4 45 m
518.4 316.8 l
stroke
grestore
gsave
72 45 m
518.4 45 l
stroke
grestore
gsave
72 316.8 m
518.4 316.8 l
stroke
grestore
1.000 setlinewidth
0 setlinecap
0.800 setgray
gsave
370.775 279.45625 m
511.4 279.45625 l
512.733333 279.45625 513.4 280.122917 513.4 281.45625 c
513.4 309.8 l
513.4 311.133333 512.733333 311.8 511.4 311.8 c
370.775 311.8 l
369.441667 311.8 368.775 311.133333 368.775 309.8 c
368.775 281.45625 l
368.775 280.122917 369.441667 279.45625 370.775 279.45625 c
cl
gsave
1.000 setgray
fill
grestore
stroke
grestore
1 setlinejoin
2 setlinecap
[] 0 setdash
0.122 0.467 0.706 setrgbcolor
gsave
372.775 303.70625 m
392.775 303.70625 l
stroke
grestore
0.000 setgray
gsave
400.775000 300.206250 translate
0.000000 rotate
0.000000 0 m /S glyphshow
6.347656 0 m /p glyphshow
12.695312 0 m /h glyphshow
19.033203 0 m /e glyphshow
25.185547 0 m /r glyphshow
29.046875 0 m /e glyphshow
35.199219 0 m /quotesingle glyphshow
37.948242 0 m /s glyphshow
43.158203 0 m /space glyphshow
46.336914 0 m /a glyphshow
52.464844 0 m /b glyphshow
58.812500 0 m /o glyphshow
64.930664 0 m /u glyphshow
71.268555 0 m /t glyphshow
75.189453 0 m /space glyphshow
78.368164 0 m /Z glyphshow
85.218750 0 m /space glyphshow
88.397461 0 m /a glyphshow
94.525391 0 m /x glyphshow
100.443359 0 m /i glyphshow
103.221680 0 m /s glyphshow
grestore
1.500 setlinewidth
1.000 0.498 0.055 setrgbcolor
gsave
372.775 289.034375 m
392.775 289.034375 l
stroke
grestore
0.000 setgray
gsave
400.775000 285.534375 translate
0.000000 rotate
0.000000 0 m /R glyphshow
6.448242 0 m /e glyphshow
12.600586 0 m /l glyphshow
15.378906 0 m /e glyphshow
21.531250 0 m /a glyphshow
27.659180 0 m /s glyphshow
32.869141 0 m /e glyphshow
39.021484 0 m /space glyphshow
42.200195 0 m /M glyphshow
50.828125 0 m /e glyphshow
56.980469 0 m /c glyphshow
62.478516 0 m /h glyphshow
68.816406 0 m /a glyphshow
74.944336 0 m /n glyphshow
81.282227 0 m /i glyphshow
84.060547 0 m /s glyphshow
89.270508 0 m /m glyphshow
99.011719 0 m /space glyphshow
102.190430 0 m /one glyphshow
grestore

end
showpage
