%!PS-Adobe-3.0 EPSF-3.0
%%Title: pics\gyro_exp_zoom_sphere_1.eps
%%Creator: matplotlib version 3.2.1, http://matplotlib.org/
%%CreationDate: Sat Apr 10 16:53:32 2021
%%Orientation: portrait
%%BoundingBox: -594.0 216.0 1206.0 576.0
%%EndComments
%%BeginProlog
/mpldict 8 dict def
mpldict begin
/m { moveto } bind def
/l { lineto } bind def
/r { rlineto } bind def
/c { curveto } bind def
/cl { closepath } bind def
/box {
m
1 index 0 r
0 exch r
neg 0 r
cl
} bind def
/clipbox {
box
clip
newpath
} bind def
%!PS-Adobe-3.0 Resource-Font
%%Title: DejaVu Sans
%%Copyright: Copyright (c) 2003 by Bitstream, Inc. All Rights Reserved. Copyright (c) 2006 by Tavmjong Bah. All Rights Reserved. DejaVu changes are in public domain 
%%Creator: Converted from TrueType to type 3 by PPR
25 dict begin
/_d{bind def}bind def
/_m{moveto}_d
/_l{lineto}_d
/_cl{closepath eofill}_d
/_c{curveto}_d
/_sc{7 -1 roll{setcachedevice}{pop pop pop pop pop pop}ifelse}_d
/_e{exec}_d
/FontName /DejaVuSans def
/PaintType 0 def
/FontMatrix[.001 0 0 .001 0 0]def
/FontBBox[-1021 -463 1793 1232]def
/FontType 3 def
/Encoding [ /space /period /zero /one /two /three /four /five /six /seven /eight /nine /A /E /H /T /Z /bracketleft /bracketright /a /b /c /e /g /i /l /m /n /o /p /r /s /t /u /v /x /y /z ] def
/FontInfo 10 dict dup begin
/FamilyName (DejaVu Sans) def
/FullName (DejaVu Sans) def
/Notice (Copyright (c) 2003 by Bitstream, Inc. All Rights Reserved. Copyright (c) 2006 by Tavmjong Bah. All Rights Reserved. DejaVu changes are in public domain ) def
/Weight (Book) def
/Version (Version 2.35) def
/ItalicAngle 0.0 def
/isFixedPitch false def
/UnderlinePosition -130 def
/UnderlineThickness 90 def
end readonly def
/CharStrings 39 dict dup begin
/.notdef 0 def
/space{318 0 0 0 0 0 _sc
}_d
/period{318 0 107 0 210 124 _sc
107 124 _m
210 124 _l
210 0 _l
107 0 _l
107 124 _l
_cl}_d
/zero{636 0 66 -13 570 742 _sc
318 664 _m
267 664 229 639 203 589 _c
177 539 165 464 165 364 _c
165 264 177 189 203 139 _c
229 89 267 64 318 64 _c
369 64 407 89 433 139 _c
458 189 471 264 471 364 _c
471 464 458 539 433 589 _c
407 639 369 664 318 664 _c
318 742 _m
399 742 461 709 505 645 _c
548 580 570 486 570 364 _c
570 241 548 147 505 83 _c
461 19 399 -13 318 -13 _c
236 -13 173 19 130 83 _c
87 147 66 241 66 364 _c
66 486 87 580 130 645 _c
173 709 236 742 318 742 _c
_cl}_d
/one{636 0 110 0 544 729 _sc
124 83 _m
285 83 _l
285 639 _l
110 604 _l
110 694 _l
284 729 _l
383 729 _l
383 83 _l
544 83 _l
544 0 _l
124 0 _l
124 83 _l
_cl}_d
/two{{636 0 73 0 536 742 _sc
192 83 _m
536 83 _l
536 0 _l
73 0 _l
73 83 _l
110 121 161 173 226 239 _c
290 304 331 346 348 365 _c
380 400 402 430 414 455 _c
426 479 433 504 433 528 _c
433 566 419 598 392 622 _c
365 646 330 659 286 659 _c
255 659 222 653 188 643 _c
154 632 117 616 78 594 _c
78 694 _l
118 710 155 722 189 730 _c
223 738 255 742 284 742 _c
}_e{359 742 419 723 464 685 _c
509 647 532 597 532 534 _c
532 504 526 475 515 449 _c
504 422 484 390 454 354 _c
446 344 420 317 376 272 _c
332 227 271 164 192 83 _c
_cl}_e}_d
/three{{636 0 76 -13 556 742 _sc
406 393 _m
453 383 490 362 516 330 _c
542 298 556 258 556 212 _c
556 140 531 84 482 45 _c
432 6 362 -13 271 -13 _c
240 -13 208 -10 176 -4 _c
144 1 110 10 76 22 _c
76 117 _l
103 101 133 89 166 81 _c
198 73 232 69 268 69 _c
330 69 377 81 409 105 _c
441 129 458 165 458 212 _c
458 254 443 288 413 312 _c
383 336 341 349 287 349 _c
}_e{202 349 _l
202 430 _l
291 430 _l
339 430 376 439 402 459 _c
428 478 441 506 441 543 _c
441 580 427 609 401 629 _c
374 649 336 659 287 659 _c
260 659 231 656 200 650 _c
169 644 135 635 98 623 _c
98 711 _l
135 721 170 729 203 734 _c
235 739 266 742 296 742 _c
370 742 429 725 473 691 _c
517 657 539 611 539 553 _c
539 513 527 479 504 451 _c
481 423 448 403 406 393 _c
_cl}_e}_d
/four{636 0 49 0 580 729 _sc
378 643 _m
129 254 _l
378 254 _l
378 643 _l
352 729 _m
476 729 _l
476 254 _l
580 254 _l
580 172 _l
476 172 _l
476 0 _l
378 0 _l
378 172 _l
49 172 _l
49 267 _l
352 729 _l
_cl}_d
/five{{636 0 77 -13 549 729 _sc
108 729 _m
495 729 _l
495 646 _l
198 646 _l
198 467 _l
212 472 227 476 241 478 _c
255 480 270 482 284 482 _c
365 482 429 459 477 415 _c
525 370 549 310 549 234 _c
549 155 524 94 475 51 _c
426 8 357 -13 269 -13 _c
238 -13 207 -10 175 -6 _c
143 -1 111 6 77 17 _c
77 116 _l
106 100 136 88 168 80 _c
199 72 232 69 267 69 _c
}_e{323 69 368 83 401 113 _c
433 143 450 183 450 234 _c
450 284 433 324 401 354 _c
368 384 323 399 267 399 _c
241 399 214 396 188 390 _c
162 384 135 375 108 363 _c
108 729 _l
_cl}_e}_d
/six{{636 0 70 -13 573 742 _sc
330 404 _m
286 404 251 388 225 358 _c
199 328 186 286 186 234 _c
186 181 199 139 225 109 _c
251 79 286 64 330 64 _c
374 64 409 79 435 109 _c
461 139 474 181 474 234 _c
474 286 461 328 435 358 _c
409 388 374 404 330 404 _c
526 713 _m
526 623 _l
501 635 476 644 451 650 _c
425 656 400 659 376 659 _c
310 659 260 637 226 593 _c
}_e{192 549 172 482 168 394 _c
187 422 211 444 240 459 _c
269 474 301 482 336 482 _c
409 482 467 459 509 415 _c
551 371 573 310 573 234 _c
573 159 550 99 506 54 _c
462 9 403 -13 330 -13 _c
246 -13 181 19 137 83 _c
92 147 70 241 70 364 _c
70 479 97 571 152 639 _c
206 707 280 742 372 742 _c
396 742 421 739 447 735 _c
472 730 498 723 526 713 _c
_cl}_e}_d
/seven{636 0 82 0 551 729 _sc
82 729 _m
551 729 _l
551 687 _l
286 0 _l
183 0 _l
432 646 _l
82 646 _l
82 729 _l
_cl}_d
/eight{{636 0 68 -13 568 742 _sc
318 346 _m
271 346 234 333 207 308 _c
180 283 167 249 167 205 _c
167 161 180 126 207 101 _c
234 76 271 64 318 64 _c
364 64 401 76 428 102 _c
455 127 469 161 469 205 _c
469 249 455 283 429 308 _c
402 333 365 346 318 346 _c
219 388 _m
177 398 144 418 120 447 _c
96 476 85 511 85 553 _c
85 611 105 657 147 691 _c
188 725 245 742 318 742 _c
}_e{390 742 447 725 489 691 _c
530 657 551 611 551 553 _c
551 511 539 476 515 447 _c
491 418 459 398 417 388 _c
464 377 501 355 528 323 _c
554 291 568 251 568 205 _c
568 134 546 80 503 43 _c
459 5 398 -13 318 -13 _c
237 -13 175 5 132 43 _c
89 80 68 134 68 205 _c
68 251 81 291 108 323 _c
134 355 171 377 219 388 _c
183 544 _m
183 506 194 476 218 455 _c
}_e{242 434 275 424 318 424 _c
360 424 393 434 417 455 _c
441 476 453 506 453 544 _c
453 582 441 611 417 632 _c
393 653 360 664 318 664 _c
275 664 242 653 218 632 _c
194 611 183 582 183 544 _c
_cl}_e}_d
/nine{{636 0 63 -13 566 742 _sc
110 15 _m
110 105 _l
134 93 159 84 185 78 _c
210 72 235 69 260 69 _c
324 69 374 90 408 134 _c
442 178 462 244 468 334 _c
448 306 424 284 396 269 _c
367 254 335 247 300 247 _c
226 247 168 269 126 313 _c
84 357 63 417 63 494 _c
63 568 85 628 129 674 _c
173 719 232 742 306 742 _c
390 742 455 709 499 645 _c
543 580 566 486 566 364 _c
}_e{566 248 538 157 484 89 _c
429 21 356 -13 264 -13 _c
239 -13 214 -10 189 -6 _c
163 -2 137 5 110 15 _c
306 324 _m
350 324 385 339 411 369 _c
437 399 450 441 450 494 _c
450 546 437 588 411 618 _c
385 648 350 664 306 664 _c
262 664 227 648 201 618 _c
175 588 162 546 162 494 _c
162 441 175 399 201 369 _c
227 339 262 324 306 324 _c
_cl}_e}_d
/A{684 0 8 0 676 729 _sc
342 632 _m
208 269 _l
476 269 _l
342 632 _l
286 729 _m
398 729 _l
676 0 _l
573 0 _l
507 187 _l
178 187 _l
112 0 _l
8 0 _l
286 729 _l
_cl}_d
/E{632 0 98 0 568 729 _sc
98 729 _m
559 729 _l
559 646 _l
197 646 _l
197 430 _l
544 430 _l
544 347 _l
197 347 _l
197 83 _l
568 83 _l
568 0 _l
98 0 _l
98 729 _l
_cl}_d
/H{752 0 98 0 654 729 _sc
98 729 _m
197 729 _l
197 430 _l
555 430 _l
555 729 _l
654 729 _l
654 0 _l
555 0 _l
555 347 _l
197 347 _l
197 0 _l
98 0 _l
98 729 _l
_cl}_d
/T{611 0 -2 0 614 729 _sc
-2 729 _m
614 729 _l
614 646 _l
355 646 _l
355 0 _l
256 0 _l
256 646 _l
-2 646 _l
-2 729 _l
_cl}_d
/Z{685 0 45 0 640 729 _sc
56 729 _m
629 729 _l
629 654 _l
168 83 _l
640 83 _l
640 0 _l
45 0 _l
45 75 _l
506 646 _l
56 646 _l
56 729 _l
_cl}_d
/bracketleft{390 0 86 -131 293 760 _sc
86 760 _m
293 760 _l
293 690 _l
176 690 _l
176 -61 _l
293 -61 _l
293 -131 _l
86 -131 _l
86 760 _l
_cl}_d
/bracketright{390 0 97 -131 304 760 _sc
304 760 _m
304 -131 _l
97 -131 _l
97 -61 _l
214 -61 _l
214 690 _l
97 690 _l
97 760 _l
304 760 _l
_cl}_d
/a{{613 0 60 -13 522 560 _sc
343 275 _m
270 275 220 266 192 250 _c
164 233 150 205 150 165 _c
150 133 160 107 181 89 _c
202 70 231 61 267 61 _c
317 61 357 78 387 114 _c
417 149 432 196 432 255 _c
432 275 _l
343 275 _l
522 312 _m
522 0 _l
432 0 _l
432 83 _l
411 49 385 25 355 10 _c
325 -5 287 -13 243 -13 _c
187 -13 142 2 109 33 _c
76 64 60 106 60 159 _c
}_e{60 220 80 266 122 298 _c
163 329 224 345 306 345 _c
432 345 _l
432 354 _l
432 395 418 427 391 450 _c
364 472 326 484 277 484 _c
245 484 215 480 185 472 _c
155 464 127 453 100 439 _c
100 522 _l
132 534 164 544 195 550 _c
226 556 256 560 286 560 _c
365 560 424 539 463 498 _c
502 457 522 395 522 312 _c
_cl}_e}_d
/b{{635 0 91 -13 580 760 _sc
487 273 _m
487 339 473 390 446 428 _c
418 466 381 485 334 485 _c
286 485 249 466 222 428 _c
194 390 181 339 181 273 _c
181 207 194 155 222 117 _c
249 79 286 61 334 61 _c
381 61 418 79 446 117 _c
473 155 487 207 487 273 _c
181 464 _m
199 496 223 520 252 536 _c
281 552 316 560 356 560 _c
422 560 476 533 518 481 _c
559 428 580 359 580 273 _c
}_e{580 187 559 117 518 65 _c
476 13 422 -13 356 -13 _c
316 -13 281 -5 252 10 _c
223 25 199 49 181 82 _c
181 0 _l
91 0 _l
91 760 _l
181 760 _l
181 464 _l
_cl}_e}_d
/c{{550 0 55 -13 488 560 _sc
488 526 _m
488 442 _l
462 456 437 466 411 473 _c
385 480 360 484 334 484 _c
276 484 230 465 198 428 _c
166 391 150 339 150 273 _c
150 206 166 154 198 117 _c
230 80 276 62 334 62 _c
360 62 385 65 411 72 _c
437 79 462 90 488 104 _c
488 21 _l
462 9 436 0 410 -5 _c
383 -10 354 -13 324 -13 _c
242 -13 176 12 128 64 _c
}_e{79 115 55 185 55 273 _c
55 362 79 432 128 483 _c
177 534 244 560 330 560 _c
358 560 385 557 411 551 _c
437 545 463 537 488 526 _c
_cl}_e}_d
/e{{615 0 55 -13 562 560 _sc
562 296 _m
562 252 _l
149 252 _l
153 190 171 142 205 110 _c
238 78 284 62 344 62 _c
378 62 412 66 444 74 _c
476 82 509 95 541 113 _c
541 28 _l
509 14 476 3 442 -3 _c
408 -9 373 -13 339 -13 _c
251 -13 182 12 131 62 _c
80 112 55 181 55 268 _c
55 357 79 428 127 481 _c
175 533 241 560 323 560 _c
397 560 455 536 498 489 _c
}_e{540 441 562 377 562 296 _c
472 322 _m
471 371 457 410 431 440 _c
404 469 368 484 324 484 _c
274 484 234 469 204 441 _c
174 413 156 373 152 322 _c
472 322 _l
_cl}_e}_d
/g{{635 0 55 -207 544 560 _sc
454 280 _m
454 344 440 395 414 431 _c
387 467 349 485 301 485 _c
253 485 215 467 188 431 _c
161 395 148 344 148 280 _c
148 215 161 165 188 129 _c
215 93 253 75 301 75 _c
349 75 387 93 414 129 _c
440 165 454 215 454 280 _c
544 68 _m
544 -24 523 -93 482 -139 _c
440 -184 377 -207 292 -207 _c
260 -207 231 -204 203 -200 _c
175 -195 147 -188 121 -178 _c
}_e{121 -91 _l
147 -105 173 -115 199 -122 _c
225 -129 251 -133 278 -133 _c
336 -133 380 -117 410 -87 _c
439 -56 454 -10 454 52 _c
454 96 _l
435 64 411 40 382 24 _c
353 8 319 0 279 0 _c
211 0 157 25 116 76 _c
75 127 55 195 55 280 _c
55 364 75 432 116 483 _c
157 534 211 560 279 560 _c
319 560 353 552 382 536 _c
411 520 435 496 454 464 _c
454 547 _l
544 547 _l
}_e{544 68 _l
_cl}_e}_d
/i{278 0 94 0 184 760 _sc
94 547 _m
184 547 _l
184 0 _l
94 0 _l
94 547 _l
94 760 _m
184 760 _l
184 646 _l
94 646 _l
94 760 _l
_cl}_d
/l{278 0 94 0 184 760 _sc
94 760 _m
184 760 _l
184 0 _l
94 0 _l
94 760 _l
_cl}_d
/m{{974 0 91 0 889 560 _sc
520 442 _m
542 482 569 511 600 531 _c
631 550 668 560 711 560 _c
767 560 811 540 842 500 _c
873 460 889 403 889 330 _c
889 0 _l
799 0 _l
799 327 _l
799 379 789 418 771 444 _c
752 469 724 482 686 482 _c
639 482 602 466 575 435 _c
548 404 535 362 535 309 _c
535 0 _l
445 0 _l
445 327 _l
445 379 435 418 417 444 _c
398 469 369 482 331 482 _c
}_e{285 482 248 466 221 435 _c
194 404 181 362 181 309 _c
181 0 _l
91 0 _l
91 547 _l
181 547 _l
181 462 _l
201 495 226 520 255 536 _c
283 552 317 560 357 560 _c
397 560 430 550 458 530 _c
486 510 506 480 520 442 _c
_cl}_e}_d
/n{634 0 91 0 549 560 _sc
549 330 _m
549 0 _l
459 0 _l
459 327 _l
459 379 448 417 428 443 _c
408 469 378 482 338 482 _c
289 482 251 466 223 435 _c
195 404 181 362 181 309 _c
181 0 _l
91 0 _l
91 547 _l
181 547 _l
181 462 _l
202 494 227 519 257 535 _c
286 551 320 560 358 560 _c
420 560 468 540 500 501 _c
532 462 549 405 549 330 _c
_cl}_d
/o{612 0 55 -13 557 560 _sc
306 484 _m
258 484 220 465 192 427 _c
164 389 150 338 150 273 _c
150 207 163 156 191 118 _c
219 80 257 62 306 62 _c
354 62 392 80 420 118 _c
448 156 462 207 462 273 _c
462 337 448 389 420 427 _c
392 465 354 484 306 484 _c
306 560 _m
384 560 445 534 490 484 _c
534 433 557 363 557 273 _c
557 183 534 113 490 63 _c
445 12 384 -13 306 -13 _c
227 -13 165 12 121 63 _c
77 113 55 183 55 273 _c
55 363 77 433 121 484 _c
165 534 227 560 306 560 _c
_cl}_d
/p{{635 0 91 -207 580 560 _sc
181 82 _m
181 -207 _l
91 -207 _l
91 547 _l
181 547 _l
181 464 _l
199 496 223 520 252 536 _c
281 552 316 560 356 560 _c
422 560 476 533 518 481 _c
559 428 580 359 580 273 _c
580 187 559 117 518 65 _c
476 13 422 -13 356 -13 _c
316 -13 281 -5 252 10 _c
223 25 199 49 181 82 _c
487 273 _m
487 339 473 390 446 428 _c
418 466 381 485 334 485 _c
}_e{286 485 249 466 222 428 _c
194 390 181 339 181 273 _c
181 207 194 155 222 117 _c
249 79 286 61 334 61 _c
381 61 418 79 446 117 _c
473 155 487 207 487 273 _c
_cl}_e}_d
/r{411 0 91 0 411 560 _sc
411 463 _m
401 469 390 473 378 476 _c
366 478 353 480 339 480 _c
288 480 249 463 222 430 _c
194 397 181 350 181 288 _c
181 0 _l
91 0 _l
91 547 _l
181 547 _l
181 462 _l
199 495 224 520 254 536 _c
284 552 321 560 365 560 _c
371 560 378 559 386 559 _c
393 558 401 557 411 555 _c
411 463 _l
_cl}_d
/s{{521 0 54 -13 472 560 _sc
443 531 _m
443 446 _l
417 458 391 468 364 475 _c
336 481 308 485 279 485 _c
234 485 200 478 178 464 _c
156 450 145 430 145 403 _c
145 382 153 366 169 354 _c
185 342 217 330 265 320 _c
296 313 _l
360 299 405 279 432 255 _c
458 230 472 195 472 151 _c
472 100 452 60 412 31 _c
372 1 316 -13 246 -13 _c
216 -13 186 -10 154 -5 _c
}_e{122 0 89 8 54 20 _c
54 113 _l
87 95 120 82 152 74 _c
184 65 216 61 248 61 _c
290 61 323 68 346 82 _c
368 96 380 117 380 144 _c
380 168 371 187 355 200 _c
339 213 303 226 247 238 _c
216 245 _l
160 257 119 275 95 299 _c
70 323 58 356 58 399 _c
58 450 76 490 112 518 _c
148 546 200 560 268 560 _c
301 560 332 557 362 552 _c
391 547 418 540 443 531 _c
}_e{_cl}_e}_d
/t{392 0 27 0 368 702 _sc
183 702 _m
183 547 _l
368 547 _l
368 477 _l
183 477 _l
183 180 _l
183 135 189 106 201 94 _c
213 81 238 75 276 75 _c
368 75 _l
368 0 _l
276 0 _l
206 0 158 13 132 39 _c
106 65 93 112 93 180 _c
93 477 _l
27 477 _l
27 547 _l
93 547 _l
93 702 _l
183 702 _l
_cl}_d
/u{634 0 85 -13 543 560 _sc
85 216 _m
85 547 _l
175 547 _l
175 219 _l
175 167 185 129 205 103 _c
225 77 255 64 296 64 _c
344 64 383 79 411 110 _c
439 141 453 183 453 237 _c
453 547 _l
543 547 _l
543 0 _l
453 0 _l
453 84 _l
431 50 405 26 377 10 _c
348 -5 315 -13 277 -13 _c
214 -13 166 6 134 45 _c
101 83 85 140 85 216 _c
311 560 _m
311 560 _l
_cl}_d
/v{592 0 30 0 562 547 _sc
30 547 _m
125 547 _l
296 88 _l
467 547 _l
562 547 _l
357 0 _l
235 0 _l
30 547 _l
_cl}_d
/x{592 0 29 0 559 547 _sc
549 547 _m
351 281 _l
559 0 _l
453 0 _l
294 215 _l
135 0 _l
29 0 _l
241 286 _l
47 547 _l
153 547 _l
298 352 _l
443 547 _l
549 547 _l
_cl}_d
/y{592 0 30 -207 562 547 _sc
322 -50 _m
296 -114 271 -157 247 -177 _c
223 -197 191 -207 151 -207 _c
79 -207 _l
79 -132 _l
132 -132 _l
156 -132 175 -126 189 -114 _c
203 -102 218 -75 235 -31 _c
251 9 _l
30 547 _l
125 547 _l
296 119 _l
467 547 _l
562 547 _l
322 -50 _l
_cl}_d
/z{525 0 43 0 482 547 _sc
55 547 _m
482 547 _l
482 465 _l
144 72 _l
482 72 _l
482 0 _l
43 0 _l
43 82 _l
381 475 _l
55 475 _l
55 547 _l
_cl}_d
end readonly def

/BuildGlyph
 {exch begin
 CharStrings exch
 2 copy known not{pop /.notdef}if
 true 3 1 roll get exec
 end}_d

/BuildChar {
 1 index /Encoding get exch get
 1 index /BuildGlyph get exec
}_d

FontName currentdict end definefont pop
end
%%EndProlog
mpldict begin
-594 216 translate
1800 360 0 0 clipbox
gsave
0 0 m
1800 0 l
1800 360 l
0 360 l
cl
1.000 setgray
fill
grestore
gsave
88.905 58.28 m
367.187324 58.28 l
367.187324 321.72 l
88.905 321.72 l
cl
1.000 setgray
fill
grestore
0.800 setlinewidth
1 setlinejoin
0 setlinecap
[] 0 setdash
0.000 setgray
gsave
/o {
gsave
newpath
translate
0.8 setlinewidth
1 setlinejoin
0 setlinecap
0 0 m
0 -3.5 l

gsave
0.000 setgray
fill
grestore
stroke
grestore
} bind def
105.789 58.28 o
grestore
/DejaVuSans findfont
16.000 scalefont
setfont
gsave
85.413834 39.123750 translate
0.000000 rotate
0.000000 0 m /eight glyphshow
10.179688 0 m /zero glyphshow
20.359375 0 m /zero glyphshow
30.539062 0 m /zero glyphshow
grestore
gsave
/o {
gsave
newpath
translate
0.8 setlinewidth
1 setlinejoin
0 setlinecap
0 0 m
0 -3.5 l

gsave
0.000 setgray
fill
grestore
stroke
grestore
} bind def
200.949 58.28 o
grestore
gsave
175.480487 39.123750 translate
0.000000 rotate
0.000000 0 m /one glyphshow
10.179688 0 m /zero glyphshow
20.359375 0 m /zero glyphshow
30.539062 0 m /zero glyphshow
40.718750 0 m /zero glyphshow
grestore
gsave
/o {
gsave
newpath
translate
0.8 setlinewidth
1 setlinejoin
0 setlinecap
0 0 m
0 -3.5 l

gsave
0.000 setgray
fill
grestore
stroke
grestore
} bind def
296.11 58.28 o
grestore
gsave
270.640890 39.123750 translate
0.000000 rotate
0.000000 0 m /one glyphshow
10.179688 0 m /two glyphshow
20.359375 0 m /zero glyphshow
30.539062 0 m /zero glyphshow
40.718750 0 m /zero glyphshow
grestore
gsave
187.694599 19.639375 translate
0.000000 rotate
0.000000 0 m /T glyphshow
9.273438 0 m /i glyphshow
13.718750 0 m /m glyphshow
29.304688 0 m /e glyphshow
39.148438 0 m /space glyphshow
44.234375 0 m /bracketleft glyphshow
50.476562 0 m /m glyphshow
66.062500 0 m /s glyphshow
74.398438 0 m /bracketright glyphshow
grestore
gsave
/o {
gsave
newpath
translate
0.8 setlinewidth
1 setlinejoin
0 setlinecap
0 0 m
-3.5 0 l

gsave
0.000 setgray
fill
grestore
stroke
grestore
} bind def
88.905 75.1055 o
grestore
gsave
36.061250 69.027424 translate
0.000000 rotate
0.000000 0 m /one glyphshow
10.179688 0 m /period glyphshow
15.265625 0 m /five glyphshow
25.445312 0 m /one glyphshow
35.625000 0 m /five glyphshow
grestore
gsave
/o {
gsave
newpath
translate
0.8 setlinewidth
1 setlinejoin
0 setlinecap
0 0 m
-3.5 0 l

gsave
0.000 setgray
fill
grestore
stroke
grestore
} bind def
88.905 119.409 o
grestore
gsave
36.061250 113.330430 translate
0.000000 rotate
0.000000 0 m /one glyphshow
10.179688 0 m /period glyphshow
15.265625 0 m /five glyphshow
25.445312 0 m /two glyphshow
35.625000 0 m /zero glyphshow
grestore
gsave
/o {
gsave
newpath
translate
0.8 setlinewidth
1 setlinejoin
0 setlinecap
0 0 m
-3.5 0 l

gsave
0.000 setgray
fill
grestore
stroke
grestore
} bind def
88.905 163.712 o
grestore
gsave
36.061250 157.633437 translate
0.000000 rotate
0.000000 0 m /one glyphshow
10.179688 0 m /period glyphshow
15.265625 0 m /five glyphshow
25.445312 0 m /two glyphshow
35.625000 0 m /five glyphshow
grestore
gsave
/o {
gsave
newpath
translate
0.8 setlinewidth
1 setlinejoin
0 setlinecap
0 0 m
-3.5 0 l

gsave
0.000 setgray
fill
grestore
stroke
grestore
} bind def
88.905 208.015 o
grestore
gsave
36.061250 201.936443 translate
0.000000 rotate
0.000000 0 m /one glyphshow
10.179688 0 m /period glyphshow
15.265625 0 m /five glyphshow
25.445312 0 m /three glyphshow
35.625000 0 m /zero glyphshow
grestore
gsave
/o {
gsave
newpath
translate
0.8 setlinewidth
1 setlinejoin
0 setlinecap
0 0 m
-3.5 0 l

gsave
0.000 setgray
fill
grestore
stroke
grestore
} bind def
88.905 252.318 o
grestore
gsave
36.061250 246.239450 translate
0.000000 rotate
0.000000 0 m /one glyphshow
10.179688 0 m /period glyphshow
15.265625 0 m /five glyphshow
25.445312 0 m /three glyphshow
35.625000 0 m /five glyphshow
grestore
gsave
/o {
gsave
newpath
translate
0.8 setlinewidth
1 setlinejoin
0 setlinecap
0 0 m
-3.5 0 l

gsave
0.000 setgray
fill
grestore
stroke
grestore
} bind def
88.905 296.621 o
grestore
gsave
36.061250 290.542456 translate
0.000000 rotate
0.000000 0 m /one glyphshow
10.179688 0 m /period glyphshow
15.265625 0 m /five glyphshow
25.445312 0 m /four glyphshow
35.625000 0 m /zero glyphshow
grestore
gsave
28.733125 53.781250 translate
90.000000 rotate
0.000000 0 m /A glyphshow
10.945312 0 m /n glyphshow
21.085938 0 m /g glyphshow
31.242188 0 m /u glyphshow
41.382812 0 m /l glyphshow
45.828125 0 m /a glyphshow
55.632812 0 m /r glyphshow
62.210938 0 m /space glyphshow
67.296875 0 m /v glyphshow
76.765625 0 m /e glyphshow
86.609375 0 m /l glyphshow
91.054688 0 m /o glyphshow
100.843750 0 m /c glyphshow
109.640625 0 m /i glyphshow
114.085938 0 m /t glyphshow
120.359375 0 m /y glyphshow
129.828125 0 m /space glyphshow
134.914062 0 m /bracketleft glyphshow
141.156250 0 m /H glyphshow
153.187500 0 m /z glyphshow
161.585938 0 m /bracketright glyphshow
167.828125 0 m /space glyphshow
172.914062 0 m /a glyphshow
182.718750 0 m /b glyphshow
192.875000 0 m /o glyphshow
202.664062 0 m /u glyphshow
212.804688 0 m /t glyphshow
219.078125 0 m /space glyphshow
224.164062 0 m /Z glyphshow
235.125000 0 m /space glyphshow
240.210938 0 m /a glyphshow
250.015625 0 m /x glyphshow
259.484375 0 m /i glyphshow
263.929688 0 m /s glyphshow
grestore
1.500 setlinewidth
2 setlinecap
0.122 0.467 0.706 setrgbcolor
gsave
278.3 263.4 88.91 58.28 clipbox
101.554197 237.705433 m
102.600961 223.008304 l
103.124343 224.453924 l
103.647725 224.453924 l
104.218688 215.780209 l
104.69449 214.334589 l
105.836415 206.865557 l
106.454957 208.311176 l
107.02592 203.974319 l
107.501722 203.974319 l
107.977524 198.191842 l
108.453326 199.637461 l
108.929128 192.168429 l
109.40493 190.72281 l
109.975892 187.831571 l
110.784756 189.27719 l
111.308138 192.168429 l
111.83152 177.471301 l
112.354902 180.362539 l
112.830704 178.91692 l
113.306506 180.362539 l
115.114554 170.243205 l
115.637936 170.243205 l
116.113738 168.797586 l
116.58954 165.665411 l
117.112922 164.219791 l
117.588724 161.328553 l
118.064526 161.328553 l
118.587909 162.774172 l
119.206451 159.882934 l
119.920154 150.968282 l
120.395956 152.413902 l
120.919338 161.328553 l
121.39514 155.546076 l
122.061263 150.968282 l
122.537065 150.968282 l
123.012867 156.991696 l
123.53625 149.522663 l
124.345113 146.631425 l
124.868495 146.631425 l
125.391877 155.546076 l
125.96284 148.077044 l
126.438642 139.162393 l
126.962024 142.294567 l
127.437826 140.848948 l
127.913628 149.522663 l
128.43701 145.185806 l
129.198294 140.848948 l
129.674096 139.162393 l
130.197478 142.294567 l
130.81602 140.848948 l
131.291822 142.294567 l
131.767624 142.294567 l
132.243426 145.185806 l
132.719228 150.968282 l
133.528092 142.294567 l
134.003894 143.740187 l
134.955498 143.740187 l
135.4313 146.631425 l
135.954682 143.740187 l
136.953866 146.631425 l
137.477249 153.859521 l
138.333692 149.522663 l
138.857074 148.077044 l
139.380457 149.522663 l
139.856259 156.991696 l
140.427221 153.859521 l
140.903023 152.413902 l
141.426405 152.413902 l
141.902207 156.991696 l
142.758651 159.882934 l
143.234453 159.882934 l
143.710255 161.328553 l
144.186057 158.437315 l
144.661859 167.11103 l
145.137661 165.665411 l
145.661043 168.797586 l
146.184425 164.219791 l
146.660227 167.11103 l
147.469091 173.134443 l
147.944893 174.580062 l
148.468275 173.134443 l
148.991657 177.471301 l
149.467459 176.025681 l
149.943261 183.494714 l
150.419063 181.808158 l
150.894865 181.808158 l
151.656149 183.494714 l
152.179531 192.168429 l
152.655333 195.059667 l
153.131135 186.385952 l
153.702097 192.168429 l
154.177899 193.614048 l
154.701281 198.191842 l
155.224664 196.505286 l
155.795626 196.505286 l
156.556909 201.08308 l
157.080291 206.865557 l
157.556093 202.528699 l
158.079476 206.865557 l
158.555278 209.756795 l
159.12624 211.443351 l
159.602042 217.225828 l
160.220585 212.88897 l
160.981868 212.88897 l
161.50525 215.780209 l
162.028632 224.453924 l
162.552015 218.671447 l
163.075397 218.671447 l
164.693124 237.705433 l
165.168926 227.586098 l
165.977789 231.922956 l
166.453591 236.259813 l
166.929393 243.728846 l
167.452775 240.837607 l
168.404379 237.705433 l
169.022922 240.837607 l
169.498724 250.956942 l
170.260007 245.174465 l
170.783389 245.174465 l
171.354352 248.065703 l
171.830154 259.871593 l
172.353536 254.089117 l
172.924499 250.956942 l
173.447881 256.980355 l
174.399485 262.762832 l
175.113188 259.871593 l
175.58899 259.871593 l
176.064792 265.65407 l
176.635754 268.786245 l
177.111556 264.208451 l
177.587358 264.208451 l
178.06316 267.099689 l
178.729283 268.786245 l
179.442986 270.231864 l
180.061529 268.786245 l
180.680071 274.568721 l
181.155873 276.014341 l
181.679256 276.014341 l
182.297798 273.123102 l
182.916341 273.123102 l
183.392143 277.45996 l
184.391327 280.351198 l
184.867129 278.905579 l
185.390511 278.905579 l
185.913893 280.351198 l
186.389696 292.157088 l
187.38888 283.483373 l
187.959842 281.796817 l
188.483224 284.928992 l
189.292088 287.82023 l
189.91063 289.26585 l
190.386432 290.711469 l
190.909815 293.602707 l
191.385617 289.26585 l
192.337221 289.26585 l
192.813023 290.711469 l
193.288825 293.602707 l
194.52591 293.602707 l
195.049292 295.048326 l
195.620255 293.602707 l
196.143637 296.734882 l
196.714599 293.602707 l
197.237981 293.602707 l
197.713783 295.048326 l
198.427486 298.180501 l
198.903288 298.180501 l
199.37909 296.734882 l
199.997633 298.180501 l
200.521015 296.734882 l
200.996817 299.62612 l
201.56778 301.07174 l
202.043582 296.734882 l
202.519384 299.62612 l
203.233087 305.408597 l
204.232271 305.408597 l
205.326616 299.62612 l
205.802418 302.517359 l
206.42096 301.07174 l
206.896762 298.180501 l
207.372564 301.07174 l
208.181428 303.962978 l
208.65723 302.517359 l
209.275772 303.962978 l
209.751574 302.517359 l
210.227376 308.299835 l
210.798339 309.745455 l
211.321721 305.408597 l
211.845103 303.962978 l
212.653967 303.962978 l
213.36767 306.854216 l
213.891052 302.517359 l
214.366854 305.408597 l
214.842656 301.07174 l
215.413618 303.962978 l
215.984581 301.07174 l
216.936185 301.07174 l
217.745048 308.299835 l
218.22085 308.299835 l
218.696652 301.07174 l
219.172454 302.517359 l
220.219219 302.517359 l
220.695021 299.62612 l
221.265983 298.180501 l
222.027266 299.62612 l
222.550649 299.62612 l
223.026451 301.07174 l
223.502253 296.734882 l
224.025635 296.734882 l
224.549017 295.048326 l
225.072399 295.048326 l
225.595781 292.157088 l
226.071583 293.602707 l
226.928027 290.711469 l
227.451409 287.82023 l
227.927211 287.82023 l
229.021556 284.928992 l
229.592518 281.796817 l
230.211061 290.711469 l
230.734443 281.796817 l
231.686047 277.45996 l
232.161849 278.905579 l
232.637651 283.483373 l
233.113453 273.123102 l
233.589255 270.231864 l
234.588439 270.231864 l
235.064241 274.568721 l
235.540043 265.65407 l
236.348907 264.208451 l
236.872289 265.65407 l
237.395671 270.231864 l
237.871473 261.317212 l
238.394856 258.425974 l
238.965818 258.425974 l
239.4892 256.980355 l
239.965002 250.956942 l
240.773866 246.620084 l
241.439988 245.174465 l
241.963371 246.620084 l
242.486753 240.837607 l
243.057715 239.151052 l
243.533517 240.837607 l
244.10448 234.814194 l
244.580282 239.151052 l
245.103664 233.368575 l
245.912527 220.117066 l
246.388329 220.117066 l
246.864131 227.586098 l
247.339933 218.671447 l
247.815735 214.334589 l
248.339118 218.671447 l
248.81492 209.756795 l
249.385882 214.334589 l
250.242326 205.419938 l
251.28909 199.637461 l
251.812472 205.419938 l
252.764076 192.168429 l
253.239878 190.72281 l
253.810841 187.831571 l
254.619704 187.831571 l
255.143086 183.494714 l
256.09469 171.688824 l
256.713233 177.471301 l
257.189035 174.580062 l
257.664837 167.11103 l
258.711602 164.219791 l
259.520465 162.774172 l
259.996267 153.859521 l
260.519649 150.968282 l
261.043031 150.968282 l
261.566414 155.546076 l
262.042216 149.522663 l
262.518018 145.185806 l
262.99382 142.294567 l
263.850263 145.185806 l
264.373645 136.271154 l
264.897028 130.488678 l
265.37283 129.043058 l
265.896212 131.934297 l
266.372014 131.934297 l
266.847816 129.043058 l
267.371198 121.574026 l
268.227642 117.237168 l
268.751024 120.128407 l
269.226826 120.128407 l
269.702628 117.237168 l
270.321171 114.34593 l
270.796973 109.768136 l
271.320355 109.768136 l
272.034058 106.876898 l
272.795341 96.516627 l
273.413884 103.985659 l
274.460648 93.625389 l
275.412252 93.625389 l
275.888054 96.516627 l
276.363856 96.516627 l
277.17272 86.397293 l
277.648522 84.951674 l
278.124324 87.842912 l
278.647706 86.397293 l
279.218668 83.506055 l
279.789631 78.92826 l
280.503334 80.37388 l
281.026716 81.819499 l
281.502518 73.145784 l
282.263801 74.591403 l
282.787183 73.145784 l
283.358146 78.92826 l
284.024269 73.145784 l
284.547651 77.482641 l
285.023453 70.254545 l
285.594415 73.145784 l
286.117798 80.37388 l
286.879081 70.254545 l
287.402463 70.254545 l
288.021006 73.145784 l
288.544388 80.37388 l
289.02019 74.591403 l
289.543572 71.700165 l
290.066954 70.254545 l
290.542756 73.145784 l
291.256459 71.700165 l
291.779841 74.591403 l
292.350804 73.145784 l
292.874186 76.037022 l
293.349988 80.37388 l
293.920951 77.482641 l
294.444333 77.482641 l
294.967715 78.92826 l
295.728998 87.842912 l
296.2048 78.92826 l
296.728182 78.92826 l
297.251565 81.819499 l
297.727367 80.37388 l
298.203169 92.17977 l
298.678971 84.951674 l
299.154773 83.506055 l
299.963636 83.506055 l
300.487018 95.071008 l
301.010401 92.17977 l
301.486203 92.17977 l
302.057165 95.071008 l
303.722472 95.071008 l
304.626496 102.54004 l
305.102298 111.213755 l
305.768421 106.876898 l
306.291803 105.431279 l
306.815185 106.876898 l
307.386148 109.768136 l
307.86195 117.237168 l
308.337752 109.768136 l
309.574837 115.791549 l
310.193379 123.019645 l
310.669181 118.682788 l
311.144983 117.237168 l
311.715946 120.128407 l
312.191748 118.682788 l
312.71513 126.15182 l
313.190932 126.15182 l
314.570758 130.488678 l
315.189301 134.825535 l
315.807843 133.379916 l
316.331225 136.271154 l
316.854608 137.716773 l
317.42557 146.631425 l
318.044113 142.294567 l
318.662655 145.185806 l
319.947321 145.185806 l
320.423123 153.859521 l
320.946505 153.859521 l
321.517467 150.968282 l
321.993269 162.774172 l
322.516652 165.665411 l
323.040034 159.882934 l
323.801317 158.437315 l
324.324699 165.665411 l
324.800501 168.797586 l
325.323883 168.797586 l
325.894846 171.688824 l
326.465808 173.134443 l
326.98919 177.471301 l
327.464992 183.494714 l
328.226276 177.471301 l
328.749658 174.580062 l
329.32062 183.494714 l
329.986743 183.494714 l
330.557706 181.808158 l
331.033508 187.831571 l
331.50931 187.831571 l
332.080272 192.168429 l
332.936716 192.168429 l
333.507678 193.614048 l
333.98348 192.168429 l
334.506862 199.637461 l
335.553627 199.637461 l
336.077009 195.059667 l
336.600391 199.637461 l
337.361674 202.528699 l
337.932637 203.974319 l
338.456019 203.974319 l
339.026981 206.865557 l
339.502783 212.88897 l
339.978585 205.419938 l
340.930189 208.311176 l
341.501152 212.88897 l
342.214855 212.88897 l
342.785817 208.311176 l
343.261619 211.443351 l
343.785002 217.225828 l
344.308384 221.562685 l
344.879346 212.88897 l
345.402728 217.225828 l
345.926111 218.671447 l
346.734974 221.562685 l
347.258356 217.225828 l
348.25754 217.225828 l
348.733342 215.780209 l
349.256725 229.031718 l
349.780107 221.562685 l
350.351069 218.671447 l
351.207513 224.453924 l
352.159117 224.453924 l
352.634919 227.586098 l
353.110721 223.008304 l
353.586523 227.586098 l
354.062325 236.259813 l
354.538127 227.586098 l
354.538127 227.586098 l
stroke
grestore
0.800 setlinewidth
0 setlinejoin
[] 0 setdash
0.000 setgray
gsave
88.905 58.28 m
88.905 321.72 l
stroke
grestore
gsave
367.187324 58.28 m
367.187324 321.72 l
stroke
grestore
gsave
88.905 58.28 m
367.187324 58.28 l
stroke
grestore
gsave
88.905 321.72 m
367.187324 321.72 l
stroke
grestore
/DejaVuSans findfont
19.200 scalefont
setfont
gsave
163.452412 327.720000 translate
0.000000 rotate
0.000000 0 m /E glyphshow
12.123352 0 m /x glyphshow
23.478455 0 m /p glyphshow
35.658020 0 m /e glyphshow
47.462830 0 m /r glyphshow
55.351440 0 m /i glyphshow
60.682343 0 m /m glyphshow
79.373291 0 m /e glyphshow
91.178101 0 m /n glyphshow
103.338928 0 m /t glyphshow
110.862152 0 m /space glyphshow
116.961304 0 m /one glyphshow
grestore
gsave
442.788169 58.28 m
721.070493 58.28 l
721.070493 321.72 l
442.788169 321.72 l
cl
1.000 setgray
fill
grestore
1 setlinejoin
0 setlinecap
[] 0 setdash
gsave
/o {
gsave
newpath
translate
0.8 setlinewidth
1 setlinejoin
0 setlinecap
0 0 m
0 -3.5 l

gsave
0.000 setgray
fill
grestore
stroke
grestore
} bind def
527.822 58.28 o
grestore
/DejaVuSans findfont
16.000 scalefont
setfont
gsave
502.353145 39.123750 translate
0.000000 rotate
0.000000 0 m /one glyphshow
10.179688 0 m /two glyphshow
20.359375 0 m /zero glyphshow
30.539062 0 m /zero glyphshow
40.718750 0 m /zero glyphshow
grestore
gsave
/o {
gsave
newpath
translate
0.8 setlinewidth
1 setlinejoin
0 setlinecap
0 0 m
0 -3.5 l

gsave
0.000 setgray
fill
grestore
stroke
grestore
} bind def
618.303 58.28 o
grestore
gsave
592.833807 39.123750 translate
0.000000 rotate
0.000000 0 m /one glyphshow
10.179688 0 m /three glyphshow
20.359375 0 m /zero glyphshow
30.539062 0 m /zero glyphshow
40.718750 0 m /zero glyphshow
grestore
gsave
/o {
gsave
newpath
translate
0.8 setlinewidth
1 setlinejoin
0 setlinecap
0 0 m
0 -3.5 l

gsave
0.000 setgray
fill
grestore
stroke
grestore
} bind def
708.783 58.28 o
grestore
gsave
683.314469 39.123750 translate
0.000000 rotate
0.000000 0 m /one glyphshow
10.179688 0 m /four glyphshow
20.359375 0 m /zero glyphshow
30.539062 0 m /zero glyphshow
40.718750 0 m /zero glyphshow
grestore
gsave
541.577768 19.639375 translate
0.000000 rotate
0.000000 0 m /T glyphshow
9.273438 0 m /i glyphshow
13.718750 0 m /m glyphshow
29.304688 0 m /e glyphshow
39.148438 0 m /space glyphshow
44.234375 0 m /bracketleft glyphshow
50.476562 0 m /m glyphshow
66.062500 0 m /s glyphshow
74.398438 0 m /bracketright glyphshow
grestore
gsave
/o {
gsave
newpath
translate
0.8 setlinewidth
1 setlinejoin
0 setlinecap
0 0 m
-3.5 0 l

gsave
0.000 setgray
fill
grestore
stroke
grestore
} bind def
442.788 60.7152 o
grestore
gsave
400.131919 54.637035 translate
0.000000 rotate
0.000000 0 m /zero glyphshow
10.179688 0 m /period glyphshow
15.265625 0 m /zero glyphshow
25.445312 0 m /eight glyphshow
grestore
gsave
/o {
gsave
newpath
translate
0.8 setlinewidth
1 setlinejoin
0 setlinecap
0 0 m
-3.5 0 l

gsave
0.000 setgray
fill
grestore
stroke
grestore
} bind def
442.788 96.5323 o
grestore
gsave
400.131919 90.454187 translate
0.000000 rotate
0.000000 0 m /zero glyphshow
10.179688 0 m /period glyphshow
15.265625 0 m /zero glyphshow
25.445312 0 m /nine glyphshow
grestore
gsave
/o {
gsave
newpath
translate
0.8 setlinewidth
1 setlinejoin
0 setlinecap
0 0 m
-3.5 0 l

gsave
0.000 setgray
fill
grestore
stroke
grestore
} bind def
442.788 132.349 o
grestore
gsave
400.131919 126.271339 translate
0.000000 rotate
0.000000 0 m /zero glyphshow
10.179688 0 m /period glyphshow
15.265625 0 m /one glyphshow
25.445312 0 m /zero glyphshow
grestore
gsave
/o {
gsave
newpath
translate
0.8 setlinewidth
1 setlinejoin
0 setlinecap
0 0 m
-3.5 0 l

gsave
0.000 setgray
fill
grestore
stroke
grestore
} bind def
442.788 168.167 o
grestore
gsave
400.131919 162.088491 translate
0.000000 rotate
0.000000 0 m /zero glyphshow
10.179688 0 m /period glyphshow
15.265625 0 m /one glyphshow
25.445312 0 m /one glyphshow
grestore
gsave
/o {
gsave
newpath
translate
0.8 setlinewidth
1 setlinejoin
0 setlinecap
0 0 m
-3.5 0 l

gsave
0.000 setgray
fill
grestore
stroke
grestore
} bind def
442.788 203.984 o
grestore
gsave
400.131919 197.905643 translate
0.000000 rotate
0.000000 0 m /zero glyphshow
10.179688 0 m /period glyphshow
15.265625 0 m /one glyphshow
25.445312 0 m /two glyphshow
grestore
gsave
/o {
gsave
newpath
translate
0.8 setlinewidth
1 setlinejoin
0 setlinecap
0 0 m
-3.5 0 l

gsave
0.000 setgray
fill
grestore
stroke
grestore
} bind def
442.788 239.801 o
grestore
gsave
400.131919 233.722795 translate
0.000000 rotate
0.000000 0 m /zero glyphshow
10.179688 0 m /period glyphshow
15.265625 0 m /one glyphshow
25.445312 0 m /three glyphshow
grestore
gsave
/o {
gsave
newpath
translate
0.8 setlinewidth
1 setlinejoin
0 setlinecap
0 0 m
-3.5 0 l

gsave
0.000 setgray
fill
grestore
stroke
grestore
} bind def
442.788 275.618 o
grestore
gsave
400.131919 269.539947 translate
0.000000 rotate
0.000000 0 m /zero glyphshow
10.179688 0 m /period glyphshow
15.265625 0 m /one glyphshow
25.445312 0 m /four glyphshow
grestore
gsave
/o {
gsave
newpath
translate
0.8 setlinewidth
1 setlinejoin
0 setlinecap
0 0 m
-3.5 0 l

gsave
0.000 setgray
fill
grestore
stroke
grestore
} bind def
442.788 311.435 o
grestore
gsave
400.131919 305.357099 translate
0.000000 rotate
0.000000 0 m /zero glyphshow
10.179688 0 m /period glyphshow
15.265625 0 m /one glyphshow
25.445312 0 m /five glyphshow
grestore
1.500 setlinewidth
2 setlinecap
0.122 0.467 0.706 setrgbcolor
gsave
278.3 263.4 442.8 58.28 clipbox
455.437366 173.686569 m
456.432653 178.361463 l
457.33746 180.796303 l
458.423227 184.302473 l
459.328034 181.380665 l
460.232841 183.718112 l
461.137647 182.549388 l
462.042454 180.211941 l
463.399664 181.965026 l
464.394951 182.549388 l
465.299758 180.796303 l
466.385526 164.726356 l
467.290332 123.723642 l
468.195139 158.200983 l
469.099946 169.498643 l
470.095233 146.903324 l
471.000039 157.616622 l
471.904846 174.270931 l
473.171575 166.479441 l
474.076382 183.718112 l
474.981189 180.211941 l
475.885995 182.549388 l
476.790802 180.796303 l
477.87657 182.549388 l
478.781376 184.302473 l
479.686183 183.718112 l
480.59099 176.024016 l
481.9482 142.715398 l
482.853006 157.03226 l
483.757813 166.479441 l
484.7531 174.270931 l
485.748387 174.270931 l
486.653194 178.361463 l
487.558001 177.192739 l
488.462807 184.302473 l
489.458094 183.13375 l
490.905785 183.718112 l
491.901072 183.718112 l
492.805879 184.302473 l
493.710686 190.925239 l
494.615492 215.273644 l
495.520299 234.849762 l
496.606067 195.600133 l
497.510873 199.203697 l
498.41568 218.779814 l
499.77289 228.324389 l
500.768177 210.501357 l
501.672984 212.254442 l
502.758752 243.225613 l
503.663558 231.343591 l
504.658846 210.501357 l
505.563652 244.394336 l
506.468459 261.048645 l
507.463746 238.453325 l
508.730475 237.284602 l
509.725763 259.879922 l
510.72105 237.284602 l
511.625857 219.46157 l
512.530663 220.630293 l
513.43547 228.324389 l
514.521238 243.809974 l
515.426044 225.986942 l
516.421332 209.332633 l
517.59758 231.343591 l
518.502387 245.56306 l
519.407194 293.675507 l
520.312 309.745455 l
521.307287 215.858006 l
522.393055 231.927953 l
523.388343 276.436837 l
524.293149 217.026729 l
525.378917 217.026729 l
526.645647 280.624762 l
527.550453 251.50407 l
528.54574 229.493112 l
529.450547 224.720825 l
530.355354 221.214655 l
531.26016 230.077474 l
532.164967 242.641251 l
533.160254 224.720825 l
535.241309 268.158379 l
536.146116 265.236571 l
537.050923 244.394336 l
537.955729 233.096676 l
539.765342 253.257156 l
540.85111 243.225613 l
541.755917 253.938911 l
542.660724 247.316145 l
544.379856 281.793486 l
545.284663 259.198166 l
546.27995 230.077474 l
547.275237 235.434123 l
548.180044 257.445081 l
549.084851 256.860719 l
549.989657 259.879922 l
550.894464 243.809974 l
551.889751 216.442368 l
553.246961 281.209124 l
554.151768 283.059603 l
555.056574 236.018485 l
555.961381 221.799017 l
556.866188 248.582262 l
557.770994 226.571304 l
558.856762 217.026729 l
559.761569 231.343591 l
561.29974 232.512315 l
562.295027 228.324389 l
563.199834 230.077474 l
564.195121 259.198166 l
565.190408 266.405294 l
566.095215 233.096676 l
567.000022 219.46157 l
567.904828 268.742741 l
568.990596 244.978698 l
570.257326 231.343591 l
571.433574 246.147421 l
572.338381 249.166624 l
573.333668 209.332633 l
574.419436 203.391623 l
575.324243 213.423165 l
576.229049 215.273644 l
577.133856 234.2654 l
578.038662 234.2654 l
582.019812 230.077474 l
587.448651 199.203697 l
589.439226 184.302473 l
590.344032 186.152952 l
591.248839 203.975984 l
592.244126 218.779814 l
594.14422 198.034974 l
595.049027 205.144708 l
596.315756 187.321675 l
597.311043 194.43141 l
598.306331 181.965026 l
599.211137 182.549388 l
600.296905 181.965026 l
601.201712 181.965026 l
602.106518 178.361463 l
604.006612 179.62758 l
605.363822 180.211941 l
606.35911 179.62758 l
607.263916 192.093963 l
608.168723 224.136463 l
609.073529 192.093963 l
609.978336 196.86625 l
611.154585 210.501357 l
612.059391 194.43141 l
612.964198 191.509601 l
613.869005 187.906037 l
615.135734 178.361463 l
616.04054 174.855292 l
616.945347 173.686569 l
617.940634 174.855292 l
618.845441 173.686569 l
620.655054 172.420452 l
621.559861 171.251728 l
622.555148 172.420452 l
624.002839 217.026729 l
624.907645 225.986942 l
625.902933 189.659122 l
626.807739 181.380665 l
627.712546 198.619335 l
628.617352 168.914281 l
629.522159 171.251728 l
630.517446 167.745558 l
631.422253 167.745558 l
632.598502 168.914281 l
633.77475 167.745558 l
634.679557 162.973271 l
635.584363 130.249015 l
636.760612 129.080291 l
637.755899 152.259973 l
638.660706 145.7346 l
639.565512 142.131036 l
640.65128 123.139281 l
641.91801 153.428696 l
642.913297 133.268217 l
643.818104 117.19827 l
644.72291 118.366993 l
645.718197 137.943111 l
646.803965 123.139281 l
647.708772 96.940397 l
648.613579 112.425982 l
649.518385 130.249015 l
650.785115 130.249015 l
651.689921 109.991142 l
652.594728 128.49593 l
653.590015 130.833376 l
654.675783 111.257259 l
655.58059 124.892366 l
656.485396 151.091249 l
657.390203 130.249015 l
658.656932 114.763429 l
659.561739 114.763429 l
660.557026 140.962313 l
661.461833 115.347791 l
662.45712 112.425982 l
663.361927 125.476727 l
664.266733 113.010344 l
665.17154 119.535717 l
666.438269 150.506888 l
667.614518 102.881408 l
668.700286 136.774387 l
669.605092 152.259973 l
670.509899 140.377951 l
671.414705 133.852579 l
672.409993 128.49593 l
673.40528 124.308004 l
674.310087 142.715398 l
675.214893 152.844334 l
676.662584 113.594706 l
677.56739 107.069333 l
678.653158 164.726356 l
679.557965 137.943111 l
680.462772 78.533003 l
681.367578 82.136567 l
682.272385 172.420452 l
683.267672 163.557632 l
684.624882 111.841621 l
685.620169 161.707154 l
686.615457 158.785345 l
687.520263 114.179068 l
688.42507 128.49593 l
689.329876 157.03226 l
690.415644 124.308004 l
691.320451 151.091249 l
692.225258 164.726356 l
693.491987 70.254545 l
694.396794 126.061089 l
695.3016 206.313431 l
696.206407 200.956782 l
697.111213 153.428696 l
698.196981 158.785345 l
699.192269 173.004813 l
700.097075 158.200983 l
701.001882 137.358749 l
702.540053 150.506888 l
703.716302 126.061089 l
704.621108 127.911568 l
705.525915 158.785345 l
706.521202 144.468483 l
707.51649 136.190026 l
708.421296 149.24077 l
708.421296 149.24077 l
stroke
grestore
0.800 setlinewidth
0 setlinejoin
[] 0 setdash
0.000 setgray
gsave
442.788169 58.28 m
442.788169 321.72 l
stroke
grestore
gsave
721.070493 58.28 m
721.070493 321.72 l
stroke
grestore
gsave
442.788169 58.28 m
721.070493 58.28 l
stroke
grestore
gsave
442.788169 321.72 m
721.070493 321.72 l
stroke
grestore
/DejaVuSans findfont
19.200 scalefont
setfont
gsave
517.335581 327.720000 translate
0.000000 rotate
0.000000 0 m /E glyphshow
12.123352 0 m /x glyphshow
23.478455 0 m /p glyphshow
35.658020 0 m /e glyphshow
47.462830 0 m /r glyphshow
55.351440 0 m /i glyphshow
60.682343 0 m /m glyphshow
79.373291 0 m /e glyphshow
91.178101 0 m /n glyphshow
103.338928 0 m /t glyphshow
110.862152 0 m /space glyphshow
116.961304 0 m /two glyphshow
grestore
gsave
796.671338 58.28 m
1074.953662 58.28 l
1074.953662 321.72 l
796.671338 321.72 l
cl
1.000 setgray
fill
grestore
1 setlinejoin
0 setlinecap
[] 0 setdash
gsave
/o {
gsave
newpath
translate
0.8 setlinewidth
1 setlinejoin
0 setlinecap
0 0 m
0 -3.5 l

gsave
0.000 setgray
fill
grestore
stroke
grestore
} bind def
813.029 58.28 o
grestore
/DejaVuSans findfont
16.000 scalefont
setfont
gsave
792.653573 39.123750 translate
0.000000 rotate
0.000000 0 m /eight glyphshow
10.179688 0 m /zero glyphshow
20.359375 0 m /zero glyphshow
30.539062 0 m /zero glyphshow
grestore
gsave
/o {
gsave
newpath
translate
0.8 setlinewidth
1 setlinejoin
0 setlinecap
0 0 m
0 -3.5 l

gsave
0.000 setgray
fill
grestore
stroke
grestore
} bind def
892.771 58.28 o
grestore
gsave
867.302591 39.123750 translate
0.000000 rotate
0.000000 0 m /one glyphshow
10.179688 0 m /zero glyphshow
20.359375 0 m /zero glyphshow
30.539062 0 m /zero glyphshow
40.718750 0 m /zero glyphshow
grestore
gsave
/o {
gsave
newpath
translate
0.8 setlinewidth
1 setlinejoin
0 setlinecap
0 0 m
0 -3.5 l

gsave
0.000 setgray
fill
grestore
stroke
grestore
} bind def
972.514 58.28 o
grestore
gsave
947.045359 39.123750 translate
0.000000 rotate
0.000000 0 m /one glyphshow
10.179688 0 m /two glyphshow
20.359375 0 m /zero glyphshow
30.539062 0 m /zero glyphshow
40.718750 0 m /zero glyphshow
grestore
gsave
/o {
gsave
newpath
translate
0.8 setlinewidth
1 setlinejoin
0 setlinecap
0 0 m
0 -3.5 l

gsave
0.000 setgray
fill
grestore
stroke
grestore
} bind def
1052.26 58.28 o
grestore
gsave
1026.788127 39.123750 translate
0.000000 rotate
0.000000 0 m /one glyphshow
10.179688 0 m /four glyphshow
20.359375 0 m /zero glyphshow
30.539062 0 m /zero glyphshow
40.718750 0 m /zero glyphshow
grestore
gsave
895.460937 19.639375 translate
0.000000 rotate
0.000000 0 m /T glyphshow
9.273438 0 m /i glyphshow
13.718750 0 m /m glyphshow
29.304688 0 m /e glyphshow
39.148438 0 m /space glyphshow
44.234375 0 m /bracketleft glyphshow
50.476562 0 m /m glyphshow
66.062500 0 m /s glyphshow
74.398438 0 m /bracketright glyphshow
grestore
gsave
/o {
gsave
newpath
translate
0.8 setlinewidth
1 setlinejoin
0 setlinecap
0 0 m
-3.5 0 l

gsave
0.000 setgray
fill
grestore
stroke
grestore
} bind def
796.671 58.28 o
grestore
gsave
754.015088 52.201875 translate
0.000000 rotate
0.000000 0 m /one glyphshow
10.179688 0 m /period glyphshow
15.265625 0 m /five glyphshow
25.445312 0 m /zero glyphshow
grestore
gsave
/o {
gsave
newpath
translate
0.8 setlinewidth
1 setlinejoin
0 setlinecap
0 0 m
-3.5 0 l

gsave
0.000 setgray
fill
grestore
stroke
grestore
} bind def
796.671 110.968 o
grestore
gsave
754.015088 104.889875 translate
0.000000 rotate
0.000000 0 m /one glyphshow
10.179688 0 m /period glyphshow
15.265625 0 m /five glyphshow
25.445312 0 m /two glyphshow
grestore
gsave
/o {
gsave
newpath
translate
0.8 setlinewidth
1 setlinejoin
0 setlinecap
0 0 m
-3.5 0 l

gsave
0.000 setgray
fill
grestore
stroke
grestore
} bind def
796.671 163.656 o
grestore
gsave
754.015088 157.577875 translate
0.000000 rotate
0.000000 0 m /one glyphshow
10.179688 0 m /period glyphshow
15.265625 0 m /five glyphshow
25.445312 0 m /four glyphshow
grestore
gsave
/o {
gsave
newpath
translate
0.8 setlinewidth
1 setlinejoin
0 setlinecap
0 0 m
-3.5 0 l

gsave
0.000 setgray
fill
grestore
stroke
grestore
} bind def
796.671 216.344 o
grestore
gsave
754.015088 210.265875 translate
0.000000 rotate
0.000000 0 m /one glyphshow
10.179688 0 m /period glyphshow
15.265625 0 m /five glyphshow
25.445312 0 m /six glyphshow
grestore
gsave
/o {
gsave
newpath
translate
0.8 setlinewidth
1 setlinejoin
0 setlinecap
0 0 m
-3.5 0 l

gsave
0.000 setgray
fill
grestore
stroke
grestore
} bind def
796.671 269.032 o
grestore
gsave
754.015088 262.953875 translate
0.000000 rotate
0.000000 0 m /one glyphshow
10.179688 0 m /period glyphshow
15.265625 0 m /five glyphshow
25.445312 0 m /eight glyphshow
grestore
gsave
/o {
gsave
newpath
translate
0.8 setlinewidth
1 setlinejoin
0 setlinecap
0 0 m
-3.5 0 l

gsave
0.000 setgray
fill
grestore
stroke
grestore
} bind def
796.671 321.72 o
grestore
gsave
754.015088 315.641875 translate
0.000000 rotate
0.000000 0 m /one glyphshow
10.179688 0 m /period glyphshow
15.265625 0 m /six glyphshow
25.445312 0 m /zero glyphshow
grestore
1.500 setlinewidth
2 setlinecap
0.122 0.467 0.706 setrgbcolor
gsave
278.3 263.4 796.7 58.28 clipbox
809.320535 282.602963 m
809.798991 283.032769 l
810.197705 282.173157 l
810.875519 282.173157 l
811.314104 283.462575 l
811.712818 282.602963 l
812.191274 283.032769 l
812.749474 283.032769 l
813.22793 285.611604 l
813.706387 285.611604 l
814.144972 283.032769 l
814.543686 283.462575 l
815.301242 304.021626 l
815.739828 306.170656 l
816.258156 306.600461 l
816.696741 304.021626 l
817.095455 303.162014 l
817.573911 300.511544 l
818.092239 298.29088 l
818.570696 295.712044 l
818.96941 295.712044 l
819.687095 293.061574 l
820.12568 298.29088 l
820.644008 299.222126 l
821.042722 298.29088 l
821.481307 298.29088 l
821.959763 296.14185 l
822.916677 294.350992 l
824.352046 300.511544 l
824.830503 301.371156 l
825.30896 300.94135 l
825.827288 298.29088 l
826.265873 297.431268 l
826.704458 297.431268 l
827.501886 294.852432 l
828.020214 293.921186 l
828.658156 299.222126 l
829.136613 300.94135 l
829.654941 297.861074 l
830.173269 296.571656 l
831.010568 295.712044 l
831.967481 295.712044 l
832.445937 296.14185 l
832.844651 296.14185 l
833.642079 296.571656 l
834.040793 295.712044 l
834.638863 295.712044 l
835.037577 293.921186 l
835.476163 295.282238 l
835.874876 295.712044 l
836.353333 295.282238 l
836.791918 295.282238 l
837.270375 297.001462 l
837.828574 294.852432 l
838.426645 295.282238 l
839.024716 296.14185 l
839.463301 295.712044 l
839.862015 293.061574 l
840.380343 293.921186 l
840.779057 293.49138 l
841.217642 295.282238 l
841.616356 292.201962 l
842.054941 292.631768 l
842.812497 291.34235 l
843.370697 294.350992 l
843.76941 292.201962 l
844.207996 291.34235 l
844.606709 290.912544 l
845.563623 291.772156 l
846.440793 289.981298 l
847.916034 289.981298 l
848.394491 288.69188 l
848.872948 290.482738 l
849.710247 287.832268 l
850.148832 288.262074 l
850.587417 286.972656 l
851.026002 287.832268 l
851.703816 286.972656 l
852.222144 286.972656 l
852.660729 286.542851 l
853.2588 287.832268 l
853.657514 285.611604 l
854.175842 284.751992 l
854.574555 285.181798 l
855.013141 284.322186 l
855.411854 286.113045 l
855.85044 283.032769 l
856.926967 283.032769 l
857.325681 282.602963 l
857.724395 280.382299 l
858.16298 279.952493 l
858.561694 280.812105 l
858.960408 280.382299 l
859.438864 280.812105 l
859.877449 279.522687 l
860.47552 276.872217 l
860.914105 277.302023 l
861.352691 279.522687 l
862.229861 276.872217 l
862.628575 276.442411 l
863.107032 276.872217 l
863.545617 276.872217 l
863.944331 273.433769 l
864.622144 272.502523 l
865.020858 274.293381 l
865.499315 273.863575 l
865.898028 271.642911 l
866.416356 271.213105 l
866.894813 270.353493 l
867.293527 271.642911 l
867.692241 268.992441 l
868.210569 267.703023 l
868.968125 267.273217 l
869.366839 267.703023 l
870.204138 263.763135 l
870.602852 263.333329 l
871.400279 263.333329 l
872.317321 261.614106 l
872.716035 262.043911 l
873.513463 262.473717 l
873.912177 260.754494 l
874.31089 259.823247 l
874.749476 257.674218 l
875.188061 259.393441 l
875.586775 258.104024 l
875.985489 256.313165 l
876.424074 255.453554 l
876.862659 254.164136 l
877.660087 255.88336 l
878.098672 253.73433 l
878.935971 251.943472 l
879.334685 251.943472 l
879.733399 252.444912 l
880.211855 250.654054 l
880.690312 249.794442 l
881.128897 249.794442 l
881.926325 248.505024 l
882.36491 247.573778 l
882.883238 247.573778 l
883.720537 246.714166 l
884.119251 245.854554 l
884.597707 244.13533 l
885.076164 243.63389 l
885.474878 241.914666 l
886.192563 242.344472 l
886.631148 241.914666 l
887.069733 240.625248 l
887.508318 240.625248 l
888.465232 238.83439 l
888.863946 239.264196 l
889.462016 241.055054 l
889.900602 237.974778 l
890.658158 238.404584 l
891.096743 237.974778 l
891.694814 238.404584 l
892.532113 236.255555 l
893.010569 235.324308 l
893.409283 237.544972 l
893.807997 237.115166 l
894.246582 235.324308 l
895.004139 235.825749 l
895.442724 236.68536 l
895.841438 235.324308 l
896.280023 234.894502 l
896.678737 235.324308 l
897.157193 235.324308 l
897.675521 234.894502 l
898.074235 235.324308 l
899.031148 235.324308 l
899.509605 236.68536 l
900.027933 234.464696 l
900.426647 235.324308 l
900.865232 234.03489 l
901.303817 236.68536 l
901.742403 236.68536 l
902.180988 235.324308 l
902.619573 236.255555 l
903.6961 237.544972 l
904.134686 236.255555 l
904.533399 236.68536 l
904.932113 237.974778 l
905.450441 237.974778 l
906.447226 237.115166 l
907.523753 241.055054 l
907.922467 240.625248 l
908.440795 241.055054 l
908.87938 239.765636 l
909.317965 242.344472 l
909.796422 240.195442 l
910.274879 241.48486 l
910.793207 241.48486 l
911.47102 246.28436 l
912.507676 246.28436 l
912.90639 245.854554 l
913.305104 247.143972 l
913.78356 247.143972 l
914.182274 246.28436 l
914.740474 248.505024 l
915.139187 248.003584 l
915.817001 249.364636 l
916.255586 248.505024 l
916.6543 251.08386 l
918.009927 253.304524 l
918.488384 252.444912 l
918.926969 253.304524 l
919.365554 257.674218 l
919.804139 256.814606 l
920.521824 255.023748 l
921.319252 257.244412 l
921.83758 257.674218 l
922.355908 259.393441 l
922.834365 258.963635 l
923.233078 258.963635 l
923.631792 262.043911 l
924.030506 261.1843 l
924.827934 262.043911 l
925.266519 261.614106 l
925.705104 264.622747 l
926.183561 263.763135 l
926.582275 264.622747 l
927.02086 264.192941 l
927.499316 267.273217 l
927.937902 267.273217 l
928.336616 266.413605 l
929.492886 268.992441 l
930.051085 269.923687 l
930.48967 268.562635 l
930.888384 268.562635 l
931.326969 270.353493 l
931.725683 272.502523 l
932.283883 270.783299 l
932.722468 271.213105 l
933.480024 274.293381 l
933.958481 272.932329 l
934.436937 273.863575 l
934.915394 272.502523 l
935.353979 273.433769 l
935.792564 273.433769 l
936.629863 275.152993 l
937.10832 274.723187 l
937.865876 275.582799 l
938.304461 274.723187 l
938.822789 276.012605 l
939.221503 276.442411 l
939.660089 277.302023 l
940.058802 276.442411 l
940.457516 276.012605 l
941.055587 278.663075 l
941.494172 279.522687 l
942.650442 278.233269 l
943.049156 279.092881 l
943.44787 278.233269 l
943.966198 278.663075 l
944.484526 276.872217 l
944.962983 276.872217 l
945.481311 279.092881 l
945.959767 277.803463 l
946.517967 279.522687 l
947.235651 278.663075 l
947.753979 281.24191 l
948.152693 277.302023 l
948.710893 278.233269 l
949.149478 277.803463 l
949.588063 279.522687 l
950.465234 276.872217 l
950.94369 277.302023 l
951.581632 278.663075 l
951.980346 277.302023 l
952.418931 277.302023 l
952.817645 276.872217 l
953.216359 277.302023 l
953.694816 278.663075 l
954.213144 276.872217 l
954.651729 276.872217 l
955.090314 277.803463 l
955.807999 276.442411 l
956.605427 276.442411 l
957.083883 276.012605 l
957.522469 276.872217 l
957.921182 276.012605 l
958.359768 275.582799 l
958.758481 275.582799 l
959.157195 274.723187 l
959.715395 277.302023 l
960.393208 274.723187 l
961.270379 273.863575 l
961.868449 275.582799 l
962.267163 274.293381 l
962.665877 273.863575 l
963.543047 274.723187 l
964.061375 272.932329 l
964.739189 271.642911 l
965.177774 272.502523 l
965.616359 274.293381 l
966.094816 272.932329 l
966.573273 272.502523 l
967.011858 272.502523 l
967.530186 273.433769 l
967.968771 272.502523 l
968.606713 271.642911 l
969.125041 269.493881 l
969.603498 271.642911 l
970.161697 269.923687 l
970.680025 269.923687 l
971.11861 270.353493 l
971.517324 271.642911 l
971.955909 270.783299 l
972.354623 268.992441 l
972.83308 269.923687 l
973.231794 268.132829 l
973.949479 267.703023 l
974.348192 268.132829 l
974.826649 267.273217 l
975.225363 266.843411 l
975.624077 267.703023 l
976.182276 267.273217 l
976.58099 265.553993 l
977.019575 265.983799 l
977.418289 265.983799 l
978.01636 265.124187 l
978.534688 265.553993 l
978.933402 264.622747 l
979.45173 264.622747 l
979.890315 262.903523 l
980.289029 262.903523 l
981.166199 259.823247 l
981.604784 262.043911 l
982.242726 260.253053 l
982.721183 259.393441 l
983.119897 259.393441 l
983.558482 259.823247 l
983.957196 259.393441 l
984.35591 257.244412 l
984.914109 257.674218 l
985.312823 257.674218 l
985.711537 257.244412 l
986.469093 254.593942 l
986.94755 255.88336 l
987.346264 255.88336 l
987.744977 255.023748 l
988.183563 253.73433 l
988.622148 254.164136 l
989.020862 253.73433 l
989.898032 250.654054 l
990.615717 249.794442 l
991.054302 249.794442 l
991.532759 249.364636 l
991.931473 248.003584 l
992.330187 247.573778 l
992.7289 245.854554 l
993.167486 245.854554 l
993.725685 229.665197 l
994.124399 133.890104 l
994.921827 140.050656 l
995.32054 140.480462 l
995.719254 142.199686 l
996.197711 139.191044 l
996.995139 136.110769 l
997.433724 134.391545 l
998.310894 132.600687 l
998.908965 129.520411 l
999.34755 130.881463 l
999.746264 131.311269 l
1000.144978 130.451657 l
1000.543692 129.090605 l
1000.942406 126.941575 l
1001.460734 129.090605 l
1001.93919 126.511769 l
1002.457518 126.081963 l
1003.09546 123.861299 l
1003.613788 126.081963 l
1004.012502 123.431493 l
1004.80993 120.781023 l
1005.248515 120.351217 l
1005.806714 120.351217 l
1006.285171 118.631993 l
1006.723756 118.631993 l
1007.441441 119.061799 l
1008.039512 119.921411 l
1008.478097 118.202187 l
1008.876811 117.772381 l
1009.355268 116.411329 l
1009.793853 117.342575 l
1010.192567 114.692105 l
1010.631152 114.262299 l
1011.029866 114.692105 l
1011.787422 114.262299 l
1012.345621 113.402688 l
1012.744335 112.471441 l
1013.222792 110.322412 l
1013.621506 111.611829 l
1014.099962 110.322412 l
1014.538547 109.892606 l
1015.056875 110.322412 l
1015.455589 109.892606 l
1016.173274 108.531553 l
1016.611859 109.032994 l
1017.050445 108.101748 l
1017.48903 106.382524 l
1017.927615 108.531553 l
1018.406072 105.952718 l
1018.9244 106.81233 l
1019.402856 105.093106 l
1019.841441 106.382524 l
1020.559126 105.952718 l
1020.95784 107.242136 l
1022.233724 105.952718 l
1022.67231 105.522912 l
1023.150766 105.522912 l
1023.54948 105.952718 l
1024.027937 105.093106 l
1024.785493 104.6633 l
1025.184207 103.732054 l
1025.582921 103.732054 l
1026.101249 105.093106 l
1026.619577 103.732054 l
1027.456876 103.732054 l
1027.85559 106.382524 l
1028.493532 104.16186 l
1028.932117 105.093106 l
1029.410574 105.093106 l
1029.968773 105.952718 l
1030.407358 105.093106 l
1030.845943 105.522912 l
1031.284529 105.093106 l
1031.683242 108.101748 l
1032.121828 106.81233 l
1032.839513 106.81233 l
1033.836297 108.531553 l
1034.394497 106.81233 l
1034.872953 106.382524 l
1035.391281 109.4628 l
1035.829866 110.322412 l
1036.268452 108.531553 l
1036.667165 109.892606 l
1037.305108 109.4628 l
1037.703821 111.182023 l
1038.182278 110.322412 l
1038.740477 111.611829 l
1039.218934 111.611829 l
1039.657519 111.182023 l
1040.056233 112.972882 l
1040.53469 112.471441 l
1040.973275 114.262299 l
1041.371989 113.402688 l
1042.129545 115.981523 l
1043.325687 115.981523 l
1043.764272 117.342575 l
1044.162986 116.841135 l
1044.601571 118.202187 l
1045.000285 119.061799 l
1045.398998 119.491605 l
1046.076812 119.491605 l
1046.555269 119.921411 l
1046.993854 119.921411 l
1047.552053 121.210829 l
1047.950767 123.001687 l
1048.349481 121.210829 l
1048.748195 122.571881 l
1049.226651 121.712269 l
1049.665237 123.431493 l
1050.303179 124.291105 l
1050.821507 125.652157 l
1051.260092 125.150717 l
1051.658806 125.150717 l
1052.05752 127.371381 l
1052.456233 126.941575 l
1053.094176 129.090605 l
1053.492889 127.801187 l
1054.09096 129.090605 l
1054.689031 130.881463 l
1055.167488 131.741075 l
1055.645944 130.881463 l
1056.084529 132.600687 l
1056.562986 131.311269 l
1056.9617 131.311269 l
1057.480028 133.890104 l
1057.878742 135.251157 l
1058.436941 133.030493 l
1059.074883 134.391545 l
1059.55334 136.540574 l
1060.031796 136.97038 l
1060.470382 134.821351 l
1060.98871 135.251157 l
1061.467166 135.251157 l
1061.86588 137.400186 l
1062.304465 136.110769 l
1062.304465 136.110769 l
stroke
grestore
0.800 setlinewidth
0 setlinejoin
[] 0 setdash
0.000 setgray
gsave
796.671338 58.28 m
796.671338 321.72 l
stroke
grestore
gsave
1074.953662 58.28 m
1074.953662 321.72 l
stroke
grestore
gsave
796.671338 58.28 m
1074.953662 58.28 l
stroke
grestore
gsave
796.671338 321.72 m
1074.953662 321.72 l
stroke
grestore
/DejaVuSans findfont
19.200 scalefont
setfont
gsave
871.218750 327.720000 translate
0.000000 rotate
0.000000 0 m /E glyphshow
12.123352 0 m /x glyphshow
23.478455 0 m /p glyphshow
35.658020 0 m /e glyphshow
47.462830 0 m /r glyphshow
55.351440 0 m /i glyphshow
60.682343 0 m /m glyphshow
79.373291 0 m /e glyphshow
91.178101 0 m /n glyphshow
103.338928 0 m /t glyphshow
110.862152 0 m /space glyphshow
116.961304 0 m /three glyphshow
grestore
gsave
1150.554507 58.28 m
1428.836831 58.28 l
1428.836831 321.72 l
1150.554507 321.72 l
cl
1.000 setgray
fill
grestore
1 setlinejoin
0 setlinecap
[] 0 setdash
gsave
/o {
gsave
newpath
translate
0.8 setlinewidth
1 setlinejoin
0 setlinecap
0 0 m
0 -3.5 l

gsave
0.000 setgray
fill
grestore
stroke
grestore
} bind def
1166.63 58.28 o
grestore
/DejaVuSans findfont
16.000 scalefont
setfont
gsave
1146.254156 39.123750 translate
0.000000 rotate
0.000000 0 m /eight glyphshow
10.179688 0 m /zero glyphshow
20.359375 0 m /zero glyphshow
30.539062 0 m /zero glyphshow
grestore
gsave
/o {
gsave
newpath
translate
0.8 setlinewidth
1 setlinejoin
0 setlinecap
0 0 m
0 -3.5 l

gsave
0.000 setgray
fill
grestore
stroke
grestore
} bind def
1237.99 58.28 o
grestore
gsave
1212.523997 39.123750 translate
0.000000 rotate
0.000000 0 m /one glyphshow
10.179688 0 m /zero glyphshow
20.359375 0 m /zero glyphshow
30.539062 0 m /zero glyphshow
40.718750 0 m /zero glyphshow
grestore
gsave
/o {
gsave
newpath
translate
0.8 setlinewidth
1 setlinejoin
0 setlinecap
0 0 m
0 -3.5 l

gsave
0.000 setgray
fill
grestore
stroke
grestore
} bind def
1309.36 58.28 o
grestore
gsave
1283.887588 39.123750 translate
0.000000 rotate
0.000000 0 m /one glyphshow
10.179688 0 m /two glyphshow
20.359375 0 m /zero glyphshow
30.539062 0 m /zero glyphshow
40.718750 0 m /zero glyphshow
grestore
gsave
/o {
gsave
newpath
translate
0.8 setlinewidth
1 setlinejoin
0 setlinecap
0 0 m
0 -3.5 l

gsave
0.000 setgray
fill
grestore
stroke
grestore
} bind def
1380.72 58.28 o
grestore
gsave
1355.251180 39.123750 translate
0.000000 rotate
0.000000 0 m /one glyphshow
10.179688 0 m /four glyphshow
20.359375 0 m /zero glyphshow
30.539062 0 m /zero glyphshow
40.718750 0 m /zero glyphshow
grestore
gsave
1249.344107 19.639375 translate
0.000000 rotate
0.000000 0 m /T glyphshow
9.273438 0 m /i glyphshow
13.718750 0 m /m glyphshow
29.304688 0 m /e glyphshow
39.148438 0 m /space glyphshow
44.234375 0 m /bracketleft glyphshow
50.476562 0 m /m glyphshow
66.062500 0 m /s glyphshow
74.398438 0 m /bracketright glyphshow
grestore
gsave
/o {
gsave
newpath
translate
0.8 setlinewidth
1 setlinejoin
0 setlinecap
0 0 m
-3.5 0 l

gsave
0.000 setgray
fill
grestore
stroke
grestore
} bind def
1150.55 82.9048 o
grestore
gsave
1097.710757 76.826653 translate
0.000000 rotate
0.000000 0 m /two glyphshow
10.179688 0 m /period glyphshow
15.265625 0 m /zero glyphshow
25.445312 0 m /nine glyphshow
35.625000 0 m /zero glyphshow
grestore
gsave
/o {
gsave
newpath
translate
0.8 setlinewidth
1 setlinejoin
0 setlinecap
0 0 m
-3.5 0 l

gsave
0.000 setgray
fill
grestore
stroke
grestore
} bind def
1150.55 125.868 o
grestore
gsave
1097.710757 119.789764 translate
0.000000 rotate
0.000000 0 m /two glyphshow
10.179688 0 m /period glyphshow
15.265625 0 m /zero glyphshow
25.445312 0 m /nine glyphshow
35.625000 0 m /five glyphshow
grestore
gsave
/o {
gsave
newpath
translate
0.8 setlinewidth
1 setlinejoin
0 setlinecap
0 0 m
-3.5 0 l

gsave
0.000 setgray
fill
grestore
stroke
grestore
} bind def
1150.55 168.831 o
grestore
gsave
1097.710757 162.752874 translate
0.000000 rotate
0.000000 0 m /two glyphshow
10.179688 0 m /period glyphshow
15.265625 0 m /one glyphshow
25.445312 0 m /zero glyphshow
35.625000 0 m /zero glyphshow
grestore
gsave
/o {
gsave
newpath
translate
0.8 setlinewidth
1 setlinejoin
0 setlinecap
0 0 m
-3.5 0 l

gsave
0.000 setgray
fill
grestore
stroke
grestore
} bind def
1150.55 211.794 o
grestore
gsave
1097.710757 205.715985 translate
0.000000 rotate
0.000000 0 m /two glyphshow
10.179688 0 m /period glyphshow
15.265625 0 m /one glyphshow
25.445312 0 m /zero glyphshow
35.625000 0 m /five glyphshow
grestore
gsave
/o {
gsave
newpath
translate
0.8 setlinewidth
1 setlinejoin
0 setlinecap
0 0 m
-3.5 0 l

gsave
0.000 setgray
fill
grestore
stroke
grestore
} bind def
1150.55 254.757 o
grestore
gsave
1097.710757 248.679096 translate
0.000000 rotate
0.000000 0 m /two glyphshow
10.179688 0 m /period glyphshow
15.265625 0 m /one glyphshow
25.445312 0 m /one glyphshow
35.625000 0 m /zero glyphshow
grestore
gsave
/o {
gsave
newpath
translate
0.8 setlinewidth
1 setlinejoin
0 setlinecap
0 0 m
-3.5 0 l

gsave
0.000 setgray
fill
grestore
stroke
grestore
} bind def
1150.55 297.72 o
grestore
gsave
1097.710757 291.642206 translate
0.000000 rotate
0.000000 0 m /two glyphshow
10.179688 0 m /period glyphshow
15.265625 0 m /one glyphshow
25.445312 0 m /one glyphshow
35.625000 0 m /five glyphshow
grestore
1.500 setlinewidth
2 setlinecap
0.122 0.467 0.706 setrgbcolor
gsave
278.3 263.4 1151 58.28 clipbox
1163.203704 304.137863 m
1163.596204 301.100417 l
1164.024385 302.735965 l
1164.416885 302.735965 l
1164.773703 309.745455 l
1165.166203 298.296621 l
1165.558702 299.698519 l
1165.91552 298.296621 l
1166.486429 301.100417 l
1166.843247 304.137863 l
1167.200065 298.296621 l
1167.556883 299.698519 l
1167.985064 294.090927 l
1168.448928 304.137863 l
1169.269609 294.090927 l
1169.983245 302.735965 l
1171.053699 291.287131 l
1171.410517 295.492825 l
1171.803017 292.689029 l
1172.159835 298.296621 l
1172.516653 289.885233 l
1172.909152 289.885233 l
1173.26597 292.689029 l
1173.622788 299.698519 l
1174.229379 291.287131 l
1174.586197 295.492825 l
1174.978696 295.492825 l
1175.406878 289.885233 l
1175.763696 295.492825 l
1176.156196 291.287131 l
1176.869832 288.249685 l
1177.262331 289.885233 l
1177.940285 285.445889 l
1178.332785 286.847787 l
1178.725285 284.043991 l
1179.189148 282.642093 l
1179.545966 295.492825 l
1179.938466 286.847787 l
1180.295284 285.445889 l
1180.687784 288.249685 l
1181.044602 286.847787 l
1181.40142 284.043991 l
1182.507555 284.043991 l
1182.864373 288.249685 l
1183.221191 278.436399 l
1183.578009 277.034501 l
1183.970509 278.436399 l
1184.363009 281.240195 l
1184.719827 279.838297 l
1185.18369 277.034501 l
1185.754599 279.838297 l
1186.147098 277.034501 l
1186.503916 281.240195 l
1186.860734 277.034501 l
1187.217552 278.436399 l
1187.610052 275.632603 l
1187.96687 273.997055 l
1188.323688 275.632603 l
1188.787551 278.436399 l
1190.072096 268.389463 l
1190.464596 282.642093 l
1190.964141 271.193259 l
1191.320959 271.193259 l
1192.105958 281.240195 l
1192.462776 278.436399 l
1192.855276 273.997055 l
1193.354821 264.183769 l
1193.711639 268.389463 l
1194.068457 271.193259 l
1194.53232 271.193259 l
1194.889138 266.987565 l
1195.245956 266.987565 l
1195.602774 278.436399 l
1196.030956 269.791361 l
1196.387774 269.791361 l
1197.030046 262.781871 l
1197.386864 275.632603 l
1197.743682 269.791361 l
1198.1005 266.987565 l
1198.457318 265.585667 l
1198.814136 266.987565 l
1199.170954 261.379973 l
1199.527772 265.585667 l
1199.88459 262.781871 l
1200.312771 264.183769 l
1200.847998 262.781871 l
1201.204816 268.389463 l
1201.597316 265.585667 l
1202.025497 258.342528 l
1202.417997 256.94063 l
1203.167315 262.781871 l
1203.952314 256.94063 l
1204.558905 258.342528 l
1204.915723 264.183769 l
1205.272541 259.744426 l
1206.021859 254.136834 l
1206.771176 265.585667 l
1207.127994 255.538732 l
1207.520494 256.94063 l
1208.091403 255.538732 l
1208.483902 258.342528 l
1208.876402 255.538732 l
1209.268902 254.136834 l
1209.661402 255.538732 l
1210.053901 255.538732 l
1210.482083 259.744426 l
1210.838901 254.136834 l
1212.0164 258.342528 l
1212.373218 261.379973 l
1212.730036 258.342528 l
1213.086854 252.734936 l
1213.550717 252.734936 l
1213.943217 259.744426 l
1214.300035 252.734936 l
1214.728217 252.734936 l
1215.120716 251.333038 l
1215.477534 256.94063 l
1216.119807 246.893694 l
1216.512306 245.491796 l
1216.904806 249.93114 l
1217.725487 252.734936 l
1218.117987 242.688 l
1218.510487 246.893694 l
1218.97435 246.893694 l
1219.331168 249.93114 l
1219.902077 251.333038 l
1220.258895 245.491796 l
1221.008213 252.734936 l
1221.365031 258.342528 l
1221.721849 251.333038 l
1222.114348 246.893694 l
1222.54253 246.893694 l
1222.899348 245.491796 l
1223.434575 246.893694 l
1224.183892 244.089898 l
1224.54071 239.884204 l
1224.968892 249.93114 l
1225.361392 245.491796 l
1225.71821 246.893694 l
1226.146391 239.884204 l
1226.610255 242.688 l
1227.430936 237.080408 l
1227.823436 241.286102 l
1228.180254 237.080408 l
1228.644117 242.688 l
1229.50048 232.641064 l
1229.89298 237.080408 l
1230.28548 248.529242 l
1231.391615 232.641064 l
1232.140933 249.93114 l
1232.569114 241.286102 l
1232.961614 235.67851 l
1233.354114 239.884204 l
1233.782295 241.286102 l
1234.139113 246.893694 l
1234.531613 237.080408 l
1235.102522 231.239166 l
1235.637749 238.482306 l
1236.422748 238.482306 l
1236.815248 234.276612 l
1237.207748 234.276612 l
1237.564566 244.089898 l
1237.957066 235.67851 l
1238.313884 235.67851 l
1238.920474 234.276612 l
1239.277292 232.641064 l
1239.705474 232.641064 l
1240.062291 234.276612 l
1240.454791 232.641064 l
1240.811609 227.033472 l
1241.239791 239.884204 l
1241.989108 232.641064 l
1242.560017 229.837268 l
1242.916835 241.286102 l
1243.273653 241.286102 l
1243.987289 228.43537 l
1244.379789 228.43537 l
1244.80797 238.482306 l
1245.164788 234.276612 l
1245.557288 227.033472 l
1246.056833 227.033472 l
1246.413651 228.43537 l
1246.806151 237.080408 l
1247.162969 224.229676 l
1248.019332 228.43537 l
1248.447513 229.837268 l
1248.804331 227.033472 l
1249.196831 221.42588 l
1249.589331 220.023982 l
1250.195921 227.033472 l
1250.659785 224.229676 l
1251.052285 220.023982 l
1251.480466 221.42588 l
1251.837284 215.584639 l
1252.194102 221.42588 l
1252.586602 218.388435 l
1253.050465 216.986537 l
1253.407283 216.986537 l
1253.978192 225.631574 l
1254.33501 221.42588 l
1254.691828 215.584639 l
1255.155691 214.182741 l
1255.583873 215.584639 l
1256.047736 221.42588 l
1256.440236 214.182741 l
1257.189553 214.182741 l
1257.831826 222.827778 l
1258.224325 214.182741 l
1258.616825 212.780843 l
1259.080689 212.780843 l
1259.437506 211.378945 l
1259.794324 214.182741 l
1260.151142 211.378945 l
1260.650688 215.584639 l
1261.043187 215.584639 l
1261.721141 214.182741 l
1262.077959 211.378945 l
1262.470459 214.182741 l
1262.827277 215.584639 l
1263.29114 220.023982 l
1264.004776 205.537703 l
1264.397276 208.575149 l
1264.789776 212.780843 l
1265.289321 208.575149 l
1265.753184 211.378945 l
1266.110002 207.173251 l
1266.46682 212.780843 l
1266.895002 214.182741 l
1267.287502 205.537703 l
1267.644319 202.733907 l
1268.036819 202.733907 l
1268.465001 209.977047 l
1269.071591 204.135805 l
1269.464091 207.173251 l
1269.927954 204.135805 l
1270.284772 202.733907 l
1270.64159 212.780843 l
1271.03409 199.930111 l
1271.783408 202.733907 l
1272.140226 202.733907 l
1272.711134 198.528213 l
1273.067952 198.528213 l
1273.460452 205.537703 l
1273.852952 204.135805 l
1274.20977 209.977047 l
1274.566588 201.332009 l
1274.923406 199.930111 l
1275.351587 201.332009 l
1275.708405 201.332009 l
1276.065223 212.780843 l
1276.671814 194.322519 l
1277.028632 192.920621 l
1277.421131 192.920621 l
1277.777949 204.135805 l
1278.134767 195.724417 l
1278.491585 195.724417 l
1278.884085 194.322519 l
1279.276585 194.322519 l
1279.633403 205.537703 l
1280.204311 194.322519 l
1280.917947 191.285073 l
1281.310447 201.332009 l
1281.702947 192.920621 l
1282.059765 191.285073 l
1282.416583 188.481277 l
1282.880446 189.883175 l
1283.272946 198.528213 l
1283.843855 191.285073 l
1284.200673 188.481277 l
1284.557491 187.079379 l
1284.985672 197.126315 l
1285.34249 185.677481 l
1285.699308 182.873685 l
1286.056126 181.471787 l
1286.484308 184.275583 l
1286.876807 195.724417 l
1287.412034 182.873685 l
1287.768852 178.667991 l
1288.12567 182.873685 l
1288.482488 194.322519 l
1289.196124 182.873685 l
1289.552942 184.275583 l
1290.266578 189.883175 l
1291.265668 177.032443 l
1292.086349 182.873685 l
1292.443167 182.873685 l
1292.799985 181.471787 l
1293.513621 175.630545 l
1293.870439 178.667991 l
1294.405666 180.069889 l
1294.798166 181.471787 l
1295.583165 175.630545 l
1295.939983 182.873685 l
1296.653619 174.228647 l
1297.046119 178.667991 l
1297.402937 178.667991 l
1297.973846 187.079379 l
1298.366345 174.228647 l
1298.723163 177.032443 l
1299.079981 175.630545 l
1299.900663 181.471787 l
1300.293162 175.630545 l
1300.64998 177.032443 l
1301.006798 171.424851 l
1301.542025 178.667991 l
1301.898843 174.228647 l
1302.291343 175.630545 l
1302.683843 174.228647 l
1303.076342 175.630545 l
1303.43316 175.630545 l
1303.789978 170.022953 l
1304.182478 168.621055 l
1304.574978 165.817259 l
1305.145887 177.032443 l
1305.538386 171.424851 l
1305.895204 170.022953 l
1306.252022 165.817259 l
1306.680204 175.630545 l
1307.037022 177.032443 l
1307.39384 168.621055 l
1308.143157 165.817259 l
1308.78543 175.630545 l
1309.142248 168.621055 l
1309.499066 167.219157 l
1310.248383 167.219157 l
1310.605201 175.630545 l
1310.997701 168.621055 l
1311.354519 165.817259 l
1311.818382 167.219157 l
1312.317927 170.022953 l
1312.710427 167.219157 l
1313.424063 164.181712 l
1313.780881 170.022953 l
1314.173381 174.228647 l
1314.530199 167.219157 l
1314.887017 167.219157 l
1315.243835 165.817259 l
1315.814743 167.219157 l
1316.171561 168.621055 l
1316.528379 161.377916 l
1316.992243 161.377916 l
1317.384742 157.172222 l
1317.777242 174.228647 l
1318.13406 162.779814 l
1318.490878 158.57412 l
1318.883378 159.976018 l
1319.454287 168.621055 l
1319.811105 167.219157 l
1320.239286 161.377916 l
1320.596104 161.377916 l
1320.952922 158.57412 l
1321.30974 164.181712 l
1321.809285 161.377916 l
1322.166103 161.377916 l
1322.558603 158.57412 l
1323.200875 165.817259 l
1323.629057 159.976018 l
1324.021556 161.377916 l
1324.48542 158.57412 l
1325.199056 161.377916 l
1325.627237 155.770324 l
1326.340873 152.966528 l
1326.911782 167.219157 l
1327.2686 155.770324 l
1328.017918 149.929082 l
1328.410417 148.527184 l
1328.767235 159.976018 l
1329.124053 152.966528 l
1329.552235 151.56463 l
1330.265871 148.527184 l
1330.801098 155.770324 l
1331.157916 149.929082 l
1331.871551 152.966528 l
1332.335415 157.172222 l
1332.763596 157.172222 l
1333.22746 148.527184 l
1333.619959 144.32149 l
1334.012459 155.770324 l
1334.547686 152.966528 l
1334.904504 149.929082 l
1335.261322 148.527184 l
1335.61814 149.929082 l
1335.974958 155.770324 l
1336.367458 152.966528 l
1336.724276 147.125286 l
1337.152457 149.929082 l
1337.509275 148.527184 l
1338.080184 154.368426 l
1338.437002 142.919592 l
1339.18632 148.527184 l
1339.578819 152.966528 l
1339.935637 151.56463 l
1340.292455 144.32149 l
1340.756319 142.919592 l
1341.113137 144.32149 l
1341.612682 151.56463 l
1341.9695 140.115796 l
1342.326318 144.32149 l
1342.718817 141.517694 l
1343.111317 148.527184 l
1343.468135 147.125286 l
1343.824953 141.517694 l
1344.181771 142.919592 l
1344.538589 141.517694 l
1345.180861 144.32149 l
1345.573361 137.312 l
1345.965861 140.115796 l
1346.322679 137.312 l
1346.679497 145.723388 l
1347.071996 147.125286 l
1347.464496 137.312 l
1347.821314 135.676452 l
1348.178132 137.312 l
1348.570632 145.723388 l
1349.141541 137.312 l
1349.498358 137.312 l
1349.890858 140.115796 l
1350.283358 138.713898 l
1350.782903 138.713898 l
1351.139721 134.274554 l
1351.496539 137.312 l
1351.889039 134.274554 l
1352.281539 135.676452 l
1352.852447 127.265064 l
1353.244947 128.666962 l
1354.029947 135.676452 l
1354.422446 140.115796 l
1354.779264 131.470758 l
1355.207446 128.666962 l
1355.564264 130.06886 l
1355.956763 132.872656 l
1356.848808 124.461268 l
1357.205626 125.863166 l
1357.66949 124.461268 l
1358.026308 135.676452 l
1358.418807 125.863166 l
1358.775625 125.863166 l
1359.132443 124.461268 l
1359.489261 124.461268 l
1360.095852 122.825721 l
1360.488351 118.620027 l
1361.273351 121.423823 l
1361.630169 128.666962 l
1361.986987 121.423823 l
1362.415168 118.620027 l
1362.807668 121.423823 l
1363.200168 131.470758 l
1363.806758 118.620027 l
1364.912894 122.825721 l
1365.269712 130.06886 l
1365.662212 120.021925 l
1366.01903 120.021925 l
1366.41153 117.218129 l
1366.875393 127.265064 l
1367.446302 114.414333 l
1367.838801 117.218129 l
1368.195619 115.816231 l
1368.588119 115.816231 l
1368.944937 117.218129 l
1369.373119 115.816231 l
1369.8013 117.218129 l
1370.158118 113.012435 l
1370.621981 122.825721 l
1371.549708 104.367397 l
1372.263344 110.208639 l
1372.655844 111.610537 l
1373.048344 111.610537 l
1373.797661 108.573091 l
1374.225843 114.414333 l
1374.725388 104.367397 l
1375.153569 101.563601 l
1375.510387 101.563601 l
1375.867205 105.769295 l
1376.259705 105.769295 l
1376.652205 101.563601 l
1377.009023 102.965499 l
1377.365841 107.171193 l
1377.722659 108.573091 l
1379.364021 98.759805 l
1381.647656 102.965499 l
1382.396974 100.161703 l
1382.825156 95.956009 l
1383.289019 107.171193 l
1383.645837 104.367397 l
1384.002655 94.320461 l
1384.395155 95.956009 l
1385.001745 101.563601 l
1385.751063 94.320461 l
1386.143563 92.918563 l
1386.571744 94.320461 l
1386.928562 101.563601 l
1387.28538 101.563601 l
1387.642198 88.712869 l
1388.605606 100.161703 l
1388.962424 100.161703 l
1389.319242 91.516665 l
1389.67606 91.516665 l
1390.496742 97.357907 l
1390.889241 104.367397 l
1391.246059 88.712869 l
1391.602877 84.507175 l
1392.637649 92.918563 l
1393.030149 94.320461 l
1393.422649 84.507175 l
1393.85083 85.909073 l
1394.24333 91.516665 l
1394.707193 87.310971 l
1395.064011 85.909073 l
1395.456511 81.469729 l
1396.02742 90.114767 l
1396.384238 85.909073 l
1396.883783 87.310971 l
1397.240601 87.310971 l
1397.597419 88.712869 l
1398.061282 92.918563 l
1398.4181 81.469729 l
1398.774918 83.105277 l
1399.167418 81.469729 l
1399.774008 92.918563 l
1400.166508 85.909073 l
1400.559008 87.310971 l
1400.951508 80.067831 l
1401.308326 81.469729 l
1401.665144 92.918563 l
1402.057643 84.507175 l
1402.450143 80.067831 l
1402.842643 81.469729 l
1403.413552 84.507175 l
1403.77037 77.264035 l
1404.162869 78.665933 l
1404.555369 75.862137 l
1405.019232 77.264035 l
1405.37605 88.712869 l
1405.732868 81.469729 l
1406.196732 75.862137 l
1406.589231 75.862137 l
1407.124458 85.909073 l
1407.481276 74.460239 l
1407.909458 81.469729 l
1408.301958 73.058341 l
1408.694457 77.264035 l
1409.871957 77.264035 l
1410.228775 74.460239 l
1410.799683 75.862137 l
1411.192183 75.862137 l
1412.334 71.656443 l
1412.690818 74.460239 l
1413.119 75.862137 l
1413.475818 73.058341 l
1414.474908 73.058341 l
1415.010135 70.254545 l
1415.402635 70.254545 l
1415.759453 71.656443 l
1416.187634 83.105277 l
1416.187634 83.105277 l
stroke
grestore
0.800 setlinewidth
0 setlinejoin
[] 0 setdash
0.000 setgray
gsave
1150.554507 58.28 m
1150.554507 321.72 l
stroke
grestore
gsave
1428.836831 58.28 m
1428.836831 321.72 l
stroke
grestore
gsave
1150.554507 58.28 m
1428.836831 58.28 l
stroke
grestore
gsave
1150.554507 321.72 m
1428.836831 321.72 l
stroke
grestore
/DejaVuSans findfont
19.200 scalefont
setfont
gsave
1225.101919 327.720000 translate
0.000000 rotate
0.000000 0 m /E glyphshow
12.123352 0 m /x glyphshow
23.478455 0 m /p glyphshow
35.658020 0 m /e glyphshow
47.462830 0 m /r glyphshow
55.351440 0 m /i glyphshow
60.682343 0 m /m glyphshow
79.373291 0 m /e glyphshow
91.178101 0 m /n glyphshow
103.338928 0 m /t glyphshow
110.862152 0 m /space glyphshow
116.961304 0 m /four glyphshow
grestore
gsave
1504.437676 58.28 m
1782.72 58.28 l
1782.72 321.72 l
1504.437676 321.72 l
cl
1.000 setgray
fill
grestore
1 setlinejoin
0 setlinecap
[] 0 setdash
gsave
/o {
gsave
newpath
translate
0.8 setlinewidth
1 setlinejoin
0 setlinecap
0 0 m
0 -3.5 l

gsave
0.000 setgray
fill
grestore
stroke
grestore
} bind def
1521.48 58.28 o
grestore
/DejaVuSans findfont
16.000 scalefont
setfont
gsave
1501.100808 39.123750 translate
0.000000 rotate
0.000000 0 m /eight glyphshow
10.179688 0 m /zero glyphshow
20.359375 0 m /zero glyphshow
30.539062 0 m /zero glyphshow
grestore
gsave
/o {
gsave
newpath
translate
0.8 setlinewidth
1 setlinejoin
0 setlinecap
0 0 m
0 -3.5 l

gsave
0.000 setgray
fill
grestore
stroke
grestore
} bind def
1616.89 58.28 o
grestore
gsave
1591.418685 39.123750 translate
0.000000 rotate
0.000000 0 m /one glyphshow
10.179688 0 m /zero glyphshow
20.359375 0 m /zero glyphshow
30.539062 0 m /zero glyphshow
40.718750 0 m /zero glyphshow
grestore
gsave
/o {
gsave
newpath
translate
0.8 setlinewidth
1 setlinejoin
0 setlinecap
0 0 m
0 -3.5 l

gsave
0.000 setgray
fill
grestore
stroke
grestore
} bind def
1712.3 58.28 o
grestore
gsave
1686.830313 39.123750 translate
0.000000 rotate
0.000000 0 m /one glyphshow
10.179688 0 m /two glyphshow
20.359375 0 m /zero glyphshow
30.539062 0 m /zero glyphshow
40.718750 0 m /zero glyphshow
grestore
gsave
1603.227276 19.639375 translate
0.000000 rotate
0.000000 0 m /T glyphshow
9.273438 0 m /i glyphshow
13.718750 0 m /m glyphshow
29.304688 0 m /e glyphshow
39.148438 0 m /space glyphshow
44.234375 0 m /bracketleft glyphshow
50.476562 0 m /m glyphshow
66.062500 0 m /s glyphshow
74.398438 0 m /bracketright glyphshow
grestore
gsave
/o {
gsave
newpath
translate
0.8 setlinewidth
1 setlinejoin
0 setlinecap
0 0 m
-3.5 0 l

gsave
0.000 setgray
fill
grestore
stroke
grestore
} bind def
1504.44 66.4128 o
grestore
gsave
1451.593926 60.334637 translate
0.000000 rotate
0.000000 0 m /one glyphshow
10.179688 0 m /period glyphshow
15.265625 0 m /three glyphshow
25.445312 0 m /two glyphshow
35.625000 0 m /five glyphshow
grestore
gsave
/o {
gsave
newpath
translate
0.8 setlinewidth
1 setlinejoin
0 setlinecap
0 0 m
-3.5 0 l

gsave
0.000 setgray
fill
grestore
stroke
grestore
} bind def
1504.44 99.6584 o
grestore
gsave
1451.593926 93.580287 translate
0.000000 rotate
0.000000 0 m /one glyphshow
10.179688 0 m /period glyphshow
15.265625 0 m /three glyphshow
25.445312 0 m /five glyphshow
35.625000 0 m /zero glyphshow
grestore
gsave
/o {
gsave
newpath
translate
0.8 setlinewidth
1 setlinejoin
0 setlinecap
0 0 m
-3.5 0 l

gsave
0.000 setgray
fill
grestore
stroke
grestore
} bind def
1504.44 132.904 o
grestore
gsave
1451.593926 126.825937 translate
0.000000 rotate
0.000000 0 m /one glyphshow
10.179688 0 m /period glyphshow
15.265625 0 m /three glyphshow
25.445312 0 m /seven glyphshow
35.625000 0 m /five glyphshow
grestore
gsave
/o {
gsave
newpath
translate
0.8 setlinewidth
1 setlinejoin
0 setlinecap
0 0 m
-3.5 0 l

gsave
0.000 setgray
fill
grestore
stroke
grestore
} bind def
1504.44 166.15 o
grestore
gsave
1451.593926 160.071588 translate
0.000000 rotate
0.000000 0 m /one glyphshow
10.179688 0 m /period glyphshow
15.265625 0 m /four glyphshow
25.445312 0 m /zero glyphshow
35.625000 0 m /zero glyphshow
grestore
gsave
/o {
gsave
newpath
translate
0.8 setlinewidth
1 setlinejoin
0 setlinecap
0 0 m
-3.5 0 l

gsave
0.000 setgray
fill
grestore
stroke
grestore
} bind def
1504.44 199.395 o
grestore
gsave
1451.593926 193.317238 translate
0.000000 rotate
0.000000 0 m /one glyphshow
10.179688 0 m /period glyphshow
15.265625 0 m /four glyphshow
25.445312 0 m /two glyphshow
35.625000 0 m /five glyphshow
grestore
gsave
/o {
gsave
newpath
translate
0.8 setlinewidth
1 setlinejoin
0 setlinecap
0 0 m
-3.5 0 l

gsave
0.000 setgray
fill
grestore
stroke
grestore
} bind def
1504.44 232.641 o
grestore
gsave
1451.593926 226.562888 translate
0.000000 rotate
0.000000 0 m /one glyphshow
10.179688 0 m /period glyphshow
15.265625 0 m /four glyphshow
25.445312 0 m /five glyphshow
35.625000 0 m /zero glyphshow
grestore
gsave
/o {
gsave
newpath
translate
0.8 setlinewidth
1 setlinejoin
0 setlinecap
0 0 m
-3.5 0 l

gsave
0.000 setgray
fill
grestore
stroke
grestore
} bind def
1504.44 265.887 o
grestore
gsave
1451.593926 259.808538 translate
0.000000 rotate
0.000000 0 m /one glyphshow
10.179688 0 m /period glyphshow
15.265625 0 m /four glyphshow
25.445312 0 m /seven glyphshow
35.625000 0 m /five glyphshow
grestore
gsave
/o {
gsave
newpath
translate
0.8 setlinewidth
1 setlinejoin
0 setlinecap
0 0 m
-3.5 0 l

gsave
0.000 setgray
fill
grestore
stroke
grestore
} bind def
1504.44 299.132 o
grestore
gsave
1451.593926 293.054189 translate
0.000000 rotate
0.000000 0 m /one glyphshow
10.179688 0 m /period glyphshow
15.265625 0 m /five glyphshow
25.445312 0 m /zero glyphshow
35.625000 0 m /zero glyphshow
grestore
1.500 setlinewidth
2 setlinecap
0.122 0.467 0.706 setrgbcolor
gsave
278.3 263.4 1504 58.28 clipbox
1517.086873 297.161605 m
1517.611637 295.606704 l
1518.136401 297.378568 l
1518.708871 296.944642 l
1519.233635 297.378568 l
1519.758399 297.161605 l
1520.330868 298.463382 l
1520.807926 298.680345 l
1521.571219 300.018283 l
1522.048278 301.139259 l
1522.525336 301.790147 l
1523.002394 303.091925 l
1523.622569 302.224073 l
1524.099628 300.452209 l
1524.624392 301.573184 l
1525.196861 304.863789 l
1526.437212 303.778974 l
1526.914271 303.778974 l
1527.439035 304.429863 l
1527.963799 303.562011 l
1528.679386 303.345048 l
1529.20415 303.562011 l
1529.872031 302.874962 l
1530.349089 303.778974 l
1531.064676 301.790147 l
1531.541735 300.886135 l
1532.066499 301.790147 l
1532.686674 302.441036 l
1533.163732 301.573184 l
1534.117848 299.150432 l
1534.642612 299.150432 l
1535.215082 300.452209 l
1535.930669 298.897308 l
1536.503139 299.584358 l
1536.980197 299.150432 l
1537.504961 299.80132 l
1538.029725 299.150432 l
1538.506783 298.24642 l
1539.031547 298.029457 l
1539.556311 297.378568 l
1540.128781 297.812494 l
1540.892074 296.474556 l
1541.369132 296.257593 l
1541.84619 295.823667 l
1542.323248 296.257593 l
1542.895718 295.389741 l
1543.372776 294.955815 l
1543.89754 294.051803 l
1544.947068 293.617877 l
1546.235125 292.496902 l
1546.712183 291.846013 l
1547.189241 291.62905 l
1547.6663 292.062976 l
1548.286475 290.761199 l
1548.763533 290.761199 l
1549.240591 290.074149 l
1549.765355 290.291112 l
1550.576354 289.640223 l
1551.053412 289.640223 l
1551.578176 290.074149 l
1552.10294 289.206298 l
1552.627704 289.206298 l
1553.629526 288.085322 l
1554.106584 287.86836 l
1554.583643 287.434434 l
1555.29923 288.338446 l
1555.776288 286.783545 l
1556.873522 286.349619 l
1557.398286 286.349619 l
1558.352402 285.879533 l
1558.924872 285.011681 l
1559.40193 284.577755 l
1560.069811 284.143829 l
1560.689987 283.45678 l
1561.167045 283.45678 l
1561.644103 282.371965 l
1562.121161 283.022854 l
1562.693631 283.239817 l
1563.743159 281.25099 l
1564.554158 281.25099 l
1565.078922 280.166176 l
1565.55598 279.696089 l
1566.080744 279.949213 l
1566.557802 279.262164 l
1567.130272 279.949213 l
1567.60733 279.949213 l
1568.084388 278.177349 l
1568.561446 277.743423 l
1569.324739 277.273337 l
1569.849503 277.4903 l
1570.421973 276.405485 l
1570.899031 276.839411 l
1571.853147 276.839411 l
1572.377911 277.056374 l
1572.854969 275.754596 l
1574.143026 275.754596 l
1574.620084 276.188522 l
1575.097143 275.754596 l
1576.14667 274.416658 l
1577.148493 274.850584 l
1577.625551 273.765769 l
1578.150315 273.982732 l
1578.865902 273.548807 l
1579.438372 274.199695 l
1579.91543 273.982732 l
1580.392488 272.210868 l
1580.869546 273.07872 l
1581.346604 273.295683 l
1581.871368 273.295683 l
1582.396132 273.07872 l
1583.588777 271.343017 l
1584.065836 271.089893 l
1584.590599 272.210868 l
1585.210775 271.089893 l
1585.687833 270.87293 l
1586.641949 271.776943 l
1587.119008 271.993906 l
1587.930006 270.439005 l
1589.02724 270.439005 l
1589.504298 271.089893 l
1589.981356 270.222042 l
1590.50612 270.222042 l
1590.983179 270.005079 l
1591.460237 270.005079 l
1591.937295 270.222042 l
1592.700588 270.439005 l
1593.177646 270.005079 l
1593.70241 270.222042 l
1594.751938 271.089893 l
1595.276702 269.571153 l
1595.896877 269.788116 l
1596.373935 269.571153 l
1596.898699 270.222042 l
1597.518875 269.571153 l
1598.520697 269.101067 l
1599.093167 270.439005 l
1599.570225 270.87293 l
1600.094989 270.005079 l
1601.049105 270.005079 l
1601.526163 269.788116 l
1602.337162 269.571153 l
1603.338984 270.005079 l
1603.816042 269.788116 l
1604.293101 271.343017 l
1604.86557 270.005079 l
1605.342628 270.222042 l
1606.678391 271.089893 l
1607.250861 270.655967 l
1607.823331 271.089893 l
1608.300389 270.222042 l
1608.777447 270.655967 l
1609.254505 271.993906 l
1609.922387 271.343017 l
1611.067326 271.343017 l
1611.782913 272.210868 l
1612.259971 271.55998 l
1612.784735 272.210868 l
1613.309499 271.776943 l
1614.406733 273.295683 l
1614.883791 271.55998 l
1615.408555 272.210868 l
1615.981025 272.210868 l
1616.744318 273.765769 l
1617.269082 272.644794 l
1617.74614 273.07872 l
1618.270904 272.861757 l
1619.368138 274.199695 l
1619.892902 273.548807 l
1620.560783 273.982732 l
1621.27637 273.982732 l
1621.801134 275.28451 l
1622.325898 274.850584 l
1622.898368 274.633621 l
1623.423132 271.343017 l
1623.90019 267.1484 l
1624.377248 264.255561 l
1624.854306 263.170747 l
1625.474482 262.049771 l
1626.667127 263.387709 l
1627.621244 279.479126 l
1628.098302 273.982732 l
1628.623066 264.472524 l
1631.294591 168.683393 l
1631.819355 162.282986 l
1632.391825 193.851092 l
1633.918411 133.60772 l
1634.490881 124.097511 l
1635.06335 118.81808 l
1635.826643 116.395328 l
1636.303702 126.086338 l
1636.971583 70.254545 l
1637.448641 89.021838 l
1637.973405 205.350127 l
1638.498169 283.890706 l
1639.022933 294.485729 l
1639.499991 294.268766 l
1640.167873 307.756628 l
1640.644931 307.286541 l
1641.169695 307.286541 l
1642.266928 300.235246 l
1642.743986 300.669172 l
1643.26875 296.474556 l
1643.793514 297.812494 l
1644.318278 286.783545 l
1645.129277 260.964957 l
1645.606335 253.660538 l
1646.131099 257.638192 l
1646.751275 279.045201 l
1647.228333 306.201727 l
1647.705391 309.745455 l
1648.182449 305.984764 l
1648.659507 305.550838 l
1649.184271 304.2129 l
1649.99527 284.143829 l
1650.472328 282.155003 l
1650.949386 284.143829 l
1651.47415 283.890706 l
1651.951209 282.371965 l
1652.523678 281.93804 l
1653.000736 285.228644 l
1653.477795 284.143829 l
1654.002559 280.166176 l
1654.765852 292.496902 l
1655.290616 292.062976 l
1655.815379 290.761199 l
1656.292438 291.195124 l
1656.769496 285.879533 l
1657.29426 285.011681 l
1658.343788 288.772372 l
1658.820846 291.195124 l
1659.584139 291.846013 l
1660.061197 291.412087 l
1660.585961 292.279939 l
1661.110725 294.485729 l
1662.064841 294.485729 l
1662.541899 292.750025 l
1663.066663 293.617877 l
1663.591427 295.389741 l
1664.259309 295.823667 l
1664.831778 296.474556 l
1665.8336 296.474556 l
1666.310658 296.04063 l
1666.787717 295.823667 l
1667.360186 296.04063 l
1667.88495 295.606704 l
1668.45742 296.257593 l
1669.220713 294.485729 l
1669.745477 294.051803 l
1670.222535 295.172778 l
1670.747299 294.738852 l
1671.319769 295.606704 l
1671.796827 294.485729 l
1672.321591 294.485729 l
1672.798649 294.268766 l
1673.514236 295.172778 l
1673.991295 293.83484 l
1674.516058 293.617877 l
1674.993117 294.955815 l
1675.470175 294.485729 l
1676.424291 292.496902 l
1677.521525 291.412087 l
1678.332524 291.412087 l
1678.809582 291.195124 l
1679.28664 290.544236 l
1679.763698 290.291112 l
1680.240756 289.206298 l
1680.860932 290.291112 l
1681.33799 289.423261 l
1682.387518 289.423261 l
1683.103105 290.978162 l
1683.627869 289.857186 l
1684.200339 289.423261 l
1684.677397 289.206298 l
1685.202161 289.423261 l
1685.726925 290.544236 l
1686.251689 290.761199 l
1686.728747 289.857186 l
1687.49204 290.074149 l
1688.016804 290.074149 l
1688.493862 290.544236 l
1689.54339 289.423261 l
1690.020448 289.640223 l
1690.497506 289.423261 l
1691.59474 288.555409 l
1692.310327 287.651397 l
1692.787385 288.085322 l
1693.312149 289.206298 l
1693.789207 287.434434 l
1694.361677 287.217471 l
1694.838735 286.096496 l
1695.315793 286.566582 l
1695.840557 286.096496 l
1696.60385 285.228644 l
1697.080908 285.228644 l
1697.557967 285.011681 l
1698.08273 285.445607 l
1698.559789 285.445607 l
1699.036847 284.143829 l
1699.513905 283.890706 l
1700.038669 283.890706 l
1700.515727 284.794718 l
1701.27902 283.239817 l
1701.803784 283.239817 l
1702.280842 283.022854 l
1702.805606 283.239817 l
1703.473487 283.022854 l
1703.998251 282.588928 l
1704.47531 281.467953 l
1705.047779 281.467953 l
1705.572543 282.155003 l
1706.28813 280.817064 l
1706.765189 280.600102 l
1707.289953 280.817064 l
1707.767011 280.600102 l
1708.33948 280.817064 l
1708.816539 279.949213 l
1709.341303 279.262164 l
1710.009184 278.611275 l
1710.724771 279.262164 l
1711.297241 277.743423 l
1711.774299 277.960386 l
1712.299063 277.273337 l
1712.871533 277.4903 l
1713.396297 277.4903 l
1713.968766 277.273337 l
1714.49353 276.622448 l
1715.018294 275.754596 l
1715.733882 276.405485 l
1716.21094 275.501473 l
1716.687998 275.28451 l
1717.212762 274.850584 l
1717.68982 274.633621 l
1718.166878 275.28451 l
1718.643936 274.199695 l
1719.1687 273.982732 l
1719.931993 273.295683 l
1720.456757 274.199695 l
1721.506285 272.210868 l
1722.031049 272.427831 l
1722.555813 272.427831 l
1723.032871 272.861757 l
1723.509929 271.776943 l
1723.986987 271.55998 l
1724.75028 271.089893 l
1725.227339 271.089893 l
1725.752102 271.993906 l
1726.229161 270.439005 l
1726.80163 270.439005 l
1727.3741 270.655967 l
1727.898864 270.439005 l
1728.423628 270.005079 l
1729.663979 269.35419 l
1730.188743 270.005079 l
1730.713507 270.439005 l
1731.285977 269.35419 l
1732.240093 268.884104 l
1732.717151 269.101067 l
1733.337327 268.016252 l
1734.10062 268.233215 l
1735.5795 268.233215 l
1736.104264 267.365363 l
1736.629028 267.365363 l
1737.153792 267.1484 l
1737.678556 267.365363 l
1738.632672 266.461351 l
1739.205142 266.895277 l
1739.6822 266.678314 l
1740.159258 267.365363 l
1740.636316 266.461351 l
1741.16108 266.244388 l
1741.638138 266.461351 l
1742.115197 266.027425 l
1742.639961 267.1484 l
1744.023429 266.027425 l
1744.977545 266.027425 l
1745.454604 266.895277 l
1745.979368 265.376536 l
1746.504131 266.027425 l
1746.98119 265.810462 l
1747.983012 264.94261 l
1748.650893 264.689487 l
1749.127951 265.159573 l
1749.605009 265.159573 l
1750.129773 266.461351 l
1750.606831 265.159573 l
1751.08389 265.593499 l
1751.608654 265.376536 l
1752.085712 265.810462 l
1752.944416 265.376536 l
1753.46918 265.810462 l
1753.993944 265.376536 l
1754.518708 265.810462 l
1755.091178 266.461351 l
1755.568236 265.376536 l
1756.093 266.027425 l
1756.713176 265.376536 l
1757.23794 265.376536 l
1757.905821 266.027425 l
1758.430585 265.593499 l
1758.907643 265.376536 l
1759.384701 265.593499 l
1759.861759 266.461351 l
1760.481935 265.810462 l
1760.958993 266.244388 l
1761.483757 265.593499 l
1762.199344 266.244388 l
1762.676402 266.895277 l
1763.248872 265.810462 l
1763.773636 266.244388 l
1764.250694 266.027425 l
1764.727752 266.895277 l
1765.252516 266.461351 l
1765.77728 266.895277 l
1766.969926 266.461351 l
1767.49469 267.799289 l
1768.448806 266.895277 l
1769.021276 267.1484 l
1769.54604 266.678314 l
1770.070803 268.233215 l
1770.070803 268.233215 l
stroke
grestore
0.800 setlinewidth
0 setlinejoin
[] 0 setdash
0.000 setgray
gsave
1504.437676 58.28 m
1504.437676 321.72 l
stroke
grestore
gsave
1782.72 58.28 m
1782.72 321.72 l
stroke
grestore
gsave
1504.437676 58.28 m
1782.72 58.28 l
stroke
grestore
gsave
1504.437676 321.72 m
1782.72 321.72 l
stroke
grestore
/DejaVuSans findfont
19.200 scalefont
setfont
gsave
1578.985088 327.720000 translate
0.000000 rotate
0.000000 0 m /E glyphshow
12.123352 0 m /x glyphshow
23.478455 0 m /p glyphshow
35.658020 0 m /e glyphshow
47.462830 0 m /r glyphshow
55.351440 0 m /i glyphshow
60.682343 0 m /m glyphshow
79.373291 0 m /e glyphshow
91.178101 0 m /n glyphshow
103.338928 0 m /t glyphshow
110.862152 0 m /space glyphshow
116.961304 0 m /five glyphshow
grestore

end
showpage
