1	2024-05-07 08:00:15	L.txt
2	2024-05-07 08:00:30	L.txt
3	2024-05-07 08:00:45	L.txt
4	2024-05-07 08:01:00	L.txt
5	2024-05-07 08:01:15	L.txt
6	2024-05-07 08:01:30	L.txt
7	2024-05-07 08:01:45	L.txt
8	2024-05-07 08:02:00	L.txt
9	2024-05-07 08:02:15	L.txt
10	2024-05-07 08:02:30	L.txt
11	2024-05-07 08:02:45	L.txt
12	2024-05-07 08:03:00	L.txt
13	2024-05-07 08:03:15	L.txt
14	2024-05-07 08:03:30	L.txt
15	2024-05-07 08:03:45	L.txt
16	2024-05-07 08:04:00	L.txt
17	2024-05-07 08:04:15	L.txt
18	2024-05-07 08:04:30	L.txt
19	2024-05-07 08:04:45	L.txt
20	2024-05-07 08:05:00	L.txt
21	2024-05-07 08:05:15	L.txt
22	2024-05-07 08:05:30	L.txt
23	2024-05-07 08:05:45	L.txt
24	2024-05-07 08:06:00	L.txt
25	2024-05-07 08:06:15	L.txt
26	2024-05-07 08:06:30	L.txt
27	2024-05-07 08:06:45	L.txt
28	2024-05-07 08:07:00	L.txt
29	2024-05-07 08:07:15	L.txt
30	2024-05-07 08:07:30	L.txt
31	2024-05-07 08:07:45	L.txt
32	2024-05-07 08:08:00	L.txt
33	2024-05-07 08:08:15	L.txt
34	2024-05-07 08:08:30	L.txt
35	2024-05-07 08:08:45	L.txt
1	2024-05-07 09:00:15	L.txt
2	2024-05-07 09:00:30	L.txt
3	2024-05-07 09:00:45	L.txt
4	2024-05-07 09:01:00	L.txt
5	2024-05-07 09:01:15	L.txt
6	2024-05-07 09:01:30	L.txt
7	2024-05-07 09:01:45	L.txt
8	2024-05-07 09:02:00	L.txt
9	2024-05-07 09:02:15	L.txt
10	2024-05-07 09:02:30	L.txt
11	2024-05-07 09:02:45	L.txt
12	2024-05-07 09:03:00	L.txt
13	2024-05-07 09:03:15	L.txt
14	2024-05-07 09:03:30	L.txt
15	2024-05-07 09:03:45	L.txt
16	2024-05-07 09:04:00	L.txt
17	2024-05-07 09:04:15	L.txt
18	2024-05-07 09:04:30	L.txt
19	2024-05-07 09:04:45	L.txt
20	2024-05-07 09:05:00	L.txt
21	2024-05-07 09:05:15	L.txt
22	2024-05-07 09:05:30	L.txt
23	2024-05-07 09:05:45	L.txt
24	2024-05-07 09:06:00	L.txt
25	2024-05-07 09:06:15	L.txt
26	2024-05-07 09:06:30	L.txt
27	2024-05-07 09:06:45	L.txt
28	2024-05-07 09:07:00	L.txt
29	2024-05-07 09:07:15	L.txt
30	2024-05-07 09:07:30	L.txt
31	2024-05-07 09:07:45	L.txt
32	2024-05-07 09:08:00	L.txt
33	2024-05-07 09:08:15	L.txt
34	2024-05-07 09:08:30	L.txt
35	2024-05-07 09:08:45	L.txt
1	2024-05-07 10:00:15	L.txt
2	2024-05-07 10:00:30	L.txt
3	2024-05-07 10:00:45	L.txt
4	2024-05-07 10:01:00	L.txt
5	2024-05-07 10:01:15	L.txt
1	2024-05-07 11:00:15	L.txt
2	2024-05-07 11:00:30	L.txt
3	2024-05-07 11:00:45	L.txt
4	2024-05-07 11:01:00	L.txt
5	2024-05-07 11:01:15	L.txt
1	2024-05-07 12:00:15	L.txt
2	2024-05-07 12:00:30	L.txt
3	2024-05-07 12:00:45	L.txt
1	2024-05-07 12:05:15	L.txt
2	2024-05-07 12:05:30	L.txt
3	2024-05-07 12:05:45	L.txt
1	2024-05-07 12:10:15	L.txt
2	2024-05-07 12:10:30	L.txt
3	2024-05-07 12:10:45	L.txt
1	2024-05-07 12:15:15	L.txt
2	2024-05-07 12:15:30	L.txt
3	2024-05-07 12:15:45	L.txt
1	2024-05-07 12:20:15	L.txt
2	2024-05-07 12:20:30	L.txt
3	2024-05-07 12:20:45	L.txt
1	2024-05-07 12:25:15	L.txt
2	2024-05-07 12:25:30	L.txt
3	2024-05-07 12:25:45	L.txt
1	2024-05-07 12:30:15	L.txt
2	2024-05-07 12:30:30	L.txt
3	2024-05-07 12:30:45	L.txt
1	2024-05-07 12:35:15	L.txt
2	2024-05-07 12:35:30	L.txt
3	2024-05-07 12:35:45	L.txt
1	2024-05-07 12:40:15	L.txt
2	2024-05-07 12:40:30	L.txt
3	2024-05-07 12:40:45	L.txt
1	2024-05-07 12:45:15	L.txt
2	2024-05-07 12:45:30	L.txt
3	2024-05-07 12:45:45	L.txt
1	2024-05-07 12:50:15	L.txt
2	2024-05-07 12:50:30	L.txt
3	2024-05-07 12:50:45	L.txt
1	2024-05-07 12:55:15	L.txt
2	2024-05-07 12:55:30	L.txt
3	2024-05-07 12:55:45	L.txt
1	2024-05-07 13:00:15	L.txt
2	2024-05-07 13:00:30	L.txt
3	2024-05-07 13:00:45	L.txt
1	2024-05-07 13:05:15	L.txt
2	2024-05-07 13:05:30	L.txt
3	2024-05-07 13:05:45	L.txt
1	2024-05-07 13:10:15	L.txt
2	2024-05-07 13:10:30	L.txt
3	2024-05-07 13:10:45	L.txt
1	2024-05-07 13:15:15	L.txt
2	2024-05-07 13:15:30	L.txt
3	2024-05-07 13:15:45	L.txt
1	2024-05-07 13:20:15	L.txt
2	2024-05-07 13:20:30	L.txt
3	2024-05-07 13:20:45	L.txt
1	2024-05-07 13:25:15	L.txt
2	2024-05-07 13:25:30	L.txt
3	2024-05-07 13:25:45	L.txt
1	2024-05-07 13:30:15	L.txt
2	2024-05-07 13:30:30	L.txt
3	2024-05-07 13:30:45	L.txt
1	2024-05-07 13:35:15	L.txt
2	2024-05-07 13:35:30	L.txt
3	2024-05-07 13:35:45	L.txt
1	2024-05-07 13:40:15	L.txt
2	2024-05-07 13:40:30	L.txt
3	2024-05-07 13:40:45	L.txt
1	2024-05-07 13:45:15	L.txt
2	2024-05-07 13:45:30	L.txt
3	2024-05-07 13:45:45	L.txt
1	2024-05-07 13:50:15	L.txt
2	2024-05-07 13:50:30	L.txt
3	2024-05-07 13:50:45	L.txt
1	2024-05-07 13:55:15	L.txt
2	2024-05-07 13:55:30	L.txt
3	2024-05-07 13:55:45	L.txt
1	2024-05-07 14:00:15	L.txt
2	2024-05-07 14:00:30	L.txt
3	2024-05-07 14:00:45	L.txt
1	2024-05-07 14:05:15	L.txt
2	2024-05-07 14:05:30	L.txt
3	2024-05-07 14:05:45	L.txt
1	2024-05-07 14:10:15	L.txt
2	2024-05-07 14:10:30	L.txt
3	2024-05-07 14:10:45	L.txt
1	2024-05-08 08:00:15	L.txt
2	2024-05-08 08:00:30	L.txt
3	2024-05-08 08:00:45	L.txt
1	2024-05-08 08:05:15	L.txt
2	2024-05-08 08:05:30	L.txt
3	2024-05-08 08:05:45	L.txt
4	2024-05-08 08:06:00	L.txt
5	2024-05-08 08:06:15	L.txt
1	2024-05-08 08:10:15	L.txt
2	2024-05-08 08:10:30	L.txt
3	2024-05-08 08:10:45	L.txt
4	2024-05-08 08:11:00	L.txt
5	2024-05-08 08:11:15	L.txt
1	2024-05-08 08:15:15	L.txt
2	2024-05-08 08:15:30	L.txt
3	2024-05-08 08:15:45	L.txt
4	2024-05-08 08:16:00	L.txt
5	2024-05-08 08:16:15	L.txt
1	2024-05-08 08:20:15	L.txt
2	2024-05-08 08:20:30	L.txt
3	2024-05-08 08:20:45	L.txt
4	2024-05-08 08:21:00	L.txt
5	2024-05-08 08:21:15	L.txt
1	2024-05-08 08:25:15	L.txt
2	2024-05-08 08:25:30	L.txt
3	2024-05-08 08:25:45	L.txt
4	2024-05-08 08:26:00	L.txt
5	2024-05-08 08:26:15	L.txt
1	2024-05-08 08:30:15	L.txt
2	2024-05-08 08:30:30	L.txt
3	2024-05-08 08:30:45	L.txt
4	2024-05-08 08:31:00	L.txt
5	2024-05-08 08:31:15	L.txt
1	2024-05-08 08:35:15	L.txt
2	2024-05-08 08:35:30	L.txt
3	2024-05-08 08:35:45	L.txt
4	2024-05-08 08:36:00	L.txt
5	2024-05-08 08:36:15	L.txt
1	2024-05-08 08:40:15	L.txt
2	2024-05-08 08:40:30	L.txt
3	2024-05-08 08:40:45	L.txt
4	2024-05-08 08:41:00	L.txt
5	2024-05-08 08:41:15	L.txt
1	2024-05-08 08:45:15	L.txt
2	2024-05-08 08:45:30	L.txt
3	2024-05-08 08:45:45	L.txt
4	2024-05-08 08:46:00	L.txt
5	2024-05-08 08:46:15	L.txt
1	2024-05-08 08:50:15	L.txt
2	2024-05-08 08:50:30	L.txt
3	2024-05-08 08:50:45	L.txt
4	2024-05-08 08:51:00	L.txt
5	2024-05-08 08:51:15	L.txt
1	2024-05-08 08:55:15	L.txt
2	2024-05-08 08:55:30	L.txt
3	2024-05-08 08:55:45	L.txt
4	2024-05-08 08:56:00	L.txt
5	2024-05-08 08:56:15	L.txt
1	2024-05-08 09:00:15	L.txt
2	2024-05-08 09:00:30	L.txt
3	2024-05-08 09:00:45	L.txt
4	2024-05-08 09:01:00	L.txt
5	2024-05-08 09:01:15	L.txt
1	2024-05-08 09:05:15	L.txt
2	2024-05-08 09:05:30	L.txt
3	2024-05-08 09:05:45	L.txt
4	2024-05-08 09:06:00	L.txt
5	2024-05-08 09:06:15	L.txt
1	2024-05-08 09:10:15	L.txt
2	2024-05-08 09:10:30	L.txt
3	2024-05-08 09:10:45	L.txt
4	2024-05-08 09:11:00	L.txt
5	2024-05-08 09:11:15	L.txt
1	2024-05-08 09:15:15	L.txt
2	2024-05-08 09:15:30	L.txt
3	2024-05-08 09:15:45	L.txt
4	2024-05-08 09:16:00	L.txt
5	2024-05-08 09:16:15	L.txt
1	2024-05-08 09:20:15	L.txt
2	2024-05-08 09:20:30	L.txt
3	2024-05-08 09:20:45	L.txt
4	2024-05-08 09:21:00	L.txt
5	2024-05-08 09:21:15	L.txt
1	2024-05-08 09:25:15	L.txt
2	2024-05-08 09:25:30	L.txt
3	2024-05-08 09:25:45	L.txt
4	2024-05-08 09:26:00	L.txt
5	2024-05-08 09:26:15	L.txt
1	2024-05-08 09:30:15	L.txt
2	2024-05-08 09:30:30	L.txt
3	2024-05-08 09:30:45	L.txt
4	2024-05-08 09:31:00	L.txt
5	2024-05-08 09:31:15	L.txt
1	2024-05-08 09:35:15	L.txt
2	2024-05-08 09:35:30	L.txt
3	2024-05-08 09:35:45	L.txt
4	2024-05-08 09:36:00	L.txt
5	2024-05-08 09:36:15	L.txt
1	2024-05-08 09:40:15	L.txt
2	2024-05-08 09:40:30	L.txt
3	2024-05-08 09:40:45	L.txt
4	2024-05-08 09:41:00	L.txt
5	2024-05-08 09:41:15	L.txt
1	2024-05-08 09:45:15	L.txt
2	2024-05-08 09:45:30	L.txt
3	2024-05-08 09:45:45	L.txt
4	2024-05-08 09:46:00	L.txt
5	2024-05-08 09:46:15	L.txt
1	2024-05-08 09:50:15	L.txt
2	2024-05-08 09:50:30	L.txt
3	2024-05-08 09:50:45	L.txt
4	2024-05-08 09:51:00	L.txt
5	2024-05-08 09:51:15	L.txt
1	2024-05-08 09:55:15	L.txt
2	2024-05-08 09:55:30	L.txt
3	2024-05-08 09:55:45	L.txt
4	2024-05-08 09:56:00	L.txt
5	2024-05-08 09:56:15	L.txt
1	2024-05-08 10:00:15	L.txt
2	2024-05-08 10:00:30	L.txt
3	2024-05-08 10:00:45	L.txt
4	2024-05-08 10:01:00	L.txt
5	2024-05-08 10:01:15	L.txt
1	2024-05-08 10:05:15	L.txt
2	2024-05-08 10:05:30	L.txt
3	2024-05-08 10:05:45	L.txt
4	2024-05-08 10:06:00	L.txt
5	2024-05-08 10:06:15	L.txt
1	2024-05-08 10:10:15	L.txt
2	2024-05-08 10:10:30	L.txt
3	2024-05-08 10:10:45	L.txt
4	2024-05-08 10:11:00	L.txt
5	2024-05-08 10:11:15	L.txt
1	2024-05-08 10:15:15	L.txt
2	2024-05-08 10:15:30	L.txt
3	2024-05-08 10:15:45	L.txt
4	2024-05-08 10:16:00	L.txt
5	2024-05-08 10:16:15	L.txt
1	2024-05-08 10:20:15	L.txt
2	2024-05-08 10:20:30	L.txt
3	2024-05-08 10:20:45	L.txt
4	2024-05-08 10:21:00	L.txt
5	2024-05-08 10:21:15	L.txt
1	2024-05-08 10:25:15	L.txt
2	2024-05-08 10:25:30	L.txt
3	2024-05-08 10:25:45	L.txt
4	2024-05-08 10:26:00	L.txt
5	2024-05-08 10:26:15	L.txt
1	2024-05-08 10:30:15	L.txt
2	2024-05-08 10:30:30	L.txt
3	2024-05-08 10:30:45	L.txt
4	2024-05-08 10:31:00	L.txt
5	2024-05-08 10:31:15	L.txt
1	2024-05-09 08:00:15	L.txt
2	2024-05-09 08:00:30	L.txt
3	2024-05-09 08:00:45	L.txt
4	2024-05-09 08:01:00	L.txt
5	2024-05-09 08:01:15	L.txt
1	2024-05-09 08:05:15	L.txt
2	2024-05-09 08:05:30	L.txt
3	2024-05-09 08:05:45	L.txt
4	2024-05-09 08:06:00	L.txt
5	2024-05-09 08:06:15	L.txt
1	2024-05-09 08:10:15	L.txt
2	2024-05-09 08:10:30	L.txt
3	2024-05-09 08:10:45	L.txt
4	2024-05-09 08:11:00	L.txt
5	2024-05-09 08:11:15	L.txt
1	2024-05-09 08:15:15	L.txt
2	2024-05-09 08:15:30	L.txt
3	2024-05-09 08:15:45	L.txt
4	2024-05-09 08:16:00	L.txt
5	2024-05-09 08:16:15	L.txt
1	2024-05-09 08:20:15	L.txt
2	2024-05-09 08:20:30	L.txt
3	2024-05-09 08:20:45	L.txt
4	2024-05-09 08:21:00	L.txt
5	2024-05-09 08:21:15	L.txt
1	2024-05-09 08:25:15	L.txt
2	2024-05-09 08:25:30	L.txt
3	2024-05-09 08:25:45	L.txt
4	2024-05-09 08:26:00	L.txt
5	2024-05-09 08:26:15	L.txt
1	2024-05-09 08:30:15	L.txt
2	2024-05-09 08:30:30	L.txt
3	2024-05-09 08:30:45	L.txt
4	2024-05-09 08:31:00	L.txt
5	2024-05-09 08:31:15	L.txt
1	2024-05-09 08:35:15	L.txt
2	2024-05-09 08:35:30	L.txt
3	2024-05-09 08:35:45	L.txt
4	2024-05-09 08:36:00	L.txt
5	2024-05-09 08:36:15	L.txt
1	2024-05-09 08:40:15	L.txt
2	2024-05-09 08:40:30	L.txt
3	2024-05-09 08:40:45	L.txt
4	2024-05-09 08:41:00	L.txt
5	2024-05-09 08:41:15	L.txt
1	2024-05-09 08:45:15	L.txt
2	2024-05-09 08:45:30	L.txt
3	2024-05-09 08:45:45	L.txt
4	2024-05-09 08:46:00	L.txt
5	2024-05-09 08:46:15	L.txt
1	2024-05-09 08:50:15	L.txt
2	2024-05-09 08:50:30	L.txt
3	2024-05-09 08:50:45	L.txt
4	2024-05-09 08:51:00	L.txt
5	2024-05-09 08:51:15	L.txt
1	2024-05-09 08:55:15	L.txt
2	2024-05-09 08:55:30	L.txt
3	2024-05-09 08:55:45	L.txt
4	2024-05-09 08:56:00	L.txt
5	2024-05-09 08:56:15	L.txt
1	2024-05-09 09:00:15	L.txt
2	2024-05-09 09:00:30	L.txt
3	2024-05-09 09:00:45	L.txt
4	2024-05-09 09:01:00	L.txt
5	2024-05-09 09:01:15	L.txt
1	2024-05-09 09:05:15	L.txt
2	2024-05-09 09:05:30	L.txt
3	2024-05-09 09:05:45	L.txt
4	2024-05-09 09:06:00	L.txt
5	2024-05-09 09:06:15	L.txt
1	2024-05-09 09:10:15	L.txt
2	2024-05-09 09:10:30	L.txt
3	2024-05-09 09:10:45	L.txt
4	2024-05-09 09:11:00	L.txt
5	2024-05-09 09:11:15	L.txt
1	2024-05-09 09:15:15	L.txt
2	2024-05-09 09:15:30	L.txt
3	2024-05-09 09:15:45	L.txt
4	2024-05-09 09:16:00	L.txt
5	2024-05-09 09:16:15	L.txt
1	2024-05-09 09:20:15	L.txt
2	2024-05-09 09:20:30	L.txt
3	2024-05-09 09:20:45	L.txt
4	2024-05-09 09:21:00	L.txt
5	2024-05-09 09:21:15	L.txt
1	2024-05-09 09:25:15	L.txt
2	2024-05-09 09:25:30	L.txt
3	2024-05-09 09:25:45	L.txt
4	2024-05-09 09:26:00	L.txt
5	2024-05-09 09:26:15	L.txt
1	2024-05-09 09:30:15	L.txt
2	2024-05-09 09:30:30	L.txt
3	2024-05-09 09:30:45	L.txt
4	2024-05-09 09:31:00	L.txt
5	2024-05-09 09:31:15	L.txt
1	2024-05-09 09:35:15	L.txt
2	2024-05-09 09:35:30	L.txt
3	2024-05-09 09:35:45	L.txt
4	2024-05-09 09:36:00	L.txt
5	2024-05-09 09:36:15	L.txt
1	2024-05-09 09:40:15	L.txt
2	2024-05-09 09:40:30	L.txt
3	2024-05-09 09:40:45	L.txt
4	2024-05-09 09:41:00	L.txt
5	2024-05-09 09:41:15	L.txt
1	2024-05-09 09:45:15	L.txt
2	2024-05-09 09:45:30	L.txt
3	2024-05-09 09:45:45	L.txt
4	2024-05-09 09:46:00	L.txt
5	2024-05-09 09:46:15	L.txt
1	2024-05-09 09:50:15	L.txt
2	2024-05-09 09:50:30	L.txt
3	2024-05-09 09:50:45	L.txt
4	2024-05-09 09:51:00	L.txt
5	2024-05-09 09:51:15	L.txt
1	2024-05-09 09:55:15	L.txt
2	2024-05-09 09:55:30	L.txt
3	2024-05-09 09:55:45	L.txt
4	2024-05-09 09:56:00	L.txt
5	2024-05-09 09:56:15	L.txt
1	2024-05-09 10:00:15	L.txt
2	2024-05-09 10:00:30	L.txt
3	2024-05-09 10:00:45	L.txt
4	2024-05-09 10:01:00	L.txt
5	2024-05-09 10:01:15	L.txt
1	2024-05-09 10:05:15	L.txt
2	2024-05-09 10:05:30	L.txt
3	2024-05-09 10:05:45	L.txt
4	2024-05-09 10:06:00	L.txt
5	2024-05-09 10:06:15	L.txt
1	2024-05-09 10:10:15	L.txt
2	2024-05-09 10:10:30	L.txt
3	2024-05-09 10:10:45	L.txt
4	2024-05-09 10:11:00	L.txt
5	2024-05-09 10:11:15	L.txt
1	2024-05-09 10:15:15	L.txt
2	2024-05-09 10:15:30	L.txt
3	2024-05-09 10:15:45	L.txt
4	2024-05-09 10:16:00	L.txt
5	2024-05-09 10:16:15	L.txt
1	2024-05-09 10:20:15	L.txt
2	2024-05-09 10:20:30	L.txt
3	2024-05-09 10:20:45	L.txt
4	2024-05-09 10:21:00	L.txt
5	2024-05-09 10:21:15	L.txt
1	2024-05-09 10:25:15	L.txt
2	2024-05-09 10:25:30	L.txt
3	2024-05-09 10:25:45	L.txt
4	2024-05-09 10:26:00	L.txt
5	2024-05-09 10:26:15	L.txt
1	2024-05-09 10:30:15	L.txt
2	2024-05-09 10:30:30	L.txt
3	2024-05-09 10:30:45	L.txt
4	2024-05-09 10:31:00	L.txt
5	2024-05-09 10:31:15	L.txt
1	2024-05-10 08:00:15	L.txt
2	2024-05-10 08:00:30	L.txt
3	2024-05-10 08:00:45	L.txt
4	2024-05-10 08:01:00	L.txt
5	2024-05-10 08:01:15	L.txt
1	2024-05-10 08:05:15	L.txt
2	2024-05-10 08:05:30	L.txt
3	2024-05-10 08:05:45	L.txt
4	2024-05-10 08:06:00	L.txt
5	2024-05-10 08:06:15	L.txt
1	2024-05-10 08:10:15	L.txt
2	2024-05-10 08:10:30	L.txt
3	2024-05-10 08:10:45	L.txt
4	2024-05-10 08:11:00	L.txt
5	2024-05-10 08:11:15	L.txt
1	2024-05-10 08:15:15	L.txt
2	2024-05-10 08:15:30	L.txt
3	2024-05-10 08:15:45	L.txt
4	2024-05-10 08:16:00	L.txt
5	2024-05-10 08:16:15	L.txt
1	2024-05-10 08:20:15	L.txt
2	2024-05-10 08:20:30	L.txt
3	2024-05-10 08:20:45	L.txt
4	2024-05-10 08:21:00	L.txt
5	2024-05-10 08:21:15	L.txt
1	2024-05-10 08:25:15	L.txt
2	2024-05-10 08:25:30	L.txt
3	2024-05-10 08:25:45	L.txt
4	2024-05-10 08:26:00	L.txt
5	2024-05-10 08:26:15	L.txt
1	2024-05-10 08:30:15	L.txt
2	2024-05-10 08:30:30	L.txt
3	2024-05-10 08:30:45	L.txt
4	2024-05-10 08:31:00	L.txt
5	2024-05-10 08:31:15	L.txt
1	2024-05-10 08:35:15	L.txt
2	2024-05-10 08:35:30	L.txt
3	2024-05-10 08:35:45	L.txt
4	2024-05-10 08:36:00	L.txt
5	2024-05-10 08:36:15	L.txt
1	2024-05-10 08:40:15	L.txt
2	2024-05-10 08:40:30	L.txt
3	2024-05-10 08:40:45	L.txt
4	2024-05-10 08:41:00	L.txt
5	2024-05-10 08:41:15	L.txt
1	2024-05-10 08:45:15	L.txt
2	2024-05-10 08:45:30	L.txt
3	2024-05-10 08:45:45	L.txt
4	2024-05-10 08:46:00	L.txt
5	2024-05-10 08:46:15	L.txt
1	2024-05-10 08:50:15	L.txt
2	2024-05-10 08:50:30	L.txt
3	2024-05-10 08:50:45	L.txt
4	2024-05-10 08:51:00	L.txt
5	2024-05-10 08:51:15	L.txt
1	2024-05-10 08:55:15	L.txt
2	2024-05-10 08:55:30	L.txt
3	2024-05-10 08:55:45	L.txt
4	2024-05-10 08:56:00	L.txt
5	2024-05-10 08:56:15	L.txt
1	2024-05-10 09:00:15	L.txt
2	2024-05-10 09:00:30	L.txt
3	2024-05-10 09:00:45	L.txt
4	2024-05-10 09:01:00	L.txt
5	2024-05-10 09:01:15	L.txt
1	2024-05-10 09:05:15	L.txt
2	2024-05-10 09:05:30	L.txt
3	2024-05-10 09:05:45	L.txt
4	2024-05-10 09:06:00	L.txt
5	2024-05-10 09:06:15	L.txt
1	2024-05-10 09:10:15	L.txt
2	2024-05-10 09:10:30	L.txt
3	2024-05-10 09:10:45	L.txt
4	2024-05-10 09:11:00	L.txt
5	2024-05-10 09:11:15	L.txt
1	2024-05-10 09:15:15	L.txt
2	2024-05-10 09:15:30	L.txt
3	2024-05-10 09:15:45	L.txt
4	2024-05-10 09:16:00	L.txt
5	2024-05-10 09:16:15	L.txt
1	2024-05-10 09:20:15	L.txt
2	2024-05-10 09:20:30	L.txt
3	2024-05-10 09:20:45	L.txt
4	2024-05-10 09:21:00	L.txt
5	2024-05-10 09:21:15	L.txt
1	2024-05-10 09:25:15	L.txt
2	2024-05-10 09:25:30	L.txt
3	2024-05-10 09:25:45	L.txt
4	2024-05-10 09:26:00	L.txt
5	2024-05-10 09:26:15	L.txt
1	2024-05-10 09:30:15	L.txt
2	2024-05-10 09:30:30	L.txt
3	2024-05-10 09:30:45	L.txt
4	2024-05-10 09:31:00	L.txt
5	2024-05-10 09:31:15	L.txt
1	2024-05-10 09:35:15	L.txt
2	2024-05-10 09:35:30	L.txt
3	2024-05-10 09:35:45	L.txt
4	2024-05-10 09:36:00	L.txt
5	2024-05-10 09:36:15	L.txt
1	2024-05-10 09:40:15	L.txt
2	2024-05-10 09:40:30	L.txt
3	2024-05-10 09:40:45	L.txt
4	2024-05-10 09:41:00	L.txt
5	2024-05-10 09:41:15	L.txt
1	2024-05-10 09:45:15	L.txt
2	2024-05-10 09:45:30	L.txt
3	2024-05-10 09:45:45	L.txt
4	2024-05-10 09:46:00	L.txt
5	2024-05-10 09:46:15	L.txt
1	2024-05-10 09:50:15	L.txt
2	2024-05-10 09:50:30	L.txt
3	2024-05-10 09:50:45	L.txt
4	2024-05-10 09:51:00	L.txt
5	2024-05-10 09:51:15	L.txt
1	2024-05-10 09:55:15	L.txt
2	2024-05-10 09:55:30	L.txt
3	2024-05-10 09:55:45	L.txt
4	2024-05-10 09:56:00	L.txt
5	2024-05-10 09:56:15	L.txt
1	2024-05-10 10:00:15	L.txt
2	2024-05-10 10:00:30	L.txt
3	2024-05-10 10:00:45	L.txt
4	2024-05-10 10:01:00	L.txt
5	2024-05-10 10:01:15	L.txt
1	2024-05-10 10:05:15	L.txt
2	2024-05-10 10:05:30	L.txt
3	2024-05-10 10:05:45	L.txt
4	2024-05-10 10:06:00	L.txt
5	2024-05-10 10:06:15	L.txt
1	2024-05-10 10:10:15	L.txt
2	2024-05-10 10:10:30	L.txt
3	2024-05-10 10:10:45	L.txt
4	2024-05-10 10:11:00	L.txt
5	2024-05-10 10:11:15	L.txt
1	2024-05-10 10:15:15	L.txt
2	2024-05-10 10:15:30	L.txt
3	2024-05-10 10:15:45	L.txt
4	2024-05-10 10:16:00	L.txt
5	2024-05-10 10:16:15	L.txt
1	2024-05-10 10:20:15	L.txt
2	2024-05-10 10:20:30	L.txt
3	2024-05-10 10:20:45	L.txt
4	2024-05-10 10:21:00	L.txt
5	2024-05-10 10:21:15	L.txt
1	2024-05-10 10:25:15	L.txt
2	2024-05-10 10:25:30	L.txt
3	2024-05-10 10:25:45	L.txt
4	2024-05-10 10:26:00	L.txt
5	2024-05-10 10:26:15	L.txt
1	2024-05-10 10:30:15	L.txt
2	2024-05-10 10:30:30	L.txt
3	2024-05-10 10:30:45	L.txt
4	2024-05-10 10:31:00	L.txt
5	2024-05-10 10:31:15	L.txt
1	2024-05-11 08:00:15	L.txt
2	2024-05-11 08:00:30	L.txt
3	2024-05-11 08:00:45	L.txt
4	2024-05-11 08:01:00	L.txt
5	2024-05-11 08:01:15	L.txt
6	2024-05-11 08:01:30	L.txt
7	2024-05-11 08:01:45	L.txt
8	2024-05-11 08:02:00	L.txt
9	2024-05-11 08:02:15	L.txt
10	2024-05-11 08:02:30	L.txt
11	2024-05-11 08:02:45	L.txt
12	2024-05-11 08:03:00	L.txt
13	2024-05-11 08:03:15	L.txt
14	2024-05-11 08:03:30	L.txt
15	2024-05-11 08:03:45	L.txt
16	2024-05-11 08:04:00	L.txt
17	2024-05-11 08:04:15	L.txt
18	2024-05-11 08:04:30	L.txt
19	2024-05-11 08:04:45	L.txt
20	2024-05-11 08:05:00	L.txt
21	2024-05-11 08:05:15	L.txt
22	2024-05-11 08:05:30	L.txt
23	2024-05-11 08:05:45	L.txt
24	2024-05-11 08:06:00	L.txt
25	2024-05-11 08:06:15	L.txt
26	2024-05-11 08:06:30	L.txt
27	2024-05-11 08:06:45	L.txt
28	2024-05-11 08:07:00	L.txt
29	2024-05-11 08:07:15	L.txt
30	2024-05-11 08:07:30	L.txt
31	2024-05-11 08:07:45	L.txt
32	2024-05-11 08:08:00	L.txt
33	2024-05-11 08:08:15	L.txt
34	2024-05-11 08:08:30	L.txt
35	2024-05-11 08:08:45	L.txt
1	2024-05-18 08:00:15	L.txt
2	2024-05-18 08:00:30	L.txt
3	2024-05-18 08:00:45	L.txt
4	2024-05-18 08:01:00	L.txt
5	2024-05-18 08:01:15	L.txt
6	2024-05-18 08:01:30	L.txt
7	2024-05-18 08:01:45	L.txt
8	2024-05-18 08:02:00	L.txt
9	2024-05-18 08:02:15	L.txt
10	2024-05-18 08:02:30	L.txt
11	2024-05-18 08:02:45	L.txt
12	2024-05-18 08:03:00	L.txt
13	2024-05-18 08:03:15	L.txt
14	2024-05-18 08:03:30	L.txt
15	2024-05-18 08:03:45	L.txt
16	2024-05-18 08:04:00	L.txt
17	2024-05-18 08:04:15	L.txt
18	2024-05-18 08:04:30	L.txt
19	2024-05-18 08:04:45	L.txt
20	2024-05-18 08:05:00	L.txt
21	2024-05-18 08:05:15	L.txt
22	2024-05-18 08:05:30	L.txt
23	2024-05-18 08:05:45	L.txt
24	2024-05-18 08:06:00	L.txt
25	2024-05-18 08:06:15	L.txt
26	2024-05-18 08:06:30	L.txt
27	2024-05-18 08:06:45	L.txt
28	2024-05-18 08:07:00	L.txt
29	2024-05-18 08:07:15	L.txt
30	2024-05-18 08:07:30	L.txt
31	2024-05-18 08:07:45	L.txt
32	2024-05-18 08:08:00	L.txt
33	2024-05-18 08:08:15	L.txt
34	2024-05-18 08:08:30	L.txt
35	2024-05-18 08:08:45	L.txt
1	2024-05-25 08:00:15	L.txt
2	2024-05-25 08:00:30	L.txt
3	2024-05-25 08:00:45	L.txt
4	2024-05-25 08:01:00	L.txt
5	2024-05-25 08:01:15	L.txt
6	2024-05-25 08:01:30	L.txt
7	2024-05-25 08:01:45	L.txt
8	2024-05-25 08:02:00	L.txt
9	2024-05-25 08:02:15	L.txt
10	2024-05-25 08:02:30	L.txt
11	2024-05-25 08:02:45	L.txt
12	2024-05-25 08:03:00	L.txt
13	2024-05-25 08:03:15	L.txt
14	2024-05-25 08:03:30	L.txt
15	2024-05-25 08:03:45	L.txt
16	2024-05-25 08:04:00	L.txt
17	2024-05-25 08:04:15	L.txt
18	2024-05-25 08:04:30	L.txt
19	2024-05-25 08:04:45	L.txt
20	2024-05-25 08:05:00	L.txt
21	2024-05-25 08:05:15	L.txt
22	2024-05-25 08:05:30	L.txt
23	2024-05-25 08:05:45	L.txt
24	2024-05-25 08:06:00	L.txt
25	2024-05-25 08:06:15	L.txt
26	2024-05-25 08:06:30	L.txt
27	2024-05-25 08:06:45	L.txt
28	2024-05-25 08:07:00	L.txt
29	2024-05-25 08:07:15	L.txt
30	2024-05-25 08:07:30	L.txt
31	2024-05-25 08:07:45	L.txt
32	2024-05-25 08:08:00	L.txt
33	2024-05-25 08:08:15	L.txt
34	2024-05-25 08:08:30	L.txt
35	2024-05-25 08:08:45	L.txt
1	2024-10-05 12:00:15	L.txt
2	2024-10-05 12:00:30	L.txt
3	2024-10-05 12:00:45	L.txt
4	2024-10-05 12:01:00	L.txt
5	2024-10-05 12:01:15	L.txt
6	2024-10-05 12:01:30	L.txt
