\beamer@sectionintoc {1}{Fork - Clone project}{3}{0}{1}
\beamer@sectionintoc {2}{B\IeC {\'\abreve }t \IeC {\dj }\IeC {\`\acircumflex }u l\IeC {\`a}m 1 t\IeC {\'\i }nh n\IeC {\u a}ng m\IeC {\'\ohorn }i}{9}{0}{2}
\beamer@sectionintoc {3}{Team \IeC {\dj }\IeC {\~a} merge 1 request trong l\IeC {\'u}c l\IeC {\`a}m}{12}{0}{3}
