{
  "actions": [],
  "allow_rename": 1,
  "creation": "2024-12-27 13:01:14.532723",
  "doctype": "DocType",
  "engine": "InnoDB",
  "field_order": ["question"],
  "fields": [
    {
      "fieldname": "question",
      "fieldtype": "Text",
      "label": "Question",
      "reqd": 1
    }
  ],
  "index_web_pages_for_search": 1,
  "links": [],
  "modified": "2024-12-27 13:01:48.778327",
  "modified_by": "Administrator",
  "module": "App",
  "name": "Question",
  "owner": "Administrator",
  "permissions": [
    {
      "create": 1,
      "delete": 1,
      "email": 1,
      "export": 1,
      "print": 1,
      "read": 1,
      "report": 1,
      "role": "System Manager",
      "share": 1,
      "write": 1
    }
  ],
  "sort_field": "modified",
  "sort_order": "DESC",
  "states": []
}
