[
  {
    "url": "https://github.com/frappe/print_designer.git",
    "branch": "v1.4.3"
  },
  {
    "url": "https://github.com/frappe/builder.git",
    "branch": "v1.12.5"
  },
  {
    "url": "https://gitlab.com/bitspur/frappe/keycloak.git",
    "branch": "main"
  },
  {
    "url": "https://gitlab.com/bitspur/frappe/graphql.git",
    "branch": "main"
  }
]