module gitlab.com/bitservices/archlinux/bitservices-monitoring-client

go 1.24.0

require (
	github.com/go-co-op/gocron/v2 v2.16.0
	gopkg.in/yaml.v3 v3.0.1
)

require (
	github.com/google/uuid v1.6.0 // indirect
	github.com/jonboulle/clockwork v0.5.0 // indirect
	github.com/kr/pretty v0.3.1 // indirect
	github.com/robfig/cron/v3 v3.0.1 // indirect
)
