{
  "maps": [
    {
      "name": "test1",
      "objects": [
        {
          "type": "pear",
          "transform": {
            "pos": [ 0, 0, 0 ],
            "rotation": [ 0, 0, 0 ],
            "scale": [ 3, 3, 3 ]
          }
        }
      ]
    }
  ]
}
