<svg id="PwC_fl_wo" xmlns="http://www.w3.org/2000/svg" width="87.892" height="66.71" viewBox="0 0 87.892 66.71">
  <path id="Fill-1" d="M168.848,138.915c-2.829.457-4.275,2.546-4.275,6.223,0,3.7,1.926,6.174,4.88,6.174,1.374,0,2.623-.457,5.248-1.744v2.993a16.2,16.2,0,0,1-7.543,1.892,8.1,8.1,0,0,1-6.26-2.339,8.467,8.467,0,0,1-2.427-6.137c0-5.3,3.92-8.878,9.646-8.878,3.8,0,6.419,1.738,6.419,4.289a2.761,2.761,0,0,1-3.024,2.774,4.978,4.978,0,0,1-2.663-.809v-4.439" transform="translate(-109.334 -94.854)" fill="#fffffe" fill-rule="evenodd"/>
  <path id="Fill-2" d="M91.821,145.978c2.536-3.2,3.432-4.487,3.432-6.056a2.822,2.822,0,0,0-2.9-2.822,3.364,3.364,0,0,0-2.389.983V144.6l-4.156,5.537V137.51H81.859L75.291,148.4V137.51h-2.27l-5.962,1.454v1.524l3.252.33v13.354h4.2l6.3-10.352v10.352h4.6l6.4-8.193" transform="translate(-46.266 -94.854)" fill="#fffffe" fill-rule="evenodd"/>
  <path id="Fill-4" d="M8.239,159.5l2.726.606v1.547H.272V160.11l2.437-.606V140.823H0v-1.6l6.542-1.987h1.7v2.231c3.064-1.823,4.116-2.146,5.688-2.146,3.629,0,6.308,3.347,6.308,7.982,0,5.358-3.574,8.962-9.206,8.962a26.015,26.015,0,0,1-2.789-.164Zm0-7.3c.448.021.644.021.926.021,3.386,0,5.2-2.111,5.2-6.158,0-3.426-1.485-5.248-4.226-5.248a16.475,16.475,0,0,0-1.9.173Z" transform="translate(0 -94.946)" fill="#fffffe" fill-rule="evenodd"/>
  <path id="Fill-6" d="M127.564,97.329h16.37V93.236h-16.37Z" transform="translate(-88.011 -64.591)" fill="#fffffe" fill-rule="evenodd"/>
  <path id="Fill-7" d="M208.175,28.679h3.336V22.13h-3.336Zm-8.28,0h7.463V22.13h-7.463ZM181.176,4.048h14.69V1.668h-14.69Zm15.507,4.983h2.394V4.865h-2.394Zm0,12.282h2.394V9.848h-2.394Zm0,7.366h2.394V22.13h-2.394Zm-6.123,0h5.306V22.13H190.56Zm-9.384,0h8.567V22.13h-8.567Zm14.69-18.831V21.312H190.56v-4.1h-9.382l0-7.364Zm-14.69-.817h14.69V4.865h-14.69Zm0,12.282h8.567V18.029h-8.567Zm18.719,0h7.463V9.848h-7.463Zm8.28,0V9.031h-8.28V4.048h-3.212V.851H180.359V29.5h31.969V21.312Z" transform="translate(-124.436 -0.851)" fill="#fffffe" fill-rule="evenodd"/>
</svg>
