<svg xmlns="http://www.w3.org/2000/svg" width="19.766" height="19.766" viewBox="0 0 19.766 19.766">
  <g id="Icon_feather-search" data-name="Icon feather-search" transform="translate(-3.75 -3.75)">
    <path id="Path_392" data-name="Path 392" d="M20.46,12.48A7.98,7.98,0,1,1,12.48,4.5,7.98,7.98,0,0,1,20.46,12.48Z" fill="none" stroke="#009deb" stroke-linecap="round" stroke-linejoin="round" stroke-width="1.5"/>
    <path id="Path_393" data-name="Path 393" d="M29.314,29.314l-4.339-4.339" transform="translate(-6.859 -6.859)" fill="none" stroke="#009deb" stroke-linecap="round" stroke-linejoin="round" stroke-width="1.5"/>
  </g>
</svg>
