<svg xmlns="http://www.w3.org/2000/svg" width="25" height="25" viewBox="0 0 25 25">
  <g id="Group_41" data-name="Group 41" transform="translate(-37 -263)">
    <g id="Layer_2" data-name="Layer 2" transform="translate(37 263.418)">
      <g id="invisible_box" data-name="invisible box">
        <rect id="Rectangle_32" data-name="Rectangle 32" width="25" height="25" transform="translate(0 -0.418)" fill="none"/>
      </g>
      <g id="icons_Q2" data-name="icons Q2" transform="translate(3.073 1.536)">
        <rect id="Rectangle_33" data-name="Rectangle 33" width="10" height="2" rx="1" transform="translate(3.927 6.045)"/>
        <rect id="Rectangle_34" data-name="Rectangle 34" width="10" height="2" rx="1" transform="translate(3.927 10.045)"/>
        <rect id="Rectangle_35" data-name="Rectangle 35" width="6" height="2" rx="1" transform="translate(3.927 14.045)"/>
        <path id="Path_10" data-name="Path 10" d="M22.388,5.048V22.461H8.048V5.048H22.388M23.412,3H7.024A1.024,1.024,0,0,0,6,4.024V23.485a1.024,1.024,0,0,0,1.024,1.024H23.412a1.024,1.024,0,0,0,1.024-1.024V4.024A1.024,1.024,0,0,0,23.412,3Z" transform="translate(-6 -3)"/>
      </g>
    </g>
  </g>
</svg>
