<svg xmlns="http://www.w3.org/2000/svg" width="18.071" height="21.085" viewBox="0 0 18.071 21.085">
  <path id="Icon_ionic-ios-refresh" data-name="Icon ionic-ios-refresh" d="M21.867,14.337a.7.7,0,0,0-.7.64,7.641,7.641,0,1,1-7.813-8.232.184.184,0,0,1,.193.188V9.3a.755.755,0,0,0,1.158.635l4.528-3.167a.753.753,0,0,0,0-1.275L14.708,2.368A.755.755,0,0,0,13.551,3V5.154a.185.185,0,0,1-.184.188,9,9,0,1,0,9.2,9.752.7.7,0,0,0-.7-.758Z" transform="translate(-4.5 -2.251)" fill="#009deb"/>
</svg>
