<svg xmlns="http://www.w3.org/2000/svg" width="22.75" height="22.693" viewBox="0 0 22.75 22.693">
  <g id="Group_156" data-name="Group 156" transform="translate(-45 -167)">
    <path id="Icon_material-data-usage" data-name="Icon material-data-usage" d="M15.512,3.075V6.522a7.957,7.957,0,0,1,6.825,7.871,8.1,8.1,0,0,1-.546,2.889l2.957,1.74a11.234,11.234,0,0,0,1-4.63A11.382,11.382,0,0,0,15.512,3.075Zm-1.137,19.28A7.957,7.957,0,0,1,13.237,6.522V3.075a11.374,11.374,0,1,0,10.294,18.04l-2.957-1.74A7.906,7.906,0,0,1,14.375,22.355Z" transform="translate(42 163.925)"/>
  </g>
</svg>
