[
  {
    "id": 1,
    "name": "t1.small",
    "price": 10
  },
  {
    "id": 2,
    "name": "t1.medium",
    "price": 20
  },
  {
    "id": 3,
    "name": "t1.large",
    "price": 40
  },
  {
    "id": 4,
    "name": "t2.small",
    "price": 60
  },
  {
    "id": 5,
    "name": "t2.medium",
    "price": 80
  },
  {
    "id": 6,
    "name": "t2.large",
    "price": 100
  },
  {
    "id": 7,
    "name": "t3.small",
    "price": 160
  },
  {
    "id": 8,
    "name": "t3.medium",
    "price": 180
  },
  {
    "id": 9,
    "name": "t3.large",
    "price": 200
  }
]
