<svg id="Group_1165" data-name="Group 1165" xmlns="http://www.w3.org/2000/svg" width="26.112" height="18.985" viewBox="0 0 26.112 18.985">
  <g id="Group_146" data-name="Group 146">
    <g id="Group_144" data-name="Group 144">
      <path id="Path_84" data-name="Path 84" d="M1535.1,455.718a13.769,13.769,0,0,1,9.275,3.7c.052.035.086.086.138.12.241.241.275.5.1.688-.189.189-.43.155-.688-.086a12.547,12.547,0,0,0-6.746-3.373,13.041,13.041,0,0,0-15.23,13.113,12.333,12.333,0,0,0,.757,4.1c.017.052.034.086.052.138a.427.427,0,0,1-.258.568.416.416,0,0,1-.534-.292c-.155-.447-.31-.912-.43-1.377a13.847,13.847,0,0,1,5.231-14.61A13.993,13.993,0,0,1,1535.1,455.718Z" transform="translate(-1521.102 -455.718)" fill="#f60"/>
      <path id="Path_85" data-name="Path 85" d="M1652.054,512.713c-.31-.31-.6-.585-.912-.895.482-.465.946-.947,1.428-1.411l2.925-2.925.843-.843a.659.659,0,0,1,1-.086.652.652,0,0,1-.086.981c-.98.981-1.979,1.962-2.959,2.943-.723.723-1.429,1.445-2.151,2.168C1652.123,512.661,1652.089,512.678,1652.054,512.713Z" transform="translate(-1635.769 -499.759)" fill="#f60"/>
      <path id="Path_86" data-name="Path 86" d="M1626.78,563.057a1.542,1.542,0,0,1-1.549-1.549,1.549,1.549,0,1,1,1.549,1.549Z" transform="translate(-1612.921 -547.006)" fill="#f60"/>
      <path id="Path_87" data-name="Path 87" d="M1594.376,528.215c-.293.292-.585.568-.93.912a3.276,3.276,0,0,0-.224-.293c-.929-.946-1.876-1.876-2.8-2.822a.63.63,0,0,1-.1-.792.606.606,0,0,1,.706-.276.635.635,0,0,1,.293.172l3.046,3.046A.132.132,0,0,0,1594.376,528.215Z" transform="translate(-1582.048 -516.122)" fill="#f60"/>
      <path id="Path_88" data-name="Path 88" d="M1722.085,500.173c-.224-.4-.447-.757-.653-1.119-.138-.258-.1-.361.137-.516.516-.31.533-.31.826.206.172.293.361.6.533.912.206-.121.4-.224.585-.327.172-.086.258-.052.258.155.018.774.018,1.549.018,2.306,0,.224-.086.258-.275.155-.671-.379-1.325-.74-2-1.136-.207-.12-.207-.207,0-.327A4.6,4.6,0,0,0,1722.085,500.173Z" transform="translate(-1697.677 -493.29)" fill="#f60"/>
      <path id="Path_89" data-name="Path 89" d="M1634.252,484.224v.654a.621.621,0,0,1-.619.637.632.632,0,0,1-.637-.62c-.017-.43-.017-.878,0-1.325a.628.628,0,0,1,.654-.637.651.651,0,0,1,.62.671C1634.252,483.794,1634.252,484.017,1634.252,484.224Z" transform="translate(-1619.756 -480.221)" fill="#f60"/>
      <path id="Path_90" data-name="Path 90" d="M1549.39,568.963h-.671a.628.628,0,0,1-.017-1.256q.671-.026,1.342,0a.621.621,0,0,1,.62.637.607.607,0,0,1-.636.6C1549.82,568.963,1549.614,568.963,1549.39,568.963Z" transform="translate(-1544.892 -551.601)" fill="#f60"/>
      <path id="Path_91" data-name="Path 91" d="M1708.021,568.963h-.654a.617.617,0,0,1-.62-.62.611.611,0,0,1,.62-.637q.671-.026,1.343,0a.61.61,0,0,1,.619.637.621.621,0,0,1-.637.62Z" transform="translate(-1684.8 -551.601)" fill="#f60"/>
    </g>
  </g>
</svg>
