<svg id="high-voltage" xmlns="http://www.w3.org/2000/svg" width="18.107" height="15.685" viewBox="0 0 18.107 15.685">
  <g id="Group_2740" data-name="Group 2740">
    <g id="Group_2739" data-name="Group 2739">
      <path id="Path_920" data-name="Path 920" d="M17.98,48.551,9.838,34.691a.908.908,0,0,0-1.568,0L.128,48.551a.913.913,0,0,0,.784,1.376H17.2a.913.913,0,0,0,.784-1.376Zm-.487.636a.337.337,0,0,1-.3.173H.911a.337.337,0,0,1-.3-.173.344.344,0,0,1,0-.349l8.142-13.86a.342.342,0,0,1,.59,0l8.142,13.86A.344.344,0,0,1,17.493,49.187Z" transform="translate(0 -34.242)" fill="#374375"/>
    </g>
  </g>
  <g id="Group_2742" data-name="Group 2742" transform="translate(9.98 3.838)">
    <g id="Group_2741" data-name="Group 2741">
      <path id="Path_921" data-name="Path 921" d="M282.963,143.322l-.238-.4a.283.283,0,1,0-.489.287l.238.4a.283.283,0,1,0,.489-.287Z" transform="translate(-282.198 -142.778)" fill="#374375"/>
    </g>
  </g>
  <g id="Group_2744" data-name="Group 2744" transform="translate(1.644 1.779)">
    <g id="Group_2743" data-name="Group 2743">
      <path id="Path_922" data-name="Path 922" d="M61.272,96.81,56.2,88.171a.283.283,0,0,0-.489.287l4.824,8.211H47.271L53.9,85.383l.36.613a.283.283,0,1,0,.489-.287l-.6-1.029a.283.283,0,0,0-.489,0L46.531,96.81a.283.283,0,0,0,.244.427H61.027a.283.283,0,0,0,.244-.427Z" transform="translate(-46.492 -84.54)" fill="#374375"/>
    </g>
  </g>
  <g id="Group_2746" data-name="Group 2746" transform="translate(7.562 4.838)">
    <g id="Group_2745" data-name="Group 2745" transform="translate(0 0)">
      <path id="Path_923" data-name="Path 923" d="M216.385,174.724a.283.283,0,0,0-.285-.036l-1.581.677,1.059-3.972a.283.283,0,1,0-.548-.146l-1.209,4.535a.283.283,0,0,0,.386.334l1.647-.706-.394,2.564a.283.283,0,0,0-.513.231l.327,1.06a.283.283,0,0,0,.5.083l.652-.9a.283.283,0,0,0-.406-.388l.473-3.072A.283.283,0,0,0,216.385,174.724Z" transform="translate(-213.811 -171.037)" fill="#374375"/>
    </g>
  </g>
</svg>
