<svg xmlns="http://www.w3.org/2000/svg" width="25" height="25" viewBox="0 0 25 25">
  <g id="Group_1424" data-name="Group 1424" transform="translate(-375 -730)">
    <path id="Path_418" data-name="Path 418" d="M4,0H21a4,4,0,0,1,4,4V21a4,4,0,0,1-4,4H4a4,4,0,0,1-4-4V4A4,4,0,0,1,4,0Z" transform="translate(375 730)" fill="#f5a76d"/>
    <text id="KVA" transform="translate(376 734)" fill="#fff" font-size="10" font-family="SegoeUI-Semibold, Segoe UI" font-weight="600" letter-spacing="0.04em"><tspan x="1.754" y="11">KVA</tspan></text>
  </g>
</svg>
