{
	"source": {
		"include": ["./src/js/data_handling"],
		"includePattern": ".js$",
		"excludePattern": "(node_modules/|docs|DOCUMENTATION)"
	},
	"plugins": ["plugins/markdown"],
	"opts": {
		"encoding": "utf8",
		"readme": "./readme.md",
		"destination": "DOCUMENTATION/Frontend/",
		"recurse": true,
		"verbose": true,
		"template": "node_modules/better-docs"
	}
}
