<svg xmlns="http://www.w3.org/2000/svg" width="41" height="19" viewBox="0 0 41 19">
  <g id="Group_1362" data-name="Group 1362" transform="translate(0 -0.287)">
    <g id="Group_944" data-name="Group 944" transform="translate(3 0.287)">
      <text id="kWh_L" data-name="kWh/L" fill="#f60" font-size="12" font-family="SegoeUI, Segoe UI"><tspan x="0" y="13">kWh/L</tspan></text>
    </g>
    <g id="Rectangle_668" data-name="Rectangle 668" transform="translate(0 0.287)" fill="none" stroke="#f60" stroke-width="1">
      <rect width="41" height="17" rx="6" stroke="none"/>
      <rect x="0.5" y="0.5" width="40" height="16" rx="5.5" fill="none"/>
    </g>
  </g>
</svg>
