<svg xmlns="http://www.w3.org/2000/svg" xmlns:xlink="http://www.w3.org/1999/xlink" width="22.844" height="30.291" viewBox="0 0 22.844 30.291">
  <defs>
    <clipPath id="clip-path">
      <rect id="Rectangle_80" data-name="Rectangle 80" width="11.081" height="30.085" fill="#374375"/>
    </clipPath>
  </defs>
  <g id="Group_1034" data-name="Group 1034" transform="translate(0)">
    <g id="Group_203" data-name="Group 203" transform="translate(11.763)">
      <g id="Group_202" data-name="Group 202">
        <g id="Group_201" data-name="Group 201" clip-path="url(#clip-path)">
          <path id="Path_117" data-name="Path 117" d="M1662.739,520.888a3.515,3.515,0,0,0-3.511,3.511v16.818a5.518,5.518,0,1,0,7.022,0V524.4a3.514,3.514,0,0,0-3.511-3.511Zm4.515,24.578a4.514,4.514,0,1,1-7.223-3.605.5.5,0,0,0,.2-.4v-1.511h1v-1h-1v-1.5h1v-1h-1v-1.5h1v-1h-1v-1.5h1v-1h-1v-1.505h1v-1h-1v-1.5h1v-1h-1V524.4a2.508,2.508,0,0,1,5.016,0v17.061a.5.5,0,0,0,.2.4,4.481,4.481,0,0,1,1.806,3.6Zm0,0" transform="translate(-1657.191 -520.888)" fill="#374375"/>
        </g>
      </g>
      <path id="Path_118" data-name="Path 118" d="M1684.61,575.024V557.418h-1v17.606a2.508,2.508,0,1,0,1,0Zm-.5,3.963a1.5,1.5,0,1,1,1.5-1.5,1.5,1.5,0,0,1-1.5,1.5Zm0,0" transform="translate(-1678.56 -552.904)" fill="#374375"/>
    </g>
    <g id="Group_204" data-name="Group 204" transform="translate(0 0.447)">
      <path id="Path_119" data-name="Path 119" d="M1569.355,542.544v1.114l-8.36,0v-1.114h4.177Z" transform="translate(-1560.995 -540.313)" fill="#adaeb5"/>
      <path id="Path_120" data-name="Path 120" d="M1569.412,567.783a.556.556,0,0,1-.557.557h-.287a.566.566,0,0,1-.45-.237.184.184,0,0,1-.024-.027,3.42,3.42,0,0,0-.221-.263l-.015-.015a2.7,2.7,0,0,0-.2-.192l-.032-.032-.012-.013a3.566,3.566,0,0,0-.688-.475c-.018-.01-.03-.019-.05-.029l-.008,0c-.1-.051-.207-.094-.312-.135l-.038-.016,0,0-.066-.026a1.559,1.559,0,0,0-.189-.059l-.133-.035c-.021-.006-.042-.012-.062-.016l-.017,0c-.1-.018-.2-.04-.292-.05h-.018l-.135-.016a3.238,3.238,0,0,0-.361-.021,3.822,3.822,0,0,0-.469.034h-.008l-.036,0c-.042.006-.09.011-.136.022s-.085.016-.127.025l-.079.016-.123.035c-.074.021-.147.045-.22.07-.02.008-.046.013-.064.021l-.029.013a3.268,3.268,0,0,0-.311.135c-.019.009-.036.015-.055.024l-.015.009a3.592,3.592,0,0,0-.43.268l-.065.048c-.075.057-.147.116-.217.177-.047.039-.09.079-.129.118l-.03.03-.025.025-.1.1c-.064.071-.125.146-.183.222l-.006.006a.214.214,0,0,0-.028.032.57.57,0,0,1-.451.237h-.287a.557.557,0,0,1-.557-.557v-7.244l8.349.005Z" transform="translate(-1561.055 -556.081)" fill="#adaeb5"/>
      <rect id="Rectangle_81" data-name="Rectangle 81" width="8.353" height="1.115" transform="translate(0.005 0)" fill="#adaeb5"/>
      <path id="Path_121" data-name="Path 121" d="M1567.3,625.774c0,.408.019,1,.059,1.705a.144.144,0,0,0,0,.019c0,.007,0,.007,0,.01.166,2.813.676,7.37,1.789,9.085a2.882,2.882,0,0,1,.367.8c0,.01.01.017.013.027a.481.481,0,0,0,.045.087.331.331,0,0,0,.116.129.44.44,0,0,0,.073.049.731.731,0,0,0,.174.047c.011,0,.02.006.03.006h.609l0,.935h-.585c-.012,0-.022.006-.035.007a.635.635,0,0,0-.174.048.456.456,0,0,0-.072.049.492.492,0,0,0-.068.06.442.442,0,0,0-.047.071.4.4,0,0,0-.044.088c0,.011-.012.019-.016.031a3.051,3.051,0,0,1-2.339,2.2,2.964,2.964,0,0,1-.4.047c-.007,0-.013,0-.02,0a1.493,1.493,0,0,1-.352,0c-.006,0-.012,0-.019,0a2.9,2.9,0,0,1-.408-.049,3.051,3.051,0,0,1-2.337-2.2c0-.012-.011-.02-.015-.032a.5.5,0,0,0-.23-.265.415.415,0,0,0-.081-.028.439.439,0,0,0-.095-.019c-.011,0-.021-.007-.033-.007h-.585v-.936h.608a.465.465,0,0,0,.161-.033l.038-.016a.477.477,0,0,0,.13-.088.465.465,0,0,0,.088-.131.2.2,0,0,0,.016-.037.274.274,0,0,0,.016-.037,2.883,2.883,0,0,1,.367-.807c.8-1.236,1.292-3.952,1.565-6.426,0-.007,0-.012,0-.019s0-.007,0-.01c.1-.9.168-1.757.213-2.506.046-.765.069-1.418.067-1.853l0-1.958a2.075,2.075,0,0,1,.44-.1.453.453,0,0,0,.061-.006h.008c.065-.006.129-.011.195-.011s.131.006.2.011h.005a.561.561,0,0,0,.06.005l.013,0h-.015c.012,0,.029,0,.045,0a1.671,1.671,0,0,1,.181.031c.066.016.132.036.2.059l.016.005Z" transform="translate(-1562.414 -611.442)" fill="#adaeb5"/>
    </g>
  </g>
</svg>
