<?xml version="1.0" encoding="utf-8"?>
<!-- Generator: Adobe Illustrator 23.0.1, SVG Export Plug-In . SVG Version: 6.00 Build 0)  -->
<svg version="1.1" id="Layer_1" xmlns="http://www.w3.org/2000/svg" xmlns:xlink="http://www.w3.org/1999/xlink" x="0px" y="0px"
	 viewBox="0 0 251.6 419.7" style="enable-background:new 0 0 251.6 419.7;" xml:space="preserve">
<style type="text/css">
	.st0{fill:none;stroke:#000000;stroke-miterlimit:10;}
	.st1{fill:#FFFFFF;}
	.st2{font-family:'PTSans-Bold';}
	.st3{font-size:25.5px;}
	.st4{fill:#EAEFF9;stroke:#6B83DB;stroke-miterlimit:10;}
	.st5{fill:#EAF1F9;stroke:#4059A0;stroke-miterlimit:10;}
	.st6{fill:#F5F8FC;stroke:#4059A0;stroke-miterlimit:10;}
	.st7{fill:#D0DAF4;stroke:#4059A0;stroke-miterlimit:10;}
	.st8{fill:#EAEFF9;stroke:#4059A0;stroke-miterlimit:10;}
	.st9{fill:#EAEFF9;stroke:#4059A0;stroke-width:0.5;stroke-miterlimit:10;}
	.st10{fill:#C4D7F7;}
	.st11{fill:none;stroke:#6B83DB;stroke-width:0.5;stroke-miterlimit:10;}
	.st12{fill:#EAEFF9;}
	.st13{fill:url(#SVGID_1_);stroke:#6B83DB;stroke-width:0.3;stroke-miterlimit:10;}
	.st14{opacity:0.1;fill:#EAF1F9;stroke:#6B83DB;stroke-miterlimit:10;enable-background:new    ;}
	.st15{opacity:0.47;fill:#EAF1F9;stroke:#6B83DB;stroke-miterlimit:10;enable-background:new    ;}
	.st16{opacity:0.57;fill:#EAF1F9;stroke:#6B83DB;stroke-miterlimit:10;enable-background:new    ;}
	.st17{fill:#EAF1F9;stroke:#6B83DB;stroke-miterlimit:10;stroke-opacity:0.4;}
	.st18{fill:#EAF1F9;}
	.st19{opacity:0.28;fill:#CAD2EF;enable-background:new    ;}
	.st20{opacity:0.7;}
	.st21{fill:#C5CDEA;stroke:#6B83DB;stroke-miterlimit:10;}
	.st22{fill:url(#SVGID_2_);stroke:#6B83DB;stroke-width:0.3;stroke-miterlimit:10;}
	.st23{opacity:0.8;fill:#EAF1F9;enable-background:new    ;}
	.st24{fill:#EAF1F9;stroke:#6B83DB;stroke-miterlimit:10;}
	.st25{fill:#C6DDF4;stroke:#6B83DB;stroke-miterlimit:10;}
	.st26{fill:#E9ECFF;stroke:#6B83DB;stroke-miterlimit:10;}
	.st27{enable-background:new    ;}
</style>
<g>
	<path class="st0" d="M223.5,383.5v36.2 M223.5,381.4v36.2 M231.4,411.2h-36.2"/>
	<text transform="matrix(1.17 0 0 1 82.6001 249)" class="st1 st2 st3">Analysers</text>
	<path class="st0" d="M9.4,140.3v-36.2 M9.4,142.5v-36.3 M0,112.6h42.6"/>
	<path class="st4" d="M19.8,121.4h134.3v149H19.9C19.9,270.4,19.8,121.4,19.8,121.4z"/>
	<path class="st5" d="M62.8,142.8h150.3v258.6H62.6L62.8,142.8L62.8,142.8z"/>
	<path class="st6" d="M20.4,121.6l42.4,21h149.3l-57.4-21.5h-134c-0.1,0.1-0.2,0.3-0.1,0.4l0.1,0.1L20.4,121.6L20.4,121.6z"/>
	<path class="st7" d="M19.5,121.6v249l43,30.8V142l-42-20.9C20.1,121,19.6,121.2,19.5,121.6z"/>
	<path class="st8" d="M70.1,34v94"/>
	<ellipse class="st8" cx="75.7" cy="127.6" rx="5.5" ry="1.3"/>
	<ellipse class="st9" cx="75.7" cy="47.3" rx="5.5" ry="1.1"/>
	<ellipse class="st9" cx="75.7" cy="59.4" rx="5.5" ry="1.3"/>
	<path class="st8" d="M81.2,127.2V34"/>
	<path class="st10" d="M92.3,19.2H59.1l4.3-6H88L92.3,19.2z"/>
	<ellipse class="st11" cx="75.7" cy="12.8" rx="12.3" ry="0.5"/>
	<ellipse class="st11" cx="75.7" cy="19.4" rx="17.2" ry="0.5"/>
	<path class="st10" d="M94.8,7.9L56.4,7.6L61.3,0h28.5L94.8,7.9z"/>
	<ellipse class="st11" cx="75.7" cy="7.8" rx="20" ry="0.8"/>
	<path class="st8" d="M129.1,93.4v34"/>
	<ellipse class="st8" cx="135.6" cy="127.4" rx="6.5" ry="1.6"/>
	<ellipse class="st9" cx="135.6" cy="93.1" rx="6.8" ry="0.5"/>
	<ellipse class="st9" cx="135.6" cy="98.1" rx="6.5" ry="0.5"/>
	<ellipse class="st9" cx="135.6" cy="102.5" rx="6.5" ry="0.5"/>
	<path class="st8" d="M142.1,127.2v-34"/>
	<path class="st12" d="M143.9,89.7h-16.6l2.2-3.4h12.3L143.9,89.7L143.9,89.7z"/>
	<ellipse class="st11" cx="135.6" cy="86" rx="6.1" ry="0.3"/>
	<ellipse class="st11" cx="135.6" cy="90" rx="8.6" ry="0.3"/>
	<path class="st12" d="M145.1,83.2l-19.4-0.3l2.5-4.4h14.4C142.6,78.5,145.1,83.2,145.1,83.2z"/>
	<ellipse class="st11" cx="135.6" cy="78.2" rx="7.1" ry="0.5"/>
	<ellipse class="st11" cx="135.6" cy="83.2" rx="9.8" ry="0.5"/>
	
		<linearGradient id="SVGID_1_" gradientUnits="userSpaceOnUse" x1="4708.1001" y1="4976.5" x2="4708.1001" y2="5013.5" gradientTransform="matrix(1 0 0 1 -4696.8999 -4869.7998)">
		<stop  offset="0" style="stop-color:#FFFFFF"/>
		<stop  offset="0.1" style="stop-color:#F2F9F9"/>
		<stop  offset="0.3" style="stop-color:#D6ECEC"/>
		<stop  offset="0.5" style="stop-color:#CCE7E7"/>
		<stop  offset="0.5" style="stop-color:#D1E7E5"/>
		<stop  offset="0.7" style="stop-color:#E4E6DC"/>
		<stop  offset="0.8" style="stop-color:#EFE6D7"/>
		<stop  offset="1" style="stop-color:#F3E6D5"/>
	</linearGradient>
	<path class="st13" d="M11.2,106.7v37"/>
	<path class="st14" d="M154.1,121.2v150l59.2,30.7L213,142.3l-59-21.2 M19.8,199.6h192.6"/>
	<path class="st15" d="M79.4,166.9h12.9v121.3H79.1L79.4,166.9L79.4,166.9z"/>
	<ellipse class="st16" cx="85.5" cy="167.1" rx="6.5" ry="2.4"/>
	<ellipse class="st16" cx="85.5" cy="162.4" rx="6.5" ry="2.4"/>
	<ellipse class="st16" cx="85.5" cy="288.2" rx="6.5" ry="2.4"/>
	<path class="st15" d="M80.1,163.8h13.1v120.8H80.1V163.8z"/>
	<ellipse class="st16" cx="86.8" cy="163.7" rx="6.5" ry="2.4"/>
	<ellipse class="st16" cx="86.5" cy="158.8" rx="6.5" ry="2.4"/>
	<ellipse class="st16" cx="86.8" cy="284.8" rx="6.5" ry="2.4"/>
	<path class="st17" d="M68.1,283.8h76.4v57.5H67.7L68.1,283.8z"/>
	<path class="st18" d="M160.5,158v51.8l16.3,11.5"/>
	<path class="st16" d="M144.8,199.1h42.7v41h-43L144.8,199.1z"/>
	<path class="st16" d="M160.5,227.6h43v41.3h-43V227.6L160.5,227.6z"/>
	<path class="st19" d="M71.1,227h33.8v101.5H71.1V227z M169.4,155.1h34v30.1h-33.7L169.4,155.1z"/>
	<path class="st19" d="M102.4,270.1h33.8v101.4h-33.8V270.2C102.4,270.2,102.4,270.1,102.4,270.1z M163.1,356.5h34.1v30h-33.8
		L163.1,356.5z M130.7,297.5h34.1v30H131L130.7,297.5L130.7,297.5z M70.1,209.5H104v29.8H70.1L70.1,209.5L70.1,209.5z"/>
	<path class="st19" d="M88,189.6h33.8v29.6H88V189.6z"/>
	<path class="st19" d="M64.7,171.1h77v48.1h-77V171.1z"/>
	<path class="st19" d="M109.1,164.8h77.2v48.1h-77.2L109.1,164.8L109.1,164.8z"/>
	<path class="st19" d="M122.4,192.2h57.7v36.1h-58L122.4,192.2L122.4,192.2z"/>
	<path class="st19" d="M85.2,209.8H143v36H85.5L85.2,209.8z"/>
	<path class="st19" d="M68.1,203.2h57.4v36h-58L68.1,203.2z M68.1,147.2h57.4v36h-58L68.1,147.2z"/>
	<path class="st15" d="M115.1,187h13.1v100.2h-13.1V187z"/>
	<ellipse class="st16" cx="121.8" cy="187" rx="6.5" ry="2.1"/>
	<ellipse class="st16" cx="121.5" cy="183.1" rx="6.5" ry="2.1"/>
	<ellipse class="st16" cx="121.8" cy="287.4" rx="6.5" ry="2.1"/>
	<g class="st20">
		<path class="st15" d="M116,182.9h12.9v100.3h-12.6L116,182.9L116,182.9z"/>
		<ellipse class="st16" cx="122.4" cy="182.8" rx="6.5" ry="2.1"/>
		<ellipse class="st16" cx="122.4" cy="178.9" rx="6.5" ry="2.1"/>
		<ellipse class="st16" cx="122.4" cy="283.3" rx="6.5" ry="2.1"/>
	</g>
	<path class="st19" d="M114.1,160.1h43v41.3h-43v-41.2C114.1,160.2,114.1,160.1,114.1,160.1z"/>
	<ellipse class="st21" cx="33" cy="175.8" rx="2.1" ry="6.5"/>
	
		<linearGradient id="SVGID_2_" gradientUnits="userSpaceOnUse" x1="4799.8999" y1="4986.7002" x2="4852.5" y2="4986.7002" gradientTransform="matrix(1 0 0 1 -4696.8999 -4869.7998)">
		<stop  offset="0" style="stop-color:#FFFFFF"/>
		<stop  offset="0.1" style="stop-color:#F2F9F9"/>
		<stop  offset="0.3" style="stop-color:#D6ECEC"/>
		<stop  offset="0.5" style="stop-color:#CCE7E7"/>
		<stop  offset="0.5" style="stop-color:#D1E7E5"/>
		<stop  offset="0.7" style="stop-color:#E4E6DC"/>
		<stop  offset="0.8" style="stop-color:#EFE6D7"/>
		<stop  offset="1" style="stop-color:#F3E6D5"/>
	</linearGradient>
	<path class="st22" d="M103.1,116.9h52.5"/>
	<path class="st9" d="M68.1,22.5h14.7c0,0,2.1,0,0,4s-2.5,3.9-2.2,7.8H70.5c0.1-2.8-0.8-5.6-2.5-7.9C65.9,22.5,68,22.5,68.1,22.5z"
		/>
	<ellipse class="st11" cx="75.4" cy="22.8" rx="8" ry="0.5"/>
	<path class="st23" d="M105.5,176h96.8v115.2h-97.2L105.5,176L105.5,176z"/>
	<path class="st24" d="M100,164.2h80.5v49H100V164.2z"/>
	<path class="st25" d="M100,211.4h80.5v1.8H100V211.4z"/>
	<path class="st26" d="M180.1,212.4l-2.8-1.6v-46.3h2.8V212.4z"/>
	<g class="st27">
		<path d="M124.2,295.6h-2.6l-0.6,1.9h-1.6l3-8.5h1.2l3,8.5h-1.7C124.9,297.5,124.2,295.6,124.2,295.6z M122,294.3h1.8l-0.6-1.9
			l-0.3-1.3h-0.1l-0.3,1.3L122,294.3z M130.9,297.5v-3.4l-0.2-1.1c-0.1-0.2-0.4-0.3-0.7-0.3s-0.5,0.1-0.8,0.3
			c-0.2,0.2-0.4,0.4-0.4,0.6v3.9h-1.6v-6h1.2l0.2,0.8l0.7-0.7c0.3-0.2,0.7-0.3,1.2-0.3l0.8,0.1l0.6,0.4l0.4,0.8l0.1,1.2v3.7H130.9
			L130.9,297.5z M133.7,291.8c0.3-0.1,0.7-0.3,1.1-0.3l1.4-0.1c0.4,0,0.8,0,1,0.2l0.7,0.4c0.2,0.2,0.3,0.4,0.3,0.7l0.1,0.9v3.1
			l0.2,0.9h-1.3l-0.3-0.8h0.1c-0.2,0.2-0.4,0.5-0.7,0.6c-0.3,0.2-0.6,0.3-1.1,0.3l-0.8-0.1l-0.6-0.4l-0.4-0.6l-0.1-0.7l0.2-0.9
			c0.1-0.2,0.4-0.5,0.7-0.6c0.3-0.2,0.7-0.3,1.1-0.3l1.4-0.1c0.1-0.4,0-0.8-0.1-1s-0.4-0.3-0.8-0.3l-1,0.1l-0.9,0.3L133.7,291.8
			L133.7,291.8z M135.7,296.3l0.7-0.2l0.4-0.4v-0.8h-0.7l-0.6,0.1l-0.4,0.2l-0.2,0.4l0.2,0.5L135.7,296.3L135.7,296.3z M141.3,295.5
			l0.1,0.6l0.3,0.2h0.3l0.3-0.1l0.2,1.2l-0.6,0.2l-0.8,0.1c-0.5,0-0.8-0.1-1-0.3c-0.2-0.2-0.4-0.6-0.4-1v-7.2h1.6L141.3,295.5
			L141.3,295.5z M145.4,294.9l0.2,0.9h0.1l0.2-0.9l0.9-3.4h1.6l-1.8,5.4l-0.4,1.2l-0.5,1l-0.6,0.6l-0.7,0.2l-1-0.2l0.3-1.2l0.4,0.1
			l0.5-0.2l0.4-0.8l-2.5-6h1.9L145.4,294.9L145.4,294.9z"/>
	</g>
	<g class="st27">
		<path d="M148.7,296.2l2.4-2.8l0.6-0.5h-3v-1.3h4.7v1.3l-2.3,2.9l-0.6,0.5h2.9v1.3h-4.7L148.7,296.2L148.7,296.2z"/>
	</g>
	<g class="st27">
		<path d="M159.2,297l-1,0.5l-1.3,0.2c-1,0-1.7-0.3-2.1-0.8c-0.5-0.7-0.7-1.5-0.7-2.3c0-1.1,0.3-1.8,0.8-2.4s1.2-0.8,2.1-0.8
			l0.9,0.1l0.8,0.4l0.5,0.7l0.2,1.2v0.5l-0.1,0.6h-3.6c0,0.5,0.2,0.9,0.4,1.1c0.2,0.3,0.6,0.4,1.1,0.4c0.3,0,0.6,0,0.9-0.2l0.6-0.3
			L159.2,297L159.2,297z M157,292.6c-0.4,0-0.7,0.1-0.9,0.4l-0.4,1h2.2c0-0.4,0-0.8-0.2-1C157.6,292.7,157.3,292.6,157,292.6
			L157,292.6z M163.8,293l-0.7-0.1l-0.7,0.2c-0.2,0.1-0.3,0.3-0.4,0.6v3.9h-1.6v-6h1.2l0.2,0.8c0.1-0.3,0.3-0.5,0.6-0.7
			s0.5-0.2,0.8-0.2l0.7,0.1L163.8,293L163.8,293z"/>
	</g>
</g>
</svg>
