<?xml version="1.0" encoding="UTF-8" standalone="no"?>
<svg
   xmlns:cdml="http://www.freesoftware.fsf.org/bkchem/cdml"
   xmlns:dc="http://purl.org/dc/elements/1.1/"
   xmlns:cc="http://creativecommons.org/ns#"
   xmlns:rdf="http://www.w3.org/1999/02/22-rdf-syntax-ns#"
   xmlns:svg="http://www.w3.org/2000/svg"
   xmlns="http://www.w3.org/2000/svg"
   xmlns:sodipodi="http://sodipodi.sourceforge.net/DTD/sodipodi-0.dtd"
   xmlns:inkscape="http://www.inkscape.org/namespaces/inkscape"
   height="43.922009mm"
   version="1.0"
   viewBox="0 0 590.1654 165.92759"
   width="156.28592mm"
   id="svg5220"
   sodipodi:docname="hairpin6.svg"
   inkscape:version="0.92.2 2405546, 2018-03-11">
  <metadata
     id="metadata5226">
    <rdf:RDF>
      <cc:Work
         rdf:about="">
        <dc:format>image/svg+xml</dc:format>
        <dc:type
           rdf:resource="http://purl.org/dc/dcmitype/StillImage" />
        <dc:title></dc:title>
      </cc:Work>
    </rdf:RDF>
  </metadata>
  <defs
     id="defs5224" />
  <sodipodi:namedview
     pagecolor="#ffffff"
     bordercolor="#666666"
     borderopacity="1"
     objecttolerance="10"
     gridtolerance="10"
     guidetolerance="10"
     inkscape:pageopacity="0"
     inkscape:pageshadow="2"
     inkscape:window-width="1440"
     inkscape:window-height="839"
     id="namedview5222"
     showgrid="false"
     fit-margin-top="0"
     fit-margin-left="0"
     fit-margin-right="0"
     fit-margin-bottom="0"
     inkscape:zoom="0.53896605"
     inkscape:cx="363.04006"
     inkscape:cy="-385.98511"
     inkscape:window-x="0"
     inkscape:window-y="0"
     inkscape:window-maximized="1"
     inkscape:current-layer="svg5220" />
  <g
     font-size="12pt"
     id="g5218"
     style="font-size:16px;font-family:Helvetica;stroke-linecap:round"
     transform="translate(-33.794686,-9.2660003)">
    <g
       id="g4894"
       style="stroke:#000000;stroke-width:1">
      <line
         x1="309.01001"
         x2="325"
         y1="121.77"
         y2="131"
         id="line4892" />
    </g>
    <g
       id="g4898"
       style="stroke:#000000;stroke-width:1">
      <line
         x1="561.02002"
         x2="583.92999"
         y1="135"
         y2="121.77"
         id="line4896" />
    </g>
    <g
       id="g4914"
       style="stroke:#000000;stroke-width:1">
      <line
         x1="103.61"
         x2="102.03"
         y1="138.78"
         y2="138.78"
         id="line4900" />
      <line
         x1="103.89"
         x2="101.75"
         y1="142.56"
         y2="142.56"
         id="line4902" />
      <line
         x1="104.18"
         x2="101.46"
         y1="146.34"
         y2="146.34"
         id="line4904" />
      <line
         x1="104.46"
         x2="101.18"
         y1="150.12"
         y2="150.12"
         id="line4906" />
      <line
         x1="104.75"
         x2="100.89"
         y1="153.89999"
         y2="153.89999"
         id="line4908" />
      <line
         x1="105.03"
         x2="100.61"
         y1="157.67999"
         y2="157.67999"
         id="line4910" />
      <line
         x1="105.32"
         x2="100.32"
         y1="161.46001"
         y2="161.46001"
         id="line4912" />
    </g>
    <g
       id="g4918"
       style="stroke:#000000;stroke-width:1">
      <line
         x1="583.92999"
         x2="600"
         y1="121.77"
         y2="131.05"
         id="line4916" />
    </g>
    <g
       id="g4922"
       style="stroke:#000000;stroke-width:1">
      <polygon
         points="174.05,95.31 172.05,121.77 171.05,121.77 169.05,95.31 "
         id="polygon4920"
         style="fill:#000000;stroke:#000000" />
    </g>
    <g
       id="g4928"
       style="stroke:#000000;stroke-width:1">
      <line
         x1="307.01001"
         x2="307.01001"
         y1="121.77"
         y2="100"
         id="line4924" />
      <line
         x1="311.01001"
         x2="311.01001"
         y1="121.77"
         y2="100"
         id="line4926" />
    </g>
    <g
       id="g4932"
       style="stroke:#000000;stroke-width:1">
      <line
         x1="156"
         x2="171.55"
         y1="130.75"
         y2="121.77"
         id="line4930" />
    </g>
    <g
       id="g4936"
       style="stroke:#000000;stroke-width:1">
      <line
         x1="286.10001"
         x2="263.19"
         y1="161.46001"
         y2="174.69"
         id="line4934" />
    </g>
    <g
       id="g4940"
       style="stroke:#000000;stroke-width:1">
      <polygon
         points="357.33,95.31 355.33,121.77 354.33,121.77 352.33,95.31 "
         id="polygon4938"
         style="fill:#000000;stroke:#000000" />
    </g>
    <g
       id="g4944"
       style="stroke:#000000;stroke-width:1">
      <line
         x1="431"
         x2="446.47"
         y1="130.7"
         y2="121.77"
         id="line4942" />
    </g>
    <g
       id="g4948"
       style="stroke:#000000;stroke-width:1">
      <line
         x1="339"
         x2="354.82999"
         y1="130.91"
         y2="121.77"
         id="line4946" />
    </g>
    <g
       id="g4952"
       style="stroke:#000000;stroke-width:1;stroke-linecap:butt">
      <line
         x1="423.56"
         x2="423.56"
         y1="140"
         y2="153"
         id="line4950" />
    </g>
    <g
       id="g4956"
       style="stroke:#000000;stroke-width:1">
      <line
         x1="538.10999"
         x2="551.34003"
         y1="95.309998"
         y2="72.400002"
         id="line4954" />
    </g>
    <g
       id="g4960"
       style="stroke:#000000;stroke-width:1">
      <line
         x1="446.47"
         x2="469.38"
         y1="121.77"
         y2="135"
         id="line4958" />
    </g>
    <g
       id="g4964"
       style="stroke:#000000;stroke-width:1">
      <polygon
         points="82.41,95.31 80.41,121.77 79.41,121.77 77.41,95.31 "
         id="polygon4962"
         style="fill:#000000;stroke:#000000" />
    </g>
    <g
       id="g4980"
       style="stroke:#000000;stroke-width:1">
      <line
         x1="470.17001"
         x2="468.59"
         y1="138.78"
         y2="138.78"
         id="line4966" />
      <line
         x1="470.45001"
         x2="468.31"
         y1="142.56"
         y2="142.56"
         id="line4968" />
      <line
         x1="470.73999"
         x2="468.01999"
         y1="146.34"
         y2="146.34"
         id="line4970" />
      <line
         x1="471.01999"
         x2="467.73999"
         y1="150.12"
         y2="150.12"
         id="line4972" />
      <line
         x1="471.31"
         x2="467.45001"
         y1="153.89999"
         y2="153.89999"
         id="line4974" />
      <line
         x1="471.59"
         x2="467.17001"
         y1="157.67999"
         y2="157.67999"
         id="line4976" />
      <line
         x1="471.88"
         x2="466.88"
         y1="161.46001"
         y2="161.46001"
         id="line4978" />
    </g>
    <g
       id="g4984"
       style="stroke:#000000;stroke-width:1">
      <line
         x1="247"
         x2="263.19"
         y1="131.12"
         y2="121.77"
         id="line4982" />
    </g>
    <g
       id="g4988"
       style="stroke:#000000;stroke-width:1">
      <line
         x1="551.34003"
         x2="577.79999"
         y1="72.400002"
         y2="72.400002"
         id="line4986" />
    </g>
    <g
       id="g4992"
       style="stroke:#000000;stroke-width:1">
      <line
         x1="377.73999"
         x2="400.64999"
         y1="55.619999"
         y2="42.389999"
         id="line4990" />
    </g>
    <g
       id="g4996"
       style="stroke:#000000;stroke-width:1">
      <line
         x1="469.38"
         x2="492.29001"
         y1="135"
         y2="121.77"
         id="line4994" />
    </g>
    <g
       id="g5000"
       style="stroke:#000000;stroke-width:1">
      <line
         x1="522"
         x2="538.10999"
         y1="131.07001"
         y2="121.77"
         id="line4998" />
    </g>
    <g
       id="g5004"
       style="stroke:#000000;stroke-width:1;stroke-linecap:butt">
      <line
         x1="515.20001"
         x2="515.20001"
         y1="140"
         y2="153"
         id="line5002" />
    </g>
    <g
       id="g5010"
       style="stroke:#000000;stroke-width:1">
      <line
         x1="490.29001"
         x2="490.29001"
         y1="121.77"
         y2="100"
         id="line5006" />
      <line
         x1="494.29001"
         x2="494.29001"
         y1="121.77"
         y2="100"
         id="line5008" />
    </g>
    <g
       id="g5014"
       style="stroke:#000000;stroke-width:1">
      <line
         x1="79.910004"
         x2="102.82"
         y1="121.77"
         y2="135"
         id="line5012" />
    </g>
    <g
       id="g5018"
       style="stroke:#000000;stroke-width:1">
      <line
         x1="492.29001"
         x2="508"
         y1="121.77"
         y2="130.84"
         id="line5016" />
    </g>
    <g
       id="g5022"
       style="stroke:#000000;stroke-width:1">
      <line
         x1="171.55"
         x2="194.46001"
         y1="95.309998"
         y2="82.080002"
         id="line5020" />
    </g>
    <g
       id="g5026"
       style="stroke:#000000;stroke-width:1">
      <line
         x1="354.82999"
         x2="377.73999"
         y1="95.309998"
         y2="82.080002"
         id="line5024" />
    </g>
    <g
       id="g5030"
       style="stroke:#000000;stroke-width:1">
      <line
         x1="551.34003"
         x2="538.10999"
         y1="72.400002"
         y2="49.490002"
         id="line5028" />
    </g>
    <g
       id="g5034"
       style="stroke:#000000;stroke-width:1">
      <line
         x1="194.46001"
         x2="217.37"
         y1="135"
         y2="121.77"
         id="line5032" />
    </g>
    <g
       id="g5038"
       style="stroke:#000000;stroke-width:1">
      <line
         x1="400.64999"
         x2="400.64999"
         y1="42.389999"
         y2="21"
         id="line5036" />
    </g>
    <g
       id="g5044"
       style="stroke:#000000;stroke-width:1">
      <line
         x1="123.73"
         x2="123.73"
         y1="121.77"
         y2="100"
         id="line5040" />
      <line
         x1="127.73"
         x2="127.73"
         y1="121.77"
         y2="100"
         id="line5042" />
    </g>
    <g
       id="g5048"
       style="stroke:#000000;stroke-width:1">
      <line
         x1="171.55"
         x2="194.46001"
         y1="121.77"
         y2="135"
         id="line5046" />
    </g>
    <g
       id="g5052"
       style="stroke:#000000;stroke-width:1">
      <line
         x1="64"
         x2="79.910004"
         y1="130.96001"
         y2="121.77"
         id="line5050" />
    </g>
    <g
       id="g5056"
       style="stroke:#000000;stroke-width:1">
      <line
         x1="171.55"
         x2="148.64"
         y1="95.309998"
         y2="82.080002"
         id="line5054" />
    </g>
    <g
       id="g5060"
       style="stroke:#000000;stroke-width:1">
      <polygon
         points="283.6,161.46 285.6,135 286.6,135 288.6,161.46 "
         id="polygon5058"
         style="fill:#000000;stroke:#000000" />
    </g>
    <g
       id="g5064"
       style="stroke:#000000;stroke-width:1">
      <line
         x1="354.82999"
         x2="377.73999"
         y1="121.77"
         y2="135"
         id="line5062" />
    </g>
    <g
       id="g5070"
       style="stroke:#000000;stroke-width:1">
      <line
         x1="215.37"
         x2="215.37"
         y1="121.77"
         y2="100"
         id="line5066" />
      <line
         x1="219.37"
         x2="219.37"
         y1="121.77"
         y2="100"
         id="line5068" />
    </g>
    <g
       id="g5074"
       style="stroke:#000000;stroke-width:1">
      <line
         x1="400.64999"
         x2="417"
         y1="121.77"
         y2="131.21001"
         id="line5072" />
    </g>
    <g
       id="g5078"
       style="stroke:#000000;stroke-width:1">
      <line
         x1="217.37"
         x2="233"
         y1="121.77"
         y2="130.8"
         id="line5076" />
    </g>
    <g
       id="g5082"
       style="stroke:#000000;stroke-width:1;stroke-linecap:butt">
      <line
         x1="148.64"
         x2="148.64"
         y1="140"
         y2="153"
         id="line5080" />
    </g>
    <g
       id="g5086"
       style="stroke:#000000;stroke-width:1">
      <line
         x1="538.10999"
         x2="561.02002"
         y1="121.77"
         y2="135"
         id="line5084" />
    </g>
    <g
       id="g5092"
       style="stroke:#000000;stroke-width:1">
      <line
         x1="581.92999"
         x2="581.92999"
         y1="121.77"
         y2="100"
         id="line5088" />
      <line
         x1="585.92999"
         x2="585.92999"
         y1="121.77"
         y2="100"
         id="line5090" />
    </g>
    <g
       id="g5096"
       style="stroke:#000000;stroke-width:1">
      <line
         x1="286.10001"
         x2="309.01001"
         y1="161.46001"
         y2="174.69"
         id="line5094" />
    </g>
    <g
       id="g5102"
       style="stroke:#000000;stroke-width:1">
      <line
         x1="398.64999"
         x2="398.64999"
         y1="121.77"
         y2="100"
         id="line5098" />
      <line
         x1="402.64999"
         x2="402.64999"
         y1="121.77"
         y2="100"
         id="line5100" />
    </g>
    <g
       id="g5118"
       style="stroke:#000000;stroke-width:1">
      <line
         x1="195.25"
         x2="193.67"
         y1="138.78"
         y2="138.78"
         id="line5104" />
      <line
         x1="195.53"
         x2="193.39"
         y1="142.56"
         y2="142.56"
         id="line5106" />
      <line
         x1="195.82001"
         x2="193.10001"
         y1="146.34"
         y2="146.34"
         id="line5108" />
      <line
         x1="196.10001"
         x2="192.82001"
         y1="150.12"
         y2="150.12"
         id="line5110" />
      <line
         x1="196.39"
         x2="192.53"
         y1="153.89999"
         y2="153.89999"
         id="line5112" />
      <line
         x1="196.67"
         x2="192.25"
         y1="157.67999"
         y2="157.67999"
         id="line5114" />
      <line
         x1="196.96001"
         x2="191.96001"
         y1="161.46001"
         y2="161.46001"
         id="line5116" />
    </g>
    <g
       id="g5134"
       style="stroke:#000000;stroke-width:1">
      <line
         x1="561.81"
         x2="560.22998"
         y1="138.78"
         y2="138.78"
         id="line5120" />
      <line
         x1="562.09003"
         x2="559.95001"
         y1="142.56"
         y2="142.56"
         id="line5122" />
      <line
         x1="562.38"
         x2="559.65997"
         y1="146.34"
         y2="146.34"
         id="line5124" />
      <line
         x1="562.65997"
         x2="559.38"
         y1="150.12"
         y2="150.12"
         id="line5126" />
      <line
         x1="562.95001"
         x2="559.09003"
         y1="153.89999"
         y2="153.89999"
         id="line5128" />
      <line
         x1="563.22998"
         x2="558.81"
         y1="157.67999"
         y2="157.67999"
         id="line5130" />
      <line
         x1="563.52002"
         x2="558.52002"
         y1="161.46001"
         y2="161.46001"
         id="line5132" />
    </g>
    <g
       id="g5138"
       style="stroke:#000000;stroke-width:1;stroke-linecap:butt">
      <line
         x1="240.28"
         x2="240.28"
         y1="140"
         y2="153"
         id="line5136" />
    </g>
    <g
       id="g5142"
       style="stroke:#000000;stroke-width:1">
      <polygon
         points="448.97,95.31 446.97,121.77 445.97,121.77 443.97,95.31 "
         id="polygon5140"
         style="fill:#000000;stroke:#000000" />
    </g>
    <g
       id="g5146"
       style="stroke:#000000;stroke-width:1">
      <line
         x1="263.19"
         x2="286.10001"
         y1="121.77"
         y2="135"
         id="line5144" />
    </g>
    <g
       id="g5150"
       style="stroke:#000000;stroke-width:1">
      <line
         x1="102.82"
         x2="125.73"
         y1="135"
         y2="121.77"
         id="line5148" />
    </g>
    <g
       id="g5154"
       style="stroke:#000000;stroke-width:1">
      <polygon
         points="540.61,95.31 538.61,121.77 537.61,121.77 535.61,95.31 "
         id="polygon5152"
         style="fill:#000000;stroke:#000000" />
    </g>
    <g
       id="g5158"
       style="stroke:#000000;stroke-width:1">
      <line
         x1="377.73999"
         x2="377.73999"
         y1="82.080002"
         y2="55.619999"
         id="line5156" />
    </g>
    <g
       id="g5162"
       style="stroke:#000000;stroke-width:1">
      <line
         x1="286.10001"
         x2="309.01001"
         y1="135"
         y2="121.77"
         id="line5160" />
    </g>
    <g
       id="g5166"
       style="stroke:#000000;stroke-width:1">
      <line
         x1="125.73"
         x2="142"
         y1="121.77"
         y2="131.17"
         id="line5164" />
    </g>
    <g
       id="g5170"
       style="stroke:#000000;stroke-width:1">
      <line
         x1="377.73999"
         x2="400.64999"
         y1="135"
         y2="121.77"
         id="line5168" />
    </g>
    <g
       id="g5174"
       style="stroke:#000000;stroke-width:1;stroke-linecap:butt">
      <line
         x1="331.92001"
         x2="331.92001"
         y1="140"
         y2="153"
         id="line5172" />
    </g>
    <text
       font-size="12pt"
       x="32.299999"
       y="140"
       id="text5178"
       style="font-size:16px;font-family:helvetica;fill:#000000">H<tspan
   baseline-shift="sub"
   font-size="75%"
   id="tspan5176"
   style="font-size:75%;baseline-shift:sub">2</tspan>
N</text>
    <text
       font-size="12pt"
       x="143.3"
       y="140"
       id="text5180"
       style="font-size:16px;font-family:helvetica;fill:#000000">N</text>
    <text
       font-size="12pt"
       x="234.3"
       y="140"
       id="text5182"
       style="font-size:16px;font-family:helvetica;fill:#000000">N</text>
    <text
       font-size="12pt"
       x="326.29999"
       y="140"
       id="text5184"
       style="font-size:16px;font-family:helvetica;fill:#000000">N</text>
    <text
       font-size="12pt"
       x="418.29999"
       y="140"
       id="text5186"
       style="font-size:16px;font-family:helvetica;fill:#000000">N</text>
    <text
       font-size="12pt"
       x="509.29999"
       y="140"
       id="text5188"
       style="font-size:16px;font-family:helvetica;fill:#000000">N</text>
    <text
       font-size="12pt"
       x="601.29999"
       y="140"
       id="text5190"
       style="font-size:16px;font-family:helvetica;fill:#000000">OH</text>
    <text
       font-size="12pt"
       x="578.29999"
       y="100.31"
       id="text5192"
       style="font-size:16px;font-family:helvetica;fill:#000000">O</text>
    <text
       font-size="12pt"
       x="486.29999"
       y="100.31"
       id="text5194"
       style="font-size:16px;font-family:helvetica;fill:#000000">O</text>
    <text
       font-size="12pt"
       x="395.29999"
       y="100.31"
       id="text5196"
       style="font-size:16px;font-family:helvetica;fill:#000000">O</text>
    <text
       font-size="12pt"
       x="303.29999"
       y="100.31"
       id="text5198"
       style="font-size:16px;font-family:helvetica;fill:#000000">O</text>
    <text
       font-size="12pt"
       x="211.3"
       y="100.31"
       id="text5200"
       style="font-size:16px;font-family:helvetica;fill:#000000">O</text>
    <text
       font-size="12pt"
       x="120.3"
       y="100.31"
       id="text5202"
       style="font-size:16px;font-family:helvetica;fill:#000000">O</text>
    <text
       font-size="12pt"
       x="143.3"
       y="166.46001"
       id="text5204"
       style="font-size:16px;font-family:helvetica;fill:#000000">H</text>
    <text
       font-size="12pt"
       x="234.3"
       y="166.46001"
       id="text5206"
       style="font-size:16px;font-family:helvetica;fill:#000000">H</text>
    <text
       font-size="12pt"
       x="326.29999"
       y="166.46001"
       id="text5208"
       style="font-size:16px;font-family:helvetica;fill:#000000">H</text>
    <text
       font-size="12pt"
       x="418.29999"
       y="166.46001"
       id="text5210"
       style="font-size:16px;font-family:helvetica;fill:#000000">H</text>
    <text
       font-size="12pt"
       x="509.29999"
       y="166.46001"
       id="text5212"
       style="font-size:16px;font-family:helvetica;fill:#000000">H</text>
    <text
       font-size="12pt"
       x="395.29999"
       y="20.93"
       id="text5216"
       style="font-size:16px;font-family:helvetica;fill:#000000">NH<tspan
   baseline-shift="sub"
   font-size="75%"
   id="tspan5214"
   style="font-size:75%;baseline-shift:sub">2</tspan>
</text>
  </g>
  <cdml:cdml
     version="0.16">
    <cdml:info>
      <cdml:author_program
         version="0.14.0-pre2">BKChem</cdml:author_program>
    </cdml:info>
    <cdml:paper
       crop_margin="10"
       crop_svg="0"
       orientation="portrait"
       replace_minus="0"
       type="A4"
       use_real_minus="0" />
    <cdml:viewport
       viewport="0.000000 0.000000 640.000000 480.000000" />
    <cdml:standard
       area_color=""
       font_family="helvetica"
       font_size="12"
       line_color="#000"
       line_width="1px"
       paper_crop_margin="10"
       paper_crop_svg="0"
       paper_orientation="portrait"
       paper_type="A4">
      <cdml:bond
         double-ratio="0.75"
         length="0.7cm"
         wedge-width="5px"
         width="6px" />
      <cdml:arrow
         length="1.6cm" />
      <cdml:atom
         show_hydrogens="0" />
    </cdml:standard>
    <cdml:molecule
       id="molecule36238"
       name="">
      <cdml:atom
         id="atom94602"
         name="C"
         valency="4">
        <cdml:point
           x="2.114cm"
           y="3.222cm" />
      </cdml:atom>
      <cdml:atom
         id="atom31768"
         name="C"
         valency="4">
        <cdml:point
           x="2.720cm"
           y="3.572cm" />
      </cdml:atom>
      <cdml:atom
         id="atom83792"
         name="C"
         valency="4">
        <cdml:point
           x="3.327cm"
           y="3.222cm" />
      </cdml:atom>
      <cdml:atom
         id="atom62594"
         name="C"
         valency="4">
        <cdml:point
           x="4.539cm"
           y="3.222cm" />
      </cdml:atom>
      <cdml:atom
         id="atom13256"
         name="C"
         valency="4">
        <cdml:point
           x="5.145cm"
           y="3.572cm" />
      </cdml:atom>
      <cdml:atom
         id="atom290"
         name="C"
         valency="4">
        <cdml:point
           x="5.751cm"
           y="3.222cm" />
      </cdml:atom>
      <cdml:atom
         id="atom12096"
         name="C"
         valency="4">
        <cdml:point
           x="6.964cm"
           y="3.222cm" />
      </cdml:atom>
      <cdml:atom
         id="atom72971"
         name="C"
         valency="4">
        <cdml:point
           x="7.570cm"
           y="3.572cm" />
      </cdml:atom>
      <cdml:atom
         id="atom16359"
         name="C"
         valency="4">
        <cdml:point
           x="8.176cm"
           y="3.222cm" />
      </cdml:atom>
      <cdml:atom
         id="atom1425"
         name="C"
         valency="4">
        <cdml:point
           x="9.388cm"
           y="3.222cm" />
      </cdml:atom>
      <cdml:atom
         id="atom71953"
         name="C"
         valency="4">
        <cdml:point
           x="9.994cm"
           y="3.572cm" />
      </cdml:atom>
      <cdml:atom
         id="atom26341"
         name="C"
         valency="4">
        <cdml:point
           x="10.601cm"
           y="3.222cm" />
      </cdml:atom>
      <cdml:atom
         id="atom2595"
         name="C"
         valency="4">
        <cdml:point
           x="11.813cm"
           y="3.222cm" />
      </cdml:atom>
      <cdml:atom
         id="atom38347"
         name="C"
         valency="4">
        <cdml:point
           x="12.419cm"
           y="3.572cm" />
      </cdml:atom>
      <cdml:atom
         id="atom15663"
         name="C"
         valency="4">
        <cdml:point
           x="13.025cm"
           y="3.222cm" />
      </cdml:atom>
      <cdml:atom
         id="atom33234"
         name="C"
         valency="4">
        <cdml:point
           x="14.237cm"
           y="3.222cm" />
      </cdml:atom>
      <cdml:atom
         id="atom12384"
         name="C"
         valency="4">
        <cdml:point
           x="14.844cm"
           y="3.572cm" />
      </cdml:atom>
      <cdml:atom
         id="atom84026"
         name="C"
         valency="4">
        <cdml:point
           x="15.450cm"
           y="3.222cm" />
      </cdml:atom>
      <cdml:atom
         id="atom85313"
         name="C"
         valency="4">
        <cdml:point
           x="2.114cm"
           y="2.522cm" />
      </cdml:atom>
      <cdml:atom
         id="atom70274"
         name="C"
         valency="4">
        <cdml:point
           x="4.539cm"
           y="2.522cm" />
      </cdml:atom>
      <cdml:atom
         id="atom56977"
         name="C"
         valency="4">
        <cdml:point
           x="7.570cm"
           y="4.272cm" />
      </cdml:atom>
      <cdml:atom
         id="atom41030"
         name="C"
         valency="4">
        <cdml:point
           x="9.388cm"
           y="2.522cm" />
      </cdml:atom>
      <cdml:atom
         id="atom26132"
         name="C"
         valency="4">
        <cdml:point
           x="11.813cm"
           y="2.522cm" />
      </cdml:atom>
      <cdml:atom
         id="atom10831"
         name="C"
         valency="4">
        <cdml:point
           x="14.237cm"
           y="2.522cm" />
      </cdml:atom>
      <cdml:atom
         id="atom84762"
         name="C"
         valency="4">
        <cdml:point
           x="2.720cm"
           y="4.272cm" />
      </cdml:atom>
      <cdml:atom
         id="atom79550"
         name="C"
         valency="4">
        <cdml:point
           x="5.145cm"
           y="4.272cm" />
      </cdml:atom>
      <cdml:atom
         id="atom45298"
         name="C"
         valency="4">
        <cdml:point
           x="14.844cm"
           y="4.272cm" />
      </cdml:atom>
      <cdml:atom
         id="atom60921"
         name="C"
         valency="4">
        <cdml:point
           x="12.419cm"
           y="4.272cm" />
      </cdml:atom>
      <cdml:atom
         hydrogens="on"
         id="atom40063"
         name="N"
         pos="center-last"
         valency="3">
        <cdml:point
           x="1.508cm"
           y="3.572cm" />
      </cdml:atom>
      <cdml:atom
         id="atom24206"
         name="N"
         pos="center-first"
         valency="3">
        <cdml:point
           x="3.933cm"
           y="3.572cm" />
      </cdml:atom>
      <cdml:atom
         id="atom58568"
         name="N"
         pos="center-first"
         valency="3">
        <cdml:point
           x="6.357cm"
           y="3.572cm" />
      </cdml:atom>
      <cdml:atom
         id="atom77706"
         name="N"
         pos="center-first"
         valency="3">
        <cdml:point
           x="8.782cm"
           y="3.572cm" />
      </cdml:atom>
      <cdml:atom
         id="atom27180"
         name="N"
         pos="center-first"
         valency="3">
        <cdml:point
           x="11.207cm"
           y="3.572cm" />
      </cdml:atom>
      <cdml:atom
         id="atom79888"
         name="N"
         pos="center-first"
         valency="3">
        <cdml:point
           x="13.631cm"
           y="3.572cm" />
      </cdml:atom>
      <cdml:text
         id="atom85844"
         pos="center-first">
        <cdml:ftext>OH</cdml:ftext>
        <cdml:point
           x="16.056cm"
           y="3.572cm" />
      </cdml:text>
      <cdml:atom
         id="atom22421"
         name="O"
         pos="center-first"
         valency="2">
        <cdml:point
           x="15.450cm"
           y="2.522cm" />
      </cdml:atom>
      <cdml:atom
         id="atom12619"
         name="O"
         pos="center-first"
         valency="2">
        <cdml:point
           x="13.025cm"
           y="2.522cm" />
      </cdml:atom>
      <cdml:atom
         id="atom84144"
         name="O"
         pos="center-first"
         valency="2">
        <cdml:point
           x="10.601cm"
           y="2.522cm" />
      </cdml:atom>
      <cdml:atom
         id="atom50704"
         name="O"
         pos="center-first"
         valency="2">
        <cdml:point
           x="8.176cm"
           y="2.522cm" />
      </cdml:atom>
      <cdml:atom
         id="atom4694"
         name="O"
         pos="center-first"
         valency="2">
        <cdml:point
           x="5.751cm"
           y="2.522cm" />
      </cdml:atom>
      <cdml:atom
         id="atom94025"
         name="O"
         pos="center-first"
         valency="2">
        <cdml:point
           x="3.327cm"
           y="2.522cm" />
      </cdml:atom>
      <cdml:atom
         id="atom41508"
         name="H"
         pos="center-first"
         valency="1">
        <cdml:point
           x="3.933cm"
           y="4.272cm" />
      </cdml:atom>
      <cdml:atom
         id="atom70031"
         name="H"
         pos="center-first"
         valency="1">
        <cdml:point
           x="6.357cm"
           y="4.272cm" />
      </cdml:atom>
      <cdml:atom
         id="atom87230"
         name="H"
         pos="center-first"
         valency="1">
        <cdml:point
           x="8.782cm"
           y="4.272cm" />
      </cdml:atom>
      <cdml:atom
         id="atom45566"
         name="H"
         pos="center-first"
         valency="1">
        <cdml:point
           x="11.207cm"
           y="4.272cm" />
      </cdml:atom>
      <cdml:atom
         id="atom21752"
         name="H"
         pos="center-first"
         valency="1">
        <cdml:point
           x="13.631cm"
           y="4.272cm" />
      </cdml:atom>
      <cdml:atom
         id="atom11962"
         name="C"
         valency="4">
        <cdml:point
           x="5.145cm"
           y="2.172cm" />
      </cdml:atom>
      <cdml:atom
         id="atom15433"
         name="C"
         valency="4">
        <cdml:point
           x="3.933cm"
           y="2.172cm" />
      </cdml:atom>
      <cdml:atom
         id="atom12814"
         name="C"
         valency="4">
        <cdml:point
           x="6.964cm"
           y="4.622cm" />
      </cdml:atom>
      <cdml:atom
         id="atom75309"
         name="C"
         valency="4">
        <cdml:point
           x="8.176cm"
           y="4.622cm" />
      </cdml:atom>
      <cdml:atom
         id="atom48613"
         name="C"
         valency="4">
        <cdml:point
           x="9.994cm"
           y="2.172cm" />
      </cdml:atom>
      <cdml:atom
         id="atom50396"
         name="C"
         valency="4">
        <cdml:point
           x="9.994cm"
           y="1.472cm" />
      </cdml:atom>
      <cdml:atom
         id="atom86024"
         name="C"
         valency="4">
        <cdml:point
           x="10.601cm"
           y="1.122cm" />
      </cdml:atom>
      <cdml:atom
         hydrogens="on"
         id="atom22040"
         name="N"
         pos="center-first"
         valency="3">
        <cdml:point
           x="10.601cm"
           y="0.421cm" />
      </cdml:atom>
      <cdml:atom
         id="atom37291"
         name="C"
         valency="4">
        <cdml:point
           x="14.588cm"
           y="1.916cm" />
      </cdml:atom>
      <cdml:atom
         id="atom72484"
         name="C"
         valency="4">
        <cdml:point
           x="15.288cm"
           y="1.916cm" />
      </cdml:atom>
      <cdml:atom
         id="atom54176"
         name="C"
         valency="4">
        <cdml:point
           x="14.237cm"
           y="1.309cm" />
      </cdml:atom>
      <cdml:bond
         double_ratio="0.75"
         end="atom77706"
         id="bond96020"
         line_width="1.0"
         start="atom16359"
         type="n1" />
      <cdml:bond
         double_ratio="0.75"
         end="atom84026"
         id="bond80765"
         line_width="1.0"
         start="atom12384"
         type="n1" />
      <cdml:bond
         double_ratio="0.75"
         end="atom84762"
         id="bond71321"
         line_width="1.0"
         start="atom31768"
         type="h1"
         wedge_width="5.0" />
      <cdml:bond
         double_ratio="0.75"
         end="atom85844"
         id="bond66212"
         line_width="1.0"
         start="atom84026"
         type="n1" />
      <cdml:bond
         double_ratio="0.75"
         end="atom70274"
         id="bond16153"
         line_width="1.0"
         start="atom62594"
         type="w1"
         wedge_width="5.0" />
      <cdml:bond
         bond_width="6.0"
         center="yes"
         double_ratio="0.75"
         end="atom50704"
         id="bond39637"
         line_width="1.0"
         start="atom16359"
         type="n2" />
      <cdml:bond
         double_ratio="0.75"
         end="atom62594"
         id="bond76002"
         line_width="1.0"
         start="atom24206"
         type="n1" />
      <cdml:bond
         double_ratio="0.75"
         end="atom12814"
         id="bond99489"
         line_width="1.0"
         start="atom56977"
         type="n1" />
      <cdml:bond
         double_ratio="0.75"
         end="atom41030"
         id="bond74270"
         line_width="1.0"
         start="atom1425"
         type="w1"
         wedge_width="5.0" />
      <cdml:bond
         double_ratio="0.75"
         end="atom2595"
         id="bond17019"
         line_width="1.0"
         start="atom27180"
         type="n1" />
      <cdml:bond
         double_ratio="0.75"
         end="atom1425"
         id="bond79888"
         line_width="1.0"
         start="atom77706"
         type="n1" />
      <cdml:bond
         double_ratio="0.75"
         end="atom45566"
         id="bond73619"
         line_width="1.0"
         start="atom27180"
         type="n1" />
      <cdml:bond
         double_ratio="0.75"
         end="atom37291"
         id="bond49016"
         line_width="1.0"
         start="atom10831"
         type="n1" />
      <cdml:bond
         double_ratio="0.75"
         end="atom38347"
         id="bond48879"
         line_width="1.0"
         start="atom2595"
         type="n1" />
      <cdml:bond
         double_ratio="0.75"
         end="atom85313"
         id="bond61305"
         line_width="1.0"
         start="atom94602"
         type="w1"
         wedge_width="5.0" />
      <cdml:bond
         double_ratio="0.75"
         end="atom60921"
         id="bond46711"
         line_width="1.0"
         start="atom38347"
         type="h1"
         wedge_width="5.0" />
      <cdml:bond
         double_ratio="0.75"
         end="atom12096"
         id="bond61159"
         line_width="1.0"
         start="atom58568"
         type="n1" />
      <cdml:bond
         double_ratio="0.75"
         end="atom72484"
         id="bond44747"
         line_width="1.0"
         start="atom37291"
         type="n1" />
      <cdml:bond
         double_ratio="0.75"
         end="atom86024"
         id="bond1154"
         line_width="1.0"
         start="atom50396"
         type="n1" />
      <cdml:bond
         double_ratio="0.75"
         end="atom15663"
         id="bond91401"
         line_width="1.0"
         start="atom38347"
         type="n1" />
      <cdml:bond
         double_ratio="0.75"
         end="atom33234"
         id="bond82534"
         line_width="1.0"
         start="atom79888"
         type="n1" />
      <cdml:bond
         double_ratio="0.75"
         end="atom21752"
         id="bond96982"
         line_width="1.0"
         start="atom79888"
         type="n1" />
      <cdml:bond
         bond_width="6.0"
         center="yes"
         double_ratio="0.75"
         end="atom12619"
         id="bond26764"
         line_width="1.0"
         start="atom15663"
         type="n2" />
      <cdml:bond
         double_ratio="0.75"
         end="atom31768"
         id="bond79442"
         line_width="1.0"
         start="atom94602"
         type="n1" />
      <cdml:bond
         double_ratio="0.75"
         end="atom79888"
         id="bond73211"
         line_width="1.0"
         start="atom15663"
         type="n1" />
      <cdml:bond
         double_ratio="0.75"
         end="atom11962"
         id="bond11931"
         line_width="1.0"
         start="atom70274"
         type="n1" />
      <cdml:bond
         double_ratio="0.75"
         end="atom48613"
         id="bond45863"
         line_width="1.0"
         start="atom41030"
         type="n1" />
      <cdml:bond
         double_ratio="0.75"
         end="atom54176"
         id="bond75157"
         line_width="1.0"
         start="atom37291"
         type="n1" />
      <cdml:bond
         double_ratio="0.75"
         end="atom290"
         id="bond19626"
         line_width="1.0"
         start="atom13256"
         type="n1" />
      <cdml:bond
         double_ratio="0.75"
         end="atom22040"
         id="bond66703"
         line_width="1.0"
         start="atom86024"
         type="n1" />
      <cdml:bond
         bond_width="6.0"
         center="yes"
         double_ratio="0.75"
         end="atom94025"
         id="bond34114"
         line_width="1.0"
         start="atom83792"
         type="n2" />
      <cdml:bond
         double_ratio="0.75"
         end="atom13256"
         id="bond23166"
         line_width="1.0"
         start="atom62594"
         type="n1" />
      <cdml:bond
         double_ratio="0.75"
         end="atom94602"
         id="bond17549"
         line_width="1.0"
         start="atom40063"
         type="n1" />
      <cdml:bond
         double_ratio="0.75"
         end="atom15433"
         id="bond80319"
         line_width="1.0"
         start="atom70274"
         type="n1" />
      <cdml:bond
         double_ratio="0.75"
         end="atom56977"
         id="bond78693"
         line_width="1.0"
         start="atom72971"
         type="w1"
         wedge_width="5.0" />
      <cdml:bond
         double_ratio="0.75"
         end="atom71953"
         id="bond68067"
         line_width="1.0"
         start="atom1425"
         type="n1" />
      <cdml:bond
         bond_width="6.0"
         center="yes"
         double_ratio="0.75"
         end="atom4694"
         id="bond64483"
         line_width="1.0"
         start="atom290"
         type="n2" />
      <cdml:bond
         double_ratio="0.75"
         end="atom27180"
         id="bond96656"
         line_width="1.0"
         start="atom26341"
         type="n1" />
      <cdml:bond
         double_ratio="0.75"
         end="atom58568"
         id="bond90239"
         line_width="1.0"
         start="atom290"
         type="n1" />
      <cdml:bond
         double_ratio="0.75"
         end="atom41508"
         id="bond51868"
         line_width="1.0"
         start="atom24206"
         type="n1" />
      <cdml:bond
         double_ratio="0.75"
         end="atom12384"
         id="bond76310"
         line_width="1.0"
         start="atom33234"
         type="n1" />
      <cdml:bond
         bond_width="6.0"
         center="yes"
         double_ratio="0.75"
         end="atom22421"
         id="bond56988"
         line_width="1.0"
         start="atom84026"
         type="n2" />
      <cdml:bond
         double_ratio="0.75"
         end="atom75309"
         id="bond28086"
         line_width="1.0"
         start="atom56977"
         type="n1" />
      <cdml:bond
         bond_width="6.0"
         center="yes"
         double_ratio="0.75"
         end="atom84144"
         id="bond33937"
         line_width="1.0"
         start="atom26341"
         type="n2" />
      <cdml:bond
         double_ratio="0.75"
         end="atom79550"
         id="bond43441"
         line_width="1.0"
         start="atom13256"
         type="h1"
         wedge_width="5.0" />
      <cdml:bond
         double_ratio="0.75"
         end="atom45298"
         id="bond72964"
         line_width="1.0"
         start="atom12384"
         type="h1"
         wedge_width="5.0" />
      <cdml:bond
         double_ratio="0.75"
         end="atom70031"
         id="bond85659"
         line_width="1.0"
         start="atom58568"
         type="n1" />
      <cdml:bond
         double_ratio="0.75"
         end="atom26132"
         id="bond69740"
         line_width="1.0"
         start="atom2595"
         type="w1"
         wedge_width="5.0" />
      <cdml:bond
         double_ratio="0.75"
         end="atom72971"
         id="bond20218"
         line_width="1.0"
         start="atom12096"
         type="n1" />
      <cdml:bond
         double_ratio="0.75"
         end="atom83792"
         id="bond73026"
         line_width="1.0"
         start="atom31768"
         type="n1" />
      <cdml:bond
         double_ratio="0.75"
         end="atom10831"
         id="bond85882"
         line_width="1.0"
         start="atom33234"
         type="w1"
         wedge_width="5.0" />
      <cdml:bond
         double_ratio="0.75"
         end="atom50396"
         id="bond4503"
         line_width="1.0"
         start="atom48613"
         type="n1" />
      <cdml:bond
         double_ratio="0.75"
         end="atom16359"
         id="bond49580"
         line_width="1.0"
         start="atom72971"
         type="n1" />
      <cdml:bond
         double_ratio="0.75"
         end="atom24206"
         id="bond89305"
         line_width="1.0"
         start="atom83792"
         type="n1" />
      <cdml:bond
         double_ratio="0.75"
         end="atom26341"
         id="bond46377"
         line_width="1.0"
         start="atom71953"
         type="n1" />
      <cdml:bond
         double_ratio="0.75"
         end="atom87230"
         id="bond2535"
         line_width="1.0"
         start="atom77706"
         type="n1" />
    </cdml:molecule>
  </cdml:cdml>
</svg>
