<?xml version="1.0" encoding="UTF-8" standalone="no"?>
<svg
   xmlns:dc="http://purl.org/dc/elements/1.1/"
   xmlns:cc="http://creativecommons.org/ns#"
   xmlns:rdf="http://www.w3.org/1999/02/22-rdf-syntax-ns#"
   xmlns:svg="http://www.w3.org/2000/svg"
   xmlns="http://www.w3.org/2000/svg"
   xmlns:sodipodi="http://sodipodi.sourceforge.net/DTD/sodipodi-0.dtd"
   xmlns:inkscape="http://www.inkscape.org/namespaces/inkscape"
   version="1.1"
   id="svg2"
   xml:space="preserve"
   width="511.02261"
   height="666.71826"
   viewBox="0 0 511.0226 666.71827"
   sodipodi:docname="ttk_logo.svg"
   inkscape:version="1.0.2 (e86c870879, 2021-01-15)"><metadata
     id="metadata8"><rdf:RDF><cc:Work
         rdf:about=""><dc:format>image/svg+xml</dc:format><dc:type
           rdf:resource="http://purl.org/dc/dcmitype/StillImage" /><dc:title></dc:title></cc:Work></rdf:RDF></metadata><defs
     id="defs6"><clipPath
       clipPathUnits="userSpaceOnUse"
       id="clipPath18"><path
         d="M 0,595.28 H 841.89 V 0 H 0 Z"
         id="path16" /></clipPath></defs><sodipodi:namedview
     pagecolor="#ffffff"
     bordercolor="#666666"
     borderopacity="1"
     objecttolerance="10"
     gridtolerance="10"
     guidetolerance="10"
     inkscape:pageopacity="0"
     inkscape:pageshadow="2"
     inkscape:window-width="1920"
     inkscape:window-height="1011"
     id="namedview4"
     showgrid="false"
     fit-margin-top="0"
     fit-margin-left="0"
     fit-margin-right="0"
     fit-margin-bottom="0"
     inkscape:zoom="0.90083658"
     inkscape:cx="178.28597"
     inkscape:cy="344.34478"
     inkscape:window-x="0"
     inkscape:window-y="0"
     inkscape:window-maximized="1"
     inkscape:current-layer="g10" /><g
     id="g10"
     inkscape:groupmode="layer"
     inkscape:label="ttk_logo"
     transform="matrix(1.3333333,0,0,-1.3333333,-382.97404,741.19811)"><g
       id="g12"><g
         id="g14"
         clip-path="url(#clipPath18)"><g
           id="g20"
           transform="translate(654.8145,179.6617)"><path
             d="m 0,0 h -351.893 c -8.65,0 -15.682,7.02 -15.682,15.681 0,8.664 7.032,15.672 15.682,15.672 H 0 c 8.663,0 15.683,-7.008 15.683,-15.672 C 15.683,7.02 8.663,0 0,0"
             style="fill:#0000ff;fill-opacity:1;fill-rule:nonzero;stroke:none"
             id="path22" /></g><g
           id="g24"
           transform="translate(302.9219,223.6304)"><path
             d="m 0,0 c -8.411,0 -15.365,6.66 -15.682,15.113 -0.296,8.653 6.461,15.924 15.113,16.242 131.242,4.742 210.959,23.085 328.106,75.487 7.884,3.527 17.172,0 20.709,-7.894 3.526,-7.907 -0.011,-17.184 -7.917,-20.732 C 220.475,24.597 134.747,4.864 0.569,0.012 0.373,0 0.175,0 0,0"
             style="fill:#2626ff;fill-opacity:1;fill-rule:nonzero;stroke:none"
             id="path26" /></g><g
           id="g28"
           transform="translate(303.6226,312.5352)"><path
             d="m 0,0 c -6.844,0 -13.119,4.491 -15.08,11.411 -2.365,8.323 2.486,16.986 10.809,19.351 113.436,32.111 198.276,110.939 229.104,170.57 3.966,7.687 13.428,10.71 21.115,6.745 7.711,-3.985 10.71,-13.447 6.746,-21.157 C 217.727,119.282 127.365,35.438 4.272,0.59 2.848,0.175 1.425,0 0,0"
             style="fill:#7373ff;fill-opacity:1;fill-rule:nonzero;stroke:none"
             id="path30" /></g><g
           id="g32"
           transform="translate(304.7622,268.751)"><path
             d="m 0,0 c -8.126,0 -15.004,6.264 -15.617,14.511 -0.657,8.64 5.826,16.153 14.456,16.801 103.37,7.786 231.426,63.834 285.482,124.922 5.74,6.482 15.651,7.097 22.134,1.357 6.483,-5.737 7.086,-15.638 1.347,-22.133 C 249.102,69.103 111.563,8.355 1.194,0.044 0.788,0.022 0.394,0 0,0"
             style="fill:#4f4fff;fill-opacity:1;fill-rule:nonzero;stroke:none"
             id="path34" /></g><g
           id="g36"
           transform="translate(305.2104,359.5606)"><path
             d="m 0,0 c -5.936,0 -11.619,3.395 -14.247,9.133 -3.615,7.886 -0.176,17.194 7.699,20.798 84.687,38.887 113.346,105.275 112.165,150.309 -0.23,8.651 6.604,15.857 15.255,16.098 h 0.427 c 8.465,0 15.442,-6.746 15.671,-15.267 C 138.406,126.49 105.112,46.698 6.539,1.424 4.414,0.459 2.19,0 0,0"
             style="fill:#9696ff;fill-opacity:1;fill-rule:nonzero;stroke:none"
             id="path38" /></g><g
           id="g40"
           transform="translate(303.9287,406.1924)"><path
             d="m 0,0 c -3.689,0 -7.402,1.292 -10.381,3.931 -6.483,5.728 -7.098,15.65 -1.358,22.133 24.51,27.728 33.336,55.218 28.617,89.135 -1.194,8.596 4.785,16.526 13.348,17.708 8.576,1.226 16.516,-4.796 17.71,-13.361 C 53.948,76.332 42.449,40.038 11.751,5.289 8.652,1.796 4.337,0 0,0"
             style="fill:#b3b3ff;fill-opacity:1;fill-rule:nonzero;stroke:none"
             id="path42" /></g><g
           id="g44"
           transform="translate(438.6489,57.0122)"><path
             d="m 0,0 h -5.529 c -8.409,0 -16.013,7.027 -16.013,15.551 v 28.452 h -3.916 c -3.801,0 -6.796,2.997 -6.796,6.798 0,3.571 2.995,6.795 6.796,6.795 h 3.916 v 8.064 c 0,4.032 3.572,7.257 7.488,7.257 3.802,0 7.373,-3.225 7.373,-7.257 v -8.064 h 8.063 c 3.687,0 6.797,-2.88 6.797,-6.795 0,-3.801 -3.11,-6.798 -6.797,-6.798 H -6.681 V 15.782 c 0,-1.037 1.037,-2.189 2.188,-2.189 H 0 c 3.801,0 6.796,-2.995 6.796,-6.798 C 6.796,2.995 3.801,0 0,0"
             style="fill:#0000ff;fill-opacity:1;fill-rule:nonzero;stroke:none"
             id="path46" /></g><g
           id="g48"
           transform="translate(484.376,57.0122)"><path
             d="m 0,0 h -5.529 c -8.409,0 -16.012,7.027 -16.012,15.551 v 28.452 h -3.917 c -3.801,0 -6.796,2.997 -6.796,6.798 0,3.571 2.995,6.795 6.796,6.795 h 3.917 v 8.064 c 0,4.032 3.571,7.257 7.487,7.257 3.802,0 7.373,-3.225 7.373,-7.257 v -8.064 h 8.064 c 3.686,0 6.796,-2.88 6.796,-6.795 0,-3.801 -3.11,-6.798 -6.796,-6.798 H -6.681 V 15.782 c 0,-1.037 1.037,-2.189 2.189,-2.189 H 0 c 3.802,0 6.796,-2.995 6.796,-6.798 C 6.796,2.995 3.802,0 0,0"
             style="fill:#0000ff;fill-opacity:1;fill-rule:nonzero;stroke:none"
             id="path50" /></g><g
           id="g52"
           transform="translate(514.7026,95.0259)"><path
             d="m 0,0 20.734,18.316 c 1.037,0.921 2.881,2.418 5.645,2.418 4.262,0 7.257,-3.34 7.257,-7.487 0,-2.188 -0.922,-3.801 -1.843,-4.723 L 12.786,-7.487 34.558,-26.84 c 1.382,-1.267 2.073,-3.341 2.073,-5.068 0,-4.032 -3.225,-7.258 -7.257,-7.258 -1.728,0 -3.686,0.692 -5.068,1.958 L 0,-15.436 v -16.242 c 0,-4.147 -3.226,-7.488 -7.488,-7.488 -3.916,0 -7.257,3.341 -7.257,7.488 v 72.686 c 0,3.918 3.341,7.373 7.372,7.373 C -3.34,48.381 0,44.926 0,41.008 Z"
             style="fill:#0000ff;fill-opacity:1;fill-rule:nonzero;stroke:none"
             id="path54" /></g></g></g></g></svg>
