<?xml version="1.0" encoding="UTF-8" standalone="no"?>
<svg
   xmlns:dc="http://purl.org/dc/elements/1.1/"
   xmlns:cc="http://creativecommons.org/ns#"
   xmlns:rdf="http://www.w3.org/1999/02/22-rdf-syntax-ns#"
   xmlns:svg="http://www.w3.org/2000/svg"
   xmlns="http://www.w3.org/2000/svg"
   xmlns:sodipodi="http://sodipodi.sourceforge.net/DTD/sodipodi-0.dtd"
   xmlns:inkscape="http://www.inkscape.org/namespaces/inkscape"
   sodipodi:docname="lz.svg"
   inkscape:version="1.0 (4035a4fb49, 2020-05-01)"
   id="svg8"
   version="1.1"
   viewBox="0 0 199.56255 199.56253"
   height="199.56253mm"
   width="199.56255mm">
  <defs
     id="defs2" />
  <sodipodi:namedview
     inkscape:window-maximized="1"
     inkscape:window-y="0"
     inkscape:window-x="0"
     inkscape:window-height="1375"
     inkscape:window-width="2560"
     fit-margin-bottom="0"
     fit-margin-right="0"
     fit-margin-left="0"
     fit-margin-top="0"
     showgrid="false"
     inkscape:document-rotation="0"
     inkscape:current-layer="layer1"
     inkscape:document-units="mm"
     inkscape:cy="403.24983"
     inkscape:cx="356.75027"
     inkscape:zoom="0.49497475"
     inkscape:pageshadow="2"
     inkscape:pageopacity="0.0"
     borderopacity="1.0"
     bordercolor="#666666"
     pagecolor="#ffffff"
     id="base" />
  <metadata
     id="metadata5">
    <rdf:RDF>
      <cc:Work
         rdf:about="">
        <dc:format>image/svg+xml</dc:format>
        <dc:type
           rdf:resource="http://purl.org/dc/dcmitype/StillImage" />
        <dc:title></dc:title>
      </cc:Work>
    </rdf:RDF>
  </metadata>
  <g
     transform="translate(-5.7567116,-30.879726)"
     id="layer1"
     inkscape:groupmode="layer"
     inkscape:label="Layer 1">
    <path
       d="M 96.051039,30.879726 A 100.2312,100.2312 0 0 0 5.7571474,121.17405 H 21.185719 a 84.883552,84.883552 0 0 1 74.86532,-74.864883 z m 18.973881,4.44e-4 v 15.428997 a 84.883552,84.883552 0 0 1 74.86489,74.864883 h 15.42944 A 100.2312,100.2312 0 0 0 115.02492,30.88016 Z M 5.7567116,140.14793 a 100.2312,100.2312 0 0 0 90.2943274,90.2939 v -15.42858 a 84.883552,84.883552 0 0 1 -74.86532,-74.86532 z m 184.1330984,0 a 84.883552,84.883552 0 0 1 -74.86489,74.86532 v 15.42901 a 100.2312,100.2312 0 0 0 90.29389,-90.29433 z"
       style="opacity:1;fill:#000000;stroke:none;stroke-width:4.7625;stroke-linecap:round;paint-order:stroke fill markers;stop-color:#000000"
       id="path847" />
    <path
       sodipodi:nodetypes="ccccccccccccc"
       id="path864"
       d="M 65.487791,71.075542 H 85.254914 V 120.94261 H 125.46304 V 71.075542 h 19.76713 V 190.57679 h -19.76713 v -49.86948 l -40.095812,0.11473 -0.114275,49.75475 H 65.487791 Z"
       style="opacity:1;fill:#000000;stroke:none;stroke-width:4.7625;stroke-linecap:round;paint-order:stroke fill markers;stop-color:#000000" />
  </g>
</svg>
