<?xml version="1.0" encoding="UTF-8" standalone="no"?>
<svg
   xmlns:dc="http://purl.org/dc/elements/1.1/"
   xmlns:cc="http://creativecommons.org/ns#"
   xmlns:rdf="http://www.w3.org/1999/02/22-rdf-syntax-ns#"
   xmlns:svg="http://www.w3.org/2000/svg"
   xmlns="http://www.w3.org/2000/svg"
   xmlns:sodipodi="http://sodipodi.sourceforge.net/DTD/sodipodi-0.dtd"
   xmlns:inkscape="http://www.inkscape.org/namespaces/inkscape"
   inkscape:version="1.0 (4035a4fb49, 2020-05-01)"
   sodipodi:docname="logo.svg"
   viewBox="0 0 301.44888 301.44889"
   height="301.44888"
   width="301.44888"
   id="svg867"
   version="1.1">
  <metadata
     id="metadata873">
    <rdf:RDF>
      <cc:Work
         rdf:about="">
        <dc:format>image/svg+xml</dc:format>
        <dc:type
           rdf:resource="http://purl.org/dc/dcmitype/StillImage" />
        <dc:title></dc:title>
      </cc:Work>
    </rdf:RDF>
  </metadata>
  <defs
     id="defs871" />
  <sodipodi:namedview
     inkscape:current-layer="g875"
     inkscape:window-maximized="1"
     inkscape:window-y="0"
     inkscape:window-x="0"
     inkscape:cy="111.28877"
     inkscape:cx="208.9235"
     inkscape:zoom="1.494403"
     fit-margin-bottom="0"
     fit-margin-right="0"
     fit-margin-left="0"
     fit-margin-top="0"
     showgrid="false"
     id="namedview869"
     inkscape:window-height="1375"
     inkscape:window-width="2560"
     inkscape:pageshadow="2"
     inkscape:pageopacity="0"
     guidetolerance="10"
     gridtolerance="10"
     objecttolerance="10"
     borderopacity="1"
     bordercolor="#666666"
     pagecolor="#ffffff" />
  <g
     transform="translate(-20.703601,-17.583224)"
     id="g875"
     inkscape:label="Image"
     inkscape:groupmode="layer">
    <path
       sodipodi:open="true"
       d="m 135.40937,236.56409 a 77.176971,77.176971 0 0 1 -39.073744,-86.07256 77.176971,77.176971 0 0 1 73.575154,-59.345923 77.176971,77.176971 0 0 1 75.85125,56.407713 77.176971,77.176971 0 0 1 -35.6599,87.54206"
       sodipodi:arc-type="arc"
       sodipodi:end="1.0459163"
       sodipodi:start="2.0563548"
       sodipodi:ry="77.176971"
       sodipodi:rx="77.176971"
       sodipodi:cy="168.30766"
       sodipodi:cx="171.42804"
       sodipodi:type="arc"
       id="path2676"
       style="font-variation-settings:normal;opacity:1;vector-effect:none;fill:none;fill-opacity:1;stroke:#a0c6da;stroke-width:13.2845;stroke-linecap:round;stroke-linejoin:miter;stroke-miterlimit:4;stroke-dasharray:none;stroke-dashoffset:0;stroke-opacity:0.65098;paint-order:stroke fill markers;stop-color:#000000;stop-opacity:1" />
    <path
       d="m 168.17658,250.08466 v -18.84438 l -1.07683,-0.86376 c -4.24089,-3.40177 -3.04414,-10.94798 1.89924,-13.39927 1.75671,-0.87111 5.83672,-0.84188 7.56023,0.0667 5.08189,2.67915 6.05172,9.72048 1.71051,13.59614 l -1.01926,0.90996 v 18.53457 c 0,6.97293 -9.07389,6.38007 -9.07389,0 z m -35.16009,18.07914 v -68.13983 c 0,-5.8244 4.01014,-5.92289 8.98072,-5.92289 v -8.93328 c 0,-16.92706 13.39738,-31.13105 31.32535,-31.13105 17.92796,0 31.30608,14.12165 31.30608,32.4109 v 7.80834 c 6.32553,0 7.91124,1.95816 7.91124,5.45546 v 66.94937 c 0,5.58285 -2.7058,6.68118 -5.86613,6.68118 h -66.76681 c -4.65506,0 -6.89045,-1.88104 -6.89045,-5.1782 z m 70.16981,-64.92612 -60.87927,0.158 c -0.0527,20.29309 -0.10533,40.58618 -0.158,60.87927 h 61.03721 c 6e-5,-20.34576 6e-5,-40.69151 6e-5,-61.03727 z m -9.04562,-18.60271 c 0,-9.31048 -7.45603,-20.15941 -20.81812,-20.15941 -13.36209,0 -20.81813,11.71339 -20.81813,19.46331 v 10.31712 h 41.63625 z"
       style="fill:#2d6277;fill-opacity:1;stroke-width:0.309818;stroke-linecap:round;paint-order:stroke fill markers;stop-color:#000000"
       id="path2648" />
    <circle
       r="18.035555"
       cy="89.673706"
       cx="167.50314"
       id="path2651"
       style="fill:#e02536;fill-opacity:1;stroke-linecap:round;paint-order:stroke fill markers;stop-color:#000000" />
    <circle
       r="18.035555"
       cy="128.3174"
       cx="242.94144"
       id="circle2655"
       style="font-variation-settings:normal;opacity:1;vector-effect:none;fill:#e02536;fill-opacity:1;stroke-width:1;stroke-linecap:round;stroke-linejoin:miter;stroke-miterlimit:4;stroke-dasharray:none;stroke-dashoffset:0;stroke-opacity:1;paint-order:stroke fill markers;stop-color:#000000;stop-opacity:1" />
    <circle
       style="font-variation-settings:normal;opacity:1;vector-effect:none;fill:#e02536;fill-opacity:1;stroke-width:1;stroke-linecap:round;stroke-linejoin:miter;stroke-miterlimit:4;stroke-dasharray:none;stroke-dashoffset:0;stroke-opacity:1;paint-order:stroke fill markers;stop-color:#000000;stop-opacity:1"
       id="circle2653"
       cx="93.977684"
       cy="171.37569"
       r="18.035555" />
    <circle
       style="font-variation-settings:normal;opacity:1;vector-effect:none;fill:none;fill-opacity:1;stroke:#a0c6da;stroke-width:23.8883;stroke-linecap:round;stroke-linejoin:miter;stroke-miterlimit:4;stroke-dasharray:none;stroke-dashoffset:0;stroke-opacity:0.65098;paint-order:stroke fill markers;stop-color:#000000;stop-opacity:1"
       id="circle2678"
       cx="171.42804"
       cy="168.30766"
       r="138.78029" />
  </g>
</svg>
