EESchema Schematic File Version 4
EELAYER 29 0
EELAYER END
$Descr A4 11693 8268
encoding utf-8
Sheet 1 1
Title ""
Date ""
Rev ""
Comp ""
Comment1 ""
Comment2 ""
Comment3 ""
Comment4 ""
$EndDescr
$Comp
L Device:R_POT RV1
U 1 1 611431BF
P 4000 2450
F 0 "RV1" V 3885 2450 50  0000 C CNN
F 1 "R_POT" V 3794 2450 50  0000 C CNN
F 2 "Potentiometer_THT:Potentiometer_ACP_CA14-H5_Horizontal" H 4000 2450 50  0001 C CNN
F 3 "~" H 4000 2450 50  0001 C CNN
	1    4000 2450
	0    -1   -1   0   
$EndComp
$Comp
L Switch:SW_Push_Open SW1
U 1 1 61144251
P 3325 2225
F 0 "SW1" H 3325 2440 50  0000 C CNN
F 1 "SW_Push_Open" H 3325 2349 50  0000 C CNN
F 2 "freetronics_footprints:SW_PUSHBUTTON_PTH" H 3325 2425 50  0001 C CNN
F 3 "~" H 3325 2425 50  0001 C CNN
	1    3325 2225
	1    0    0    -1  
$EndComp
Wire Wire Line
	4150 2575 4150 2450
Wire Wire Line
	3525 2225 3850 2225
Wire Wire Line
	3850 2225 3850 2450
$Comp
L Motor:Motor_DC M1
U 1 1 61144E6F
P 4825 2275
F 0 "M1" H 4983 2271 50  0000 L CNN
F 1 "Motor_DC" H 4983 2180 50  0000 L CNN
F 2 "Connector_Phoenix_MSTB:PhoenixContact_MSTBV_2,5_2-GF-5,08_1x02_P5.08mm_Vertical_ThreadedFlange_MountHole" H 4825 2185 50  0001 C CNN
F 3 "~" H 4825 2185 50  0001 C CNN
	1    4825 2275
	1    0    0    -1  
$EndComp
Wire Wire Line
	4150 2575 4825 2575
Connection ~ 4150 2575
Wire Wire Line
	4000 2300 4000 2075
Wire Wire Line
	4000 2075 4825 2075
$Comp
L Device:R R2
U 1 1 61146930
P 4000 1800
F 0 "R2" H 4070 1846 50  0000 L CNN
F 1 "R" H 4070 1755 50  0000 L CNN
F 2 "Resistor_THT:R_Axial_DIN0614_L14.3mm_D5.7mm_P20.32mm_Horizontal" V 3930 1800 50  0001 C CNN
F 3 "~" H 4000 1800 50  0001 C CNN
	1    4000 1800
	1    0    0    -1  
$EndComp
$Comp
L Device:LED D1
U 1 1 61147252
P 4150 1475
F 0 "D1" H 4143 1220 50  0000 C CNN
F 1 "LED" H 4143 1311 50  0000 C CNN
F 2 "LED_THT:LED_D5.0mm_Clear" H 4150 1475 50  0001 C CNN
F 3 "~" H 4150 1475 50  0001 C CNN
	1    4150 1475
	-1   0    0    1   
$EndComp
Wire Wire Line
	4000 2075 4000 1950
Connection ~ 4000 2075
Wire Wire Line
	4000 1650 4000 1475
Wire Wire Line
	5550 2575 5550 1475
Wire Wire Line
	5550 1475 4300 1475
Wire Wire Line
	4825 2575 5550 2575
Connection ~ 4825 2575
Wire Notes Line
	2450 1150 2450 2950
Wire Notes Line
	2450 2950 5725 2950
Wire Notes Line
	5725 2950 5725 1150
Wire Notes Line
	5725 1150 2450 1150
$Comp
L Switch:SW_Push_Open SW3
U 1 1 6114BCD4
P 4150 4000
F 0 "SW3" H 4150 4215 50  0000 C CNN
F 1 "SW_Push_Open" H 4150 4124 50  0000 C CNN
F 2 "freetronics_footprints:SW_PUSHBUTTON_PTH" H 4150 4200 50  0001 C CNN
F 3 "~" H 4150 4200 50  0001 C CNN
	1    4150 4000
	1    0    0    -1  
$EndComp
$Comp
L Device:R R4
U 1 1 6114C689
P 5025 4000
F 0 "R4" V 4818 4000 50  0000 C CNN
F 1 "R" V 4909 4000 50  0000 C CNN
F 2 "Resistor_THT:R_Axial_Power_L25.0mm_W6.4mm_P30.48mm" V 4955 4000 50  0001 C CNN
F 3 "~" H 5025 4000 50  0001 C CNN
	1    5025 4000
	0    1    1    0   
$EndComp
$Comp
L Device:R R1
U 1 1 6114DA2A
P 3800 4625
F 0 "R1" V 3593 4625 50  0000 C CNN
F 1 "R" V 3684 4625 50  0000 C CNN
F 2 "Resistor_THT:R_Axial_DIN0614_L14.3mm_D5.7mm_P20.32mm_Horizontal" V 3730 4625 50  0001 C CNN
F 3 "~" H 3800 4625 50  0001 C CNN
	1    3800 4625
	0    1    1    0   
$EndComp
$Comp
L Switch:SW_Push_Open SW2
U 1 1 6114E142
P 4150 3600
F 0 "SW2" H 4150 3815 50  0000 C CNN
F 1 "SW_Push_Open" H 4150 3724 50  0000 C CNN
F 2 "freetronics_footprints:SW_PUSHBUTTON_PTH" H 4150 3800 50  0001 C CNN
F 3 "~" H 4150 3800 50  0001 C CNN
	1    4150 3600
	1    0    0    -1  
$EndComp
$Comp
L Device:R R3
U 1 1 6114E43E
P 5025 3600
F 0 "R3" V 4818 3600 50  0000 C CNN
F 1 "R" V 4909 3600 50  0000 C CNN
F 2 "Resistor_THT:R_Axial_Power_L25.0mm_W6.4mm_P30.48mm" V 4955 3600 50  0001 C CNN
F 3 "~" H 5025 3600 50  0001 C CNN
	1    5025 3600
	0    1    1    0   
$EndComp
$Comp
L Switch:SW_Push_Open SW4
U 1 1 6114EF0C
P 4150 4375
F 0 "SW4" H 4150 4590 50  0000 C CNN
F 1 "SW_Push_Open" H 4150 4499 50  0000 C CNN
F 2 "freetronics_footprints:SW_PUSHBUTTON_PTH" H 4150 4575 50  0001 C CNN
F 3 "~" H 4150 4575 50  0001 C CNN
	1    4150 4375
	1    0    0    -1  
$EndComp
$Comp
L Device:R R5
U 1 1 6114F45E
P 5025 4375
F 0 "R5" V 4818 4375 50  0000 C CNN
F 1 "R" V 4909 4375 50  0000 C CNN
F 2 "Resistor_THT:R_Axial_Power_L25.0mm_W6.4mm_P30.48mm" V 4955 4375 50  0001 C CNN
F 3 "~" H 5025 4375 50  0001 C CNN
	1    5025 4375
	0    1    1    0   
$EndComp
Wire Wire Line
	5175 3600 5600 3600
Wire Wire Line
	5175 4000 5600 4000
Wire Wire Line
	5600 3600 5600 4000
Connection ~ 5600 4000
Wire Wire Line
	5600 4000 5600 4375
Wire Wire Line
	5175 4375 5600 4375
Connection ~ 5600 4375
Wire Wire Line
	4350 3600 4875 3600
Wire Wire Line
	4350 4000 4875 4000
Wire Wire Line
	4875 4375 4350 4375
Wire Wire Line
	3425 4000 3425 3600
Wire Wire Line
	3425 3600 3950 3600
Wire Wire Line
	3950 4000 3425 4000
Connection ~ 3425 4000
Wire Wire Line
	3950 4375 3425 4375
Wire Wire Line
	3425 4375 3425 4000
Wire Wire Line
	2925 4000 3425 4000
Wire Wire Line
	3950 4625 5600 4625
Wire Wire Line
	5600 4375 5600 4625
$Comp
L power:+12V #PWR01
U 1 1 61155615
P 1450 3450
F 0 "#PWR01" H 1450 3300 50  0001 C CNN
F 1 "+12V" H 1465 3623 50  0000 C CNN
F 2 "" H 1450 3450 50  0001 C CNN
F 3 "" H 1450 3450 50  0001 C CNN
	1    1450 3450
	1    0    0    -1  
$EndComp
$Comp
L power:GND #PWR02
U 1 1 61155BFE
P 1450 3725
F 0 "#PWR02" H 1450 3475 50  0001 C CNN
F 1 "GND" H 1455 3552 50  0000 C CNN
F 2 "" H 1450 3725 50  0001 C CNN
F 3 "" H 1450 3725 50  0001 C CNN
	1    1450 3725
	1    0    0    -1  
$EndComp
Wire Wire Line
	1450 3725 1725 3725
Wire Wire Line
	1450 3450 1725 3450
Wire Wire Line
	1925 3450 1925 2225
Wire Wire Line
	1925 3450 2925 3450
Connection ~ 1925 3450
Wire Wire Line
	2925 3450 2925 4000
Wire Notes Line
	2450 4800 5725 4800
Wire Notes Line
	5725 4800 5725 3250
Wire Notes Line
	5725 3250 2450 3250
Wire Notes Line
	2450 3250 2450 4800
Wire Notes Line
	2125 3000 2125 4250
Wire Wire Line
	1925 2225 3125 2225
$Comp
L Connector:Barrel_Jack_MountingPin J1
U 1 1 6115E317
P 1100 3575
F 0 "J1" H 1157 3892 50  0000 C CNN
F 1 "Barrel_Jack_MountingPin" H 1157 3801 50  0000 C CNN
F 2 "Connector_BarrelJack:BarrelJack_CUI_PJ-063AH_Horizontal" H 1150 3535 50  0001 C CNN
F 3 "~" H 1150 3535 50  0001 C CNN
	1    1100 3575
	1    0    0    -1  
$EndComp
Wire Wire Line
	1400 3475 1725 3475
Wire Wire Line
	1725 3475 1725 3450
Connection ~ 1725 3450
Wire Wire Line
	1725 3450 1925 3450
Wire Wire Line
	1400 3675 1725 3675
Wire Wire Line
	1725 3675 1725 3725
Connection ~ 1725 3725
Wire Wire Line
	1725 3725 1925 3725
Wire Notes Line
	675  4250 675  3000
Wire Notes Line
	675  3000 2125 3000
Wire Notes Line
	675  4250 2125 4250
Wire Wire Line
	1925 4625 3650 4625
Wire Wire Line
	3700 2575 3700 3125
Wire Wire Line
	3700 3125 625  3125
Wire Wire Line
	625  3125 625  4025
Wire Wire Line
	625  4025 1925 4025
Wire Wire Line
	1925 3725 1925 4025
Wire Wire Line
	3700 2575 4150 2575
Connection ~ 1925 4025
Wire Wire Line
	1925 4025 1925 4625
$EndSCHEMATC
