G04 #@! TF.GenerationSoftware,KiCad,Pcbnew,(5.1.2)-2*
G04 #@! TF.CreationDate,2021-06-26T10:37:03+01:00*
G04 #@! TF.ProjectId,Controller,436f6e74-726f-46c6-9c65-722e6b696361,rev?*
G04 #@! TF.SameCoordinates,Original*
G04 #@! TF.FileFunction,Legend,Top*
G04 #@! TF.FilePolarity,Positive*
%FSLAX46Y46*%
G04 Gerber Fmt 4.6, Leading zero omitted, Abs format (unit mm)*
G04 Created by KiCad (PCBNEW (5.1.2)-2) date 2021-06-26 10:37:03*
%MOMM*%
%LPD*%
G04 APERTURE LIST*
%ADD10C,0.075000*%
%ADD11C,0.125000*%
%ADD12C,0.120000*%
%ADD13C,0.150000*%
G04 APERTURE END LIST*
D10*
X122578952Y-51062714D02*
X122578952Y-50762714D01*
X122578952Y-51048428D02*
X122483714Y-51062714D01*
X122293238Y-51062714D01*
X122198000Y-51048428D01*
X122150380Y-51034142D01*
X122102761Y-51005571D01*
X122102761Y-50919857D01*
X122150380Y-50891285D01*
X122198000Y-50877000D01*
X122293238Y-50862714D01*
X122483714Y-50862714D01*
X122578952Y-50877000D01*
X123055142Y-51062714D02*
X123055142Y-50862714D01*
X123055142Y-50762714D02*
X123007523Y-50777000D01*
X123055142Y-50791285D01*
X123102761Y-50777000D01*
X123055142Y-50762714D01*
X123055142Y-50791285D01*
X123531333Y-50862714D02*
X123531333Y-51062714D01*
X123531333Y-50891285D02*
X123578952Y-50877000D01*
X123674190Y-50862714D01*
X123817047Y-50862714D01*
X123912285Y-50877000D01*
X123959904Y-50905571D01*
X123959904Y-51062714D01*
X124436095Y-51062714D02*
X124436095Y-50862714D01*
X124436095Y-50762714D02*
X124388476Y-50777000D01*
X124436095Y-50791285D01*
X124483714Y-50777000D01*
X124436095Y-50762714D01*
X124436095Y-50791285D01*
X124817047Y-51062714D02*
X125340857Y-50862714D01*
X124817047Y-50862714D02*
X125340857Y-51062714D01*
D11*
X122110714Y-51406309D02*
X122158333Y-51382500D01*
X122253571Y-51358690D01*
X122491666Y-51358690D01*
X122586904Y-51382500D01*
X122634523Y-51406309D01*
X122682142Y-51453928D01*
X122682142Y-51501547D01*
X122634523Y-51572976D01*
X122063095Y-51858690D01*
X122682142Y-51858690D01*
X123301190Y-51358690D02*
X123396428Y-51358690D01*
X123491666Y-51382500D01*
X123539285Y-51406309D01*
X123586904Y-51453928D01*
X123634523Y-51549166D01*
X123634523Y-51668214D01*
X123586904Y-51763452D01*
X123539285Y-51811071D01*
X123491666Y-51834880D01*
X123396428Y-51858690D01*
X123301190Y-51858690D01*
X123205952Y-51834880D01*
X123158333Y-51811071D01*
X123110714Y-51763452D01*
X123063095Y-51668214D01*
X123063095Y-51549166D01*
X123110714Y-51453928D01*
X123158333Y-51406309D01*
X123205952Y-51382500D01*
X123301190Y-51358690D01*
X124015476Y-51406309D02*
X124063095Y-51382500D01*
X124158333Y-51358690D01*
X124396428Y-51358690D01*
X124491666Y-51382500D01*
X124539285Y-51406309D01*
X124586904Y-51453928D01*
X124586904Y-51501547D01*
X124539285Y-51572976D01*
X123967857Y-51858690D01*
X124586904Y-51858690D01*
X125539285Y-51858690D02*
X124967857Y-51858690D01*
X125253571Y-51858690D02*
X125253571Y-51358690D01*
X125158333Y-51430119D01*
X125063095Y-51477738D01*
X124967857Y-51501547D01*
X122182142Y-52733690D02*
X122182142Y-52471785D01*
X122134523Y-52424166D01*
X122039285Y-52400357D01*
X121848809Y-52400357D01*
X121753571Y-52424166D01*
X122182142Y-52709880D02*
X122086904Y-52733690D01*
X121848809Y-52733690D01*
X121753571Y-52709880D01*
X121705952Y-52662261D01*
X121705952Y-52614642D01*
X121753571Y-52567023D01*
X121848809Y-52543214D01*
X122086904Y-52543214D01*
X122182142Y-52519404D01*
X122801190Y-52733690D02*
X122705952Y-52709880D01*
X122658333Y-52662261D01*
X122658333Y-52233690D01*
X123039285Y-52400357D02*
X123420238Y-52400357D01*
X123182142Y-52233690D02*
X123182142Y-52662261D01*
X123229761Y-52709880D01*
X123325000Y-52733690D01*
X123420238Y-52733690D01*
X124229761Y-52733690D02*
X123753571Y-52733690D01*
X123753571Y-52233690D01*
X124991666Y-52733690D02*
X124991666Y-52471785D01*
X124944047Y-52424166D01*
X124848809Y-52400357D01*
X124658333Y-52400357D01*
X124563095Y-52424166D01*
X124991666Y-52709880D02*
X124896428Y-52733690D01*
X124658333Y-52733690D01*
X124563095Y-52709880D01*
X124515476Y-52662261D01*
X124515476Y-52614642D01*
X124563095Y-52567023D01*
X124658333Y-52543214D01*
X124896428Y-52543214D01*
X124991666Y-52519404D01*
X125467857Y-52733690D02*
X125467857Y-52233690D01*
X125467857Y-52424166D02*
X125563095Y-52400357D01*
X125753571Y-52400357D01*
X125848809Y-52424166D01*
X125896428Y-52447976D01*
X125944047Y-52495595D01*
X125944047Y-52638452D01*
X125896428Y-52686071D01*
X125848809Y-52709880D01*
X125753571Y-52733690D01*
X125563095Y-52733690D01*
X125467857Y-52709880D01*
D12*
X57023000Y-41275000D02*
X57023000Y-71755000D01*
X127254000Y-71755000D02*
X127127000Y-71755000D01*
X127254000Y-41021000D02*
X127254000Y-71755000D01*
X127127000Y-71755000D02*
X57023000Y-71755000D01*
D13*
X60769523Y-70318380D02*
X60293333Y-70318380D01*
X60245714Y-70794571D01*
X60293333Y-70746952D01*
X60388571Y-70699333D01*
X60626666Y-70699333D01*
X60721904Y-70746952D01*
X60769523Y-70794571D01*
X60817142Y-70889809D01*
X60817142Y-71127904D01*
X60769523Y-71223142D01*
X60721904Y-71270761D01*
X60626666Y-71318380D01*
X60388571Y-71318380D01*
X60293333Y-71270761D01*
X60245714Y-71223142D01*
X61102857Y-70318380D02*
X61436190Y-71318380D01*
X61769523Y-70318380D01*
X60579095Y-62238000D02*
X60483857Y-62190380D01*
X60341000Y-62190380D01*
X60198142Y-62238000D01*
X60102904Y-62333238D01*
X60055285Y-62428476D01*
X60007666Y-62618952D01*
X60007666Y-62761809D01*
X60055285Y-62952285D01*
X60102904Y-63047523D01*
X60198142Y-63142761D01*
X60341000Y-63190380D01*
X60436238Y-63190380D01*
X60579095Y-63142761D01*
X60626714Y-63095142D01*
X60626714Y-62761809D01*
X60436238Y-62761809D01*
X61055285Y-63190380D02*
X61055285Y-62190380D01*
X61626714Y-63190380D01*
X61626714Y-62190380D01*
X62102904Y-63190380D02*
X62102904Y-62190380D01*
X62341000Y-62190380D01*
X62483857Y-62238000D01*
X62579095Y-62333238D01*
X62626714Y-62428476D01*
X62674333Y-62618952D01*
X62674333Y-62761809D01*
X62626714Y-62952285D01*
X62579095Y-63047523D01*
X62483857Y-63142761D01*
X62341000Y-63190380D01*
X62102904Y-63190380D01*
X102311285Y-41838571D02*
X102011285Y-41838571D01*
X102011285Y-42362380D02*
X102011285Y-41362380D01*
X102439857Y-41362380D01*
X103168428Y-42362380D02*
X103168428Y-41838571D01*
X103125571Y-41743333D01*
X103039857Y-41695714D01*
X102868428Y-41695714D01*
X102782714Y-41743333D01*
X103168428Y-42314761D02*
X103082714Y-42362380D01*
X102868428Y-42362380D01*
X102782714Y-42314761D01*
X102739857Y-42219523D01*
X102739857Y-42124285D01*
X102782714Y-42029047D01*
X102868428Y-41981428D01*
X103082714Y-41981428D01*
X103168428Y-41933809D01*
X103597000Y-41695714D02*
X103597000Y-42362380D01*
X103597000Y-41790952D02*
X103639857Y-41743333D01*
X103725571Y-41695714D01*
X103854142Y-41695714D01*
X103939857Y-41743333D01*
X103982714Y-41838571D01*
X103982714Y-42362380D01*
X100829571Y-52395380D02*
X100829571Y-51395380D01*
X101043857Y-51395380D01*
X101172428Y-51443000D01*
X101258142Y-51538238D01*
X101301000Y-51633476D01*
X101343857Y-51823952D01*
X101343857Y-51966809D01*
X101301000Y-52157285D01*
X101258142Y-52252523D01*
X101172428Y-52347761D01*
X101043857Y-52395380D01*
X100829571Y-52395380D01*
X102158142Y-51395380D02*
X101729571Y-51395380D01*
X101686714Y-51871571D01*
X101729571Y-51823952D01*
X101815285Y-51776333D01*
X102029571Y-51776333D01*
X102115285Y-51823952D01*
X102158142Y-51871571D01*
X102201000Y-51966809D01*
X102201000Y-52204904D01*
X102158142Y-52300142D01*
X102115285Y-52347761D01*
X102029571Y-52395380D01*
X101815285Y-52395380D01*
X101729571Y-52347761D01*
X101686714Y-52300142D01*
X102586714Y-52014428D02*
X103272428Y-52014428D01*
X104001000Y-51871571D02*
X103701000Y-51871571D01*
X103701000Y-52395380D02*
X103701000Y-51395380D01*
X104129571Y-51395380D01*
X104858142Y-52395380D02*
X104858142Y-51871571D01*
X104815285Y-51776333D01*
X104729571Y-51728714D01*
X104558142Y-51728714D01*
X104472428Y-51776333D01*
X104858142Y-52347761D02*
X104772428Y-52395380D01*
X104558142Y-52395380D01*
X104472428Y-52347761D01*
X104429571Y-52252523D01*
X104429571Y-52157285D01*
X104472428Y-52062047D01*
X104558142Y-52014428D01*
X104772428Y-52014428D01*
X104858142Y-51966809D01*
X105286714Y-51728714D02*
X105286714Y-52395380D01*
X105286714Y-51823952D02*
X105329571Y-51776333D01*
X105415285Y-51728714D01*
X105543857Y-51728714D01*
X105629571Y-51776333D01*
X105672428Y-51871571D01*
X105672428Y-52395380D01*
X108892714Y-70445380D02*
X109407000Y-70445380D01*
X109149857Y-71445380D02*
X109149857Y-70445380D01*
X110049857Y-71397761D02*
X109964142Y-71445380D01*
X109792714Y-71445380D01*
X109707000Y-71397761D01*
X109664142Y-71302523D01*
X109664142Y-70921571D01*
X109707000Y-70826333D01*
X109792714Y-70778714D01*
X109964142Y-70778714D01*
X110049857Y-70826333D01*
X110092714Y-70921571D01*
X110092714Y-71016809D01*
X109664142Y-71112047D01*
X110478428Y-71445380D02*
X110478428Y-70778714D01*
X110478428Y-70873952D02*
X110521285Y-70826333D01*
X110607000Y-70778714D01*
X110735571Y-70778714D01*
X110821285Y-70826333D01*
X110864142Y-70921571D01*
X110864142Y-71445380D01*
X110864142Y-70921571D02*
X110907000Y-70826333D01*
X110992714Y-70778714D01*
X111121285Y-70778714D01*
X111207000Y-70826333D01*
X111249857Y-70921571D01*
X111249857Y-71445380D01*
X111678428Y-70778714D02*
X111678428Y-71778714D01*
X111678428Y-70826333D02*
X111764142Y-70778714D01*
X111935571Y-70778714D01*
X112021285Y-70826333D01*
X112064142Y-70873952D01*
X112107000Y-70969190D01*
X112107000Y-71254904D01*
X112064142Y-71350142D01*
X112021285Y-71397761D01*
X111935571Y-71445380D01*
X111764142Y-71445380D01*
X111678428Y-71397761D01*
X113135571Y-71397761D02*
X113264142Y-71445380D01*
X113478428Y-71445380D01*
X113564142Y-71397761D01*
X113607000Y-71350142D01*
X113649857Y-71254904D01*
X113649857Y-71159666D01*
X113607000Y-71064428D01*
X113564142Y-71016809D01*
X113478428Y-70969190D01*
X113307000Y-70921571D01*
X113221285Y-70873952D01*
X113178428Y-70826333D01*
X113135571Y-70731095D01*
X113135571Y-70635857D01*
X113178428Y-70540619D01*
X113221285Y-70493000D01*
X113307000Y-70445380D01*
X113521285Y-70445380D01*
X113649857Y-70493000D01*
X114378428Y-71397761D02*
X114292714Y-71445380D01*
X114121285Y-71445380D01*
X114035571Y-71397761D01*
X113992714Y-71302523D01*
X113992714Y-70921571D01*
X114035571Y-70826333D01*
X114121285Y-70778714D01*
X114292714Y-70778714D01*
X114378428Y-70826333D01*
X114421285Y-70921571D01*
X114421285Y-71016809D01*
X113992714Y-71112047D01*
X114807000Y-70778714D02*
X114807000Y-71445380D01*
X114807000Y-70873952D02*
X114849857Y-70826333D01*
X114935571Y-70778714D01*
X115064142Y-70778714D01*
X115149857Y-70826333D01*
X115192714Y-70921571D01*
X115192714Y-71445380D01*
X115578428Y-71397761D02*
X115664142Y-71445380D01*
X115835571Y-71445380D01*
X115921285Y-71397761D01*
X115964142Y-71302523D01*
X115964142Y-71254904D01*
X115921285Y-71159666D01*
X115835571Y-71112047D01*
X115707000Y-71112047D01*
X115621285Y-71064428D01*
X115578428Y-70969190D01*
X115578428Y-70921571D01*
X115621285Y-70826333D01*
X115707000Y-70778714D01*
X115835571Y-70778714D01*
X115921285Y-70826333D01*
X116478428Y-71445380D02*
X116392714Y-71397761D01*
X116349857Y-71350142D01*
X116307000Y-71254904D01*
X116307000Y-70969190D01*
X116349857Y-70873952D01*
X116392714Y-70826333D01*
X116478428Y-70778714D01*
X116607000Y-70778714D01*
X116692714Y-70826333D01*
X116735571Y-70873952D01*
X116778428Y-70969190D01*
X116778428Y-71254904D01*
X116735571Y-71350142D01*
X116692714Y-71397761D01*
X116607000Y-71445380D01*
X116478428Y-71445380D01*
X117164142Y-71445380D02*
X117164142Y-70778714D01*
X117164142Y-70969190D02*
X117207000Y-70873952D01*
X117249857Y-70826333D01*
X117335571Y-70778714D01*
X117421285Y-70778714D01*
X101204285Y-71159666D02*
X101632857Y-71159666D01*
X101118571Y-71445380D02*
X101418571Y-70445380D01*
X101718571Y-71445380D01*
X102190000Y-70445380D02*
X102275714Y-70445380D01*
X102361428Y-70493000D01*
X102404285Y-70540619D01*
X102447142Y-70635857D01*
X102490000Y-70826333D01*
X102490000Y-71064428D01*
X102447142Y-71254904D01*
X102404285Y-71350142D01*
X102361428Y-71397761D01*
X102275714Y-71445380D01*
X102190000Y-71445380D01*
X102104285Y-71397761D01*
X102061428Y-71350142D01*
X102018571Y-71254904D01*
X101975714Y-71064428D01*
X101975714Y-70826333D01*
X102018571Y-70635857D01*
X102061428Y-70540619D01*
X102104285Y-70493000D01*
X102190000Y-70445380D01*
X102875714Y-71064428D02*
X103561428Y-71064428D01*
X103861428Y-70445380D02*
X104375714Y-70445380D01*
X104118571Y-71445380D02*
X104118571Y-70445380D01*
X105018571Y-71397761D02*
X104932857Y-71445380D01*
X104761428Y-71445380D01*
X104675714Y-71397761D01*
X104632857Y-71302523D01*
X104632857Y-70921571D01*
X104675714Y-70826333D01*
X104761428Y-70778714D01*
X104932857Y-70778714D01*
X105018571Y-70826333D01*
X105061428Y-70921571D01*
X105061428Y-71016809D01*
X104632857Y-71112047D01*
X105447142Y-71445380D02*
X105447142Y-70778714D01*
X105447142Y-70873952D02*
X105490000Y-70826333D01*
X105575714Y-70778714D01*
X105704285Y-70778714D01*
X105790000Y-70826333D01*
X105832857Y-70921571D01*
X105832857Y-71445380D01*
X105832857Y-70921571D02*
X105875714Y-70826333D01*
X105961428Y-70778714D01*
X106090000Y-70778714D01*
X106175714Y-70826333D01*
X106218571Y-70921571D01*
X106218571Y-71445380D01*
X106647142Y-70778714D02*
X106647142Y-71778714D01*
X106647142Y-70826333D02*
X106732857Y-70778714D01*
X106904285Y-70778714D01*
X106990000Y-70826333D01*
X107032857Y-70873952D01*
X107075714Y-70969190D01*
X107075714Y-71254904D01*
X107032857Y-71350142D01*
X106990000Y-71397761D01*
X106904285Y-71445380D01*
X106732857Y-71445380D01*
X106647142Y-71397761D01*
X81984428Y-70921571D02*
X82113000Y-70969190D01*
X82155857Y-71016809D01*
X82198714Y-71112047D01*
X82198714Y-71254904D01*
X82155857Y-71350142D01*
X82113000Y-71397761D01*
X82027285Y-71445380D01*
X81684428Y-71445380D01*
X81684428Y-70445380D01*
X81984428Y-70445380D01*
X82070142Y-70493000D01*
X82113000Y-70540619D01*
X82155857Y-70635857D01*
X82155857Y-70731095D01*
X82113000Y-70826333D01*
X82070142Y-70873952D01*
X81984428Y-70921571D01*
X81684428Y-70921571D01*
X82970142Y-70778714D02*
X82970142Y-71445380D01*
X82584428Y-70778714D02*
X82584428Y-71302523D01*
X82627285Y-71397761D01*
X82713000Y-71445380D01*
X82841571Y-71445380D01*
X82927285Y-71397761D01*
X82970142Y-71350142D01*
X83270142Y-70778714D02*
X83613000Y-70778714D01*
X83398714Y-70445380D02*
X83398714Y-71302523D01*
X83441571Y-71397761D01*
X83527285Y-71445380D01*
X83613000Y-71445380D01*
X83784428Y-70778714D02*
X84127285Y-70778714D01*
X83913000Y-70445380D02*
X83913000Y-71302523D01*
X83955857Y-71397761D01*
X84041571Y-71445380D01*
X84127285Y-71445380D01*
X84555857Y-71445380D02*
X84470142Y-71397761D01*
X84427285Y-71350142D01*
X84384428Y-71254904D01*
X84384428Y-70969190D01*
X84427285Y-70873952D01*
X84470142Y-70826333D01*
X84555857Y-70778714D01*
X84684428Y-70778714D01*
X84770142Y-70826333D01*
X84813000Y-70873952D01*
X84855857Y-70969190D01*
X84855857Y-71254904D01*
X84813000Y-71350142D01*
X84770142Y-71397761D01*
X84684428Y-71445380D01*
X84555857Y-71445380D01*
X85241571Y-70778714D02*
X85241571Y-71445380D01*
X85241571Y-70873952D02*
X85284428Y-70826333D01*
X85370142Y-70778714D01*
X85498714Y-70778714D01*
X85584428Y-70826333D01*
X85627285Y-70921571D01*
X85627285Y-71445380D01*
X86055857Y-71445380D02*
X86055857Y-70445380D01*
X86270142Y-70445380D01*
X86398714Y-70493000D01*
X86484428Y-70588238D01*
X86527285Y-70683476D01*
X86570142Y-70873952D01*
X86570142Y-71016809D01*
X86527285Y-71207285D01*
X86484428Y-71302523D01*
X86398714Y-71397761D01*
X86270142Y-71445380D01*
X86055857Y-71445380D01*
X87427285Y-71445380D02*
X86913000Y-71445380D01*
X87170142Y-71445380D02*
X87170142Y-70445380D01*
X87084428Y-70588238D01*
X86998714Y-70683476D01*
X86913000Y-70731095D01*
X87770142Y-70540619D02*
X87813000Y-70493000D01*
X87898714Y-70445380D01*
X88113000Y-70445380D01*
X88198714Y-70493000D01*
X88241571Y-70540619D01*
X88284428Y-70635857D01*
X88284428Y-70731095D01*
X88241571Y-70873952D01*
X87727285Y-71445380D01*
X88284428Y-71445380D01*
X66744428Y-70921571D02*
X66873000Y-70969190D01*
X66915857Y-71016809D01*
X66958714Y-71112047D01*
X66958714Y-71254904D01*
X66915857Y-71350142D01*
X66873000Y-71397761D01*
X66787285Y-71445380D01*
X66444428Y-71445380D01*
X66444428Y-70445380D01*
X66744428Y-70445380D01*
X66830142Y-70493000D01*
X66873000Y-70540619D01*
X66915857Y-70635857D01*
X66915857Y-70731095D01*
X66873000Y-70826333D01*
X66830142Y-70873952D01*
X66744428Y-70921571D01*
X66444428Y-70921571D01*
X67730142Y-70778714D02*
X67730142Y-71445380D01*
X67344428Y-70778714D02*
X67344428Y-71302523D01*
X67387285Y-71397761D01*
X67473000Y-71445380D01*
X67601571Y-71445380D01*
X67687285Y-71397761D01*
X67730142Y-71350142D01*
X68030142Y-70778714D02*
X68373000Y-70778714D01*
X68158714Y-70445380D02*
X68158714Y-71302523D01*
X68201571Y-71397761D01*
X68287285Y-71445380D01*
X68373000Y-71445380D01*
X68544428Y-70778714D02*
X68887285Y-70778714D01*
X68673000Y-70445380D02*
X68673000Y-71302523D01*
X68715857Y-71397761D01*
X68801571Y-71445380D01*
X68887285Y-71445380D01*
X69315857Y-71445380D02*
X69230142Y-71397761D01*
X69187285Y-71350142D01*
X69144428Y-71254904D01*
X69144428Y-70969190D01*
X69187285Y-70873952D01*
X69230142Y-70826333D01*
X69315857Y-70778714D01*
X69444428Y-70778714D01*
X69530142Y-70826333D01*
X69573000Y-70873952D01*
X69615857Y-70969190D01*
X69615857Y-71254904D01*
X69573000Y-71350142D01*
X69530142Y-71397761D01*
X69444428Y-71445380D01*
X69315857Y-71445380D01*
X70001571Y-70778714D02*
X70001571Y-71445380D01*
X70001571Y-70873952D02*
X70044428Y-70826333D01*
X70130142Y-70778714D01*
X70258714Y-70778714D01*
X70344428Y-70826333D01*
X70387285Y-70921571D01*
X70387285Y-71445380D01*
X70815857Y-71445380D02*
X70815857Y-70445380D01*
X71030142Y-70445380D01*
X71158714Y-70493000D01*
X71244428Y-70588238D01*
X71287285Y-70683476D01*
X71330142Y-70873952D01*
X71330142Y-71016809D01*
X71287285Y-71207285D01*
X71244428Y-71302523D01*
X71158714Y-71397761D01*
X71030142Y-71445380D01*
X70815857Y-71445380D01*
X72187285Y-71445380D02*
X71673000Y-71445380D01*
X71930142Y-71445380D02*
X71930142Y-70445380D01*
X71844428Y-70588238D01*
X71758714Y-70683476D01*
X71673000Y-70731095D01*
X73044428Y-71445380D02*
X72530142Y-71445380D01*
X72787285Y-71445380D02*
X72787285Y-70445380D01*
X72701571Y-70588238D01*
X72615857Y-70683476D01*
X72530142Y-70731095D01*
X76123142Y-71572380D02*
X76123142Y-70572380D01*
X76337428Y-70572380D01*
X76466000Y-70620000D01*
X76551714Y-70715238D01*
X76594571Y-70810476D01*
X76637428Y-71000952D01*
X76637428Y-71143809D01*
X76594571Y-71334285D01*
X76551714Y-71429523D01*
X76466000Y-71524761D01*
X76337428Y-71572380D01*
X76123142Y-71572380D01*
X77494571Y-71572380D02*
X76980285Y-71572380D01*
X77237428Y-71572380D02*
X77237428Y-70572380D01*
X77151714Y-70715238D01*
X77066000Y-70810476D01*
X76980285Y-70858095D01*
X78351714Y-71572380D02*
X77837428Y-71572380D01*
X78094571Y-71572380D02*
X78094571Y-70572380D01*
X78008857Y-70715238D01*
X77923142Y-70810476D01*
X77837428Y-70858095D01*
X91490142Y-71572380D02*
X91490142Y-70572380D01*
X91704428Y-70572380D01*
X91833000Y-70620000D01*
X91918714Y-70715238D01*
X91961571Y-70810476D01*
X92004428Y-71000952D01*
X92004428Y-71143809D01*
X91961571Y-71334285D01*
X91918714Y-71429523D01*
X91833000Y-71524761D01*
X91704428Y-71572380D01*
X91490142Y-71572380D01*
X92861571Y-71572380D02*
X92347285Y-71572380D01*
X92604428Y-71572380D02*
X92604428Y-70572380D01*
X92518714Y-70715238D01*
X92433000Y-70810476D01*
X92347285Y-70858095D01*
X93204428Y-70667619D02*
X93247285Y-70620000D01*
X93333000Y-70572380D01*
X93547285Y-70572380D01*
X93633000Y-70620000D01*
X93675857Y-70667619D01*
X93718714Y-70762857D01*
X93718714Y-70858095D01*
X93675857Y-71000952D01*
X93161571Y-71572380D01*
X93718714Y-71572380D01*
X58729571Y-70085285D02*
X58729571Y-70385285D01*
X59253380Y-70385285D02*
X58253380Y-70385285D01*
X58253380Y-69956714D01*
X59253380Y-69613857D02*
X58586714Y-69613857D01*
X58777190Y-69613857D02*
X58681952Y-69571000D01*
X58634333Y-69528142D01*
X58586714Y-69442428D01*
X58586714Y-69356714D01*
X59253380Y-68928142D02*
X59205761Y-69013857D01*
X59158142Y-69056714D01*
X59062904Y-69099571D01*
X58777190Y-69099571D01*
X58681952Y-69056714D01*
X58634333Y-69013857D01*
X58586714Y-68928142D01*
X58586714Y-68799571D01*
X58634333Y-68713857D01*
X58681952Y-68671000D01*
X58777190Y-68628142D01*
X59062904Y-68628142D01*
X59158142Y-68671000D01*
X59205761Y-68713857D01*
X59253380Y-68799571D01*
X59253380Y-68928142D01*
X59253380Y-68242428D02*
X58586714Y-68242428D01*
X58681952Y-68242428D02*
X58634333Y-68199571D01*
X58586714Y-68113857D01*
X58586714Y-67985285D01*
X58634333Y-67899571D01*
X58729571Y-67856714D01*
X59253380Y-67856714D01*
X58729571Y-67856714D02*
X58634333Y-67813857D01*
X58586714Y-67728142D01*
X58586714Y-67599571D01*
X58634333Y-67513857D01*
X58729571Y-67471000D01*
X59253380Y-67471000D01*
X58967666Y-67085285D02*
X58967666Y-66656714D01*
X59253380Y-67171000D02*
X58253380Y-66871000D01*
X59253380Y-66571000D01*
X59253380Y-66271000D02*
X58586714Y-66271000D01*
X58777190Y-66271000D02*
X58681952Y-66228142D01*
X58634333Y-66185285D01*
X58586714Y-66099571D01*
X58586714Y-66013857D01*
X59253380Y-65328142D02*
X58253380Y-65328142D01*
X59205761Y-65328142D02*
X59253380Y-65413857D01*
X59253380Y-65585285D01*
X59205761Y-65671000D01*
X59158142Y-65713857D01*
X59062904Y-65756714D01*
X58777190Y-65756714D01*
X58681952Y-65713857D01*
X58634333Y-65671000D01*
X58586714Y-65585285D01*
X58586714Y-65413857D01*
X58634333Y-65328142D01*
X58586714Y-64513857D02*
X59253380Y-64513857D01*
X58586714Y-64899571D02*
X59110523Y-64899571D01*
X59205761Y-64856714D01*
X59253380Y-64771000D01*
X59253380Y-64642428D01*
X59205761Y-64556714D01*
X59158142Y-64513857D01*
X59253380Y-64085285D02*
X58586714Y-64085285D01*
X58253380Y-64085285D02*
X58301000Y-64128142D01*
X58348619Y-64085285D01*
X58301000Y-64042428D01*
X58253380Y-64085285D01*
X58348619Y-64085285D01*
X58586714Y-63656714D02*
X59253380Y-63656714D01*
X58681952Y-63656714D02*
X58634333Y-63613857D01*
X58586714Y-63528142D01*
X58586714Y-63399571D01*
X58634333Y-63313857D01*
X58729571Y-63271000D01*
X59253380Y-63271000D01*
X59253380Y-62713857D02*
X59205761Y-62799571D01*
X59158142Y-62842428D01*
X59062904Y-62885285D01*
X58777190Y-62885285D01*
X58681952Y-62842428D01*
X58634333Y-62799571D01*
X58586714Y-62713857D01*
X58586714Y-62585285D01*
X58634333Y-62499571D01*
X58681952Y-62456714D01*
X58777190Y-62413857D01*
X59062904Y-62413857D01*
X59158142Y-62456714D01*
X59205761Y-62499571D01*
X59253380Y-62585285D01*
X59253380Y-62713857D01*
X78029142Y-52014380D02*
X78029142Y-51014380D01*
X78243428Y-51014380D01*
X78372000Y-51062000D01*
X78457714Y-51157238D01*
X78500571Y-51252476D01*
X78543428Y-51442952D01*
X78543428Y-51585809D01*
X78500571Y-51776285D01*
X78457714Y-51871523D01*
X78372000Y-51966761D01*
X78243428Y-52014380D01*
X78029142Y-52014380D01*
X79314857Y-51347714D02*
X79314857Y-52014380D01*
X79100571Y-50966761D02*
X78886285Y-51681047D01*
X79443428Y-51681047D01*
X79786285Y-51633428D02*
X80472000Y-51633428D01*
X80900571Y-52014380D02*
X80900571Y-51014380D01*
X80900571Y-51490571D02*
X81414857Y-51490571D01*
X81414857Y-52014380D02*
X81414857Y-51014380D01*
X82186285Y-51966761D02*
X82100571Y-52014380D01*
X81929142Y-52014380D01*
X81843428Y-51966761D01*
X81800571Y-51871523D01*
X81800571Y-51490571D01*
X81843428Y-51395333D01*
X81929142Y-51347714D01*
X82100571Y-51347714D01*
X82186285Y-51395333D01*
X82229142Y-51490571D01*
X82229142Y-51585809D01*
X81800571Y-51681047D01*
X83000571Y-52014380D02*
X83000571Y-51490571D01*
X82957714Y-51395333D01*
X82872000Y-51347714D01*
X82700571Y-51347714D01*
X82614857Y-51395333D01*
X83000571Y-51966761D02*
X82914857Y-52014380D01*
X82700571Y-52014380D01*
X82614857Y-51966761D01*
X82572000Y-51871523D01*
X82572000Y-51776285D01*
X82614857Y-51681047D01*
X82700571Y-51633428D01*
X82914857Y-51633428D01*
X83000571Y-51585809D01*
X83300571Y-51347714D02*
X83643428Y-51347714D01*
X83429142Y-51014380D02*
X83429142Y-51871523D01*
X83472000Y-51966761D01*
X83557714Y-52014380D01*
X83643428Y-52014380D01*
X79591857Y-42235380D02*
X79591857Y-41235380D01*
X79591857Y-41711571D02*
X80106142Y-41711571D01*
X80106142Y-42235380D02*
X80106142Y-41235380D01*
X80877571Y-42187761D02*
X80791857Y-42235380D01*
X80620428Y-42235380D01*
X80534714Y-42187761D01*
X80491857Y-42092523D01*
X80491857Y-41711571D01*
X80534714Y-41616333D01*
X80620428Y-41568714D01*
X80791857Y-41568714D01*
X80877571Y-41616333D01*
X80920428Y-41711571D01*
X80920428Y-41806809D01*
X80491857Y-41902047D01*
X81691857Y-42235380D02*
X81691857Y-41711571D01*
X81649000Y-41616333D01*
X81563285Y-41568714D01*
X81391857Y-41568714D01*
X81306142Y-41616333D01*
X81691857Y-42187761D02*
X81606142Y-42235380D01*
X81391857Y-42235380D01*
X81306142Y-42187761D01*
X81263285Y-42092523D01*
X81263285Y-41997285D01*
X81306142Y-41902047D01*
X81391857Y-41854428D01*
X81606142Y-41854428D01*
X81691857Y-41806809D01*
X81991857Y-41568714D02*
X82334714Y-41568714D01*
X82120428Y-41235380D02*
X82120428Y-42092523D01*
X82163285Y-42187761D01*
X82249000Y-42235380D01*
X82334714Y-42235380D01*
X60579095Y-50046000D02*
X60483857Y-49998380D01*
X60341000Y-49998380D01*
X60198142Y-50046000D01*
X60102904Y-50141238D01*
X60055285Y-50236476D01*
X60007666Y-50426952D01*
X60007666Y-50569809D01*
X60055285Y-50760285D01*
X60102904Y-50855523D01*
X60198142Y-50950761D01*
X60341000Y-50998380D01*
X60436238Y-50998380D01*
X60579095Y-50950761D01*
X60626714Y-50903142D01*
X60626714Y-50569809D01*
X60436238Y-50569809D01*
X61055285Y-50998380D02*
X61055285Y-49998380D01*
X61626714Y-50998380D01*
X61626714Y-49998380D01*
X62102904Y-50998380D02*
X62102904Y-49998380D01*
X62341000Y-49998380D01*
X62483857Y-50046000D01*
X62579095Y-50141238D01*
X62626714Y-50236476D01*
X62674333Y-50426952D01*
X62674333Y-50569809D01*
X62626714Y-50760285D01*
X62579095Y-50855523D01*
X62483857Y-50950761D01*
X62341000Y-50998380D01*
X62102904Y-50998380D01*
X60721952Y-42743380D02*
X60150523Y-42743380D01*
X60436238Y-42743380D02*
X60436238Y-41743380D01*
X60341000Y-41886238D01*
X60245761Y-41981476D01*
X60150523Y-42029095D01*
X61102904Y-41838619D02*
X61150523Y-41791000D01*
X61245761Y-41743380D01*
X61483857Y-41743380D01*
X61579095Y-41791000D01*
X61626714Y-41838619D01*
X61674333Y-41933857D01*
X61674333Y-42029095D01*
X61626714Y-42171952D01*
X61055285Y-42743380D01*
X61674333Y-42743380D01*
X61960047Y-41743380D02*
X62293380Y-42743380D01*
X62626714Y-41743380D01*
X58253380Y-49399428D02*
X58253380Y-48885142D01*
X59253380Y-49142285D02*
X58253380Y-49142285D01*
X59253380Y-48456571D02*
X59205761Y-48542285D01*
X59158142Y-48585142D01*
X59062904Y-48628000D01*
X58777190Y-48628000D01*
X58681952Y-48585142D01*
X58634333Y-48542285D01*
X58586714Y-48456571D01*
X58586714Y-48328000D01*
X58634333Y-48242285D01*
X58681952Y-48199428D01*
X58777190Y-48156571D01*
X59062904Y-48156571D01*
X59158142Y-48199428D01*
X59205761Y-48242285D01*
X59253380Y-48328000D01*
X59253380Y-48456571D01*
X58967666Y-47813714D02*
X58967666Y-47385142D01*
X59253380Y-47899428D02*
X58253380Y-47599428D01*
X59253380Y-47299428D01*
X59253380Y-46999428D02*
X58586714Y-46999428D01*
X58777190Y-46999428D02*
X58681952Y-46956571D01*
X58634333Y-46913714D01*
X58586714Y-46828000D01*
X58586714Y-46742285D01*
X59253380Y-46056571D02*
X58253380Y-46056571D01*
X59205761Y-46056571D02*
X59253380Y-46142285D01*
X59253380Y-46313714D01*
X59205761Y-46399428D01*
X59158142Y-46442285D01*
X59062904Y-46485142D01*
X58777190Y-46485142D01*
X58681952Y-46442285D01*
X58634333Y-46399428D01*
X58586714Y-46313714D01*
X58586714Y-46142285D01*
X58634333Y-46056571D01*
X58586714Y-45242285D02*
X59253380Y-45242285D01*
X58586714Y-45628000D02*
X59110523Y-45628000D01*
X59205761Y-45585142D01*
X59253380Y-45499428D01*
X59253380Y-45370857D01*
X59205761Y-45285142D01*
X59158142Y-45242285D01*
X59253380Y-44813714D02*
X58586714Y-44813714D01*
X58253380Y-44813714D02*
X58301000Y-44856571D01*
X58348619Y-44813714D01*
X58301000Y-44770857D01*
X58253380Y-44813714D01*
X58348619Y-44813714D01*
X58586714Y-44385142D02*
X59253380Y-44385142D01*
X58681952Y-44385142D02*
X58634333Y-44342285D01*
X58586714Y-44256571D01*
X58586714Y-44128000D01*
X58634333Y-44042285D01*
X58729571Y-43999428D01*
X59253380Y-43999428D01*
X59253380Y-43442285D02*
X59205761Y-43528000D01*
X59158142Y-43570857D01*
X59062904Y-43613714D01*
X58777190Y-43613714D01*
X58681952Y-43570857D01*
X58634333Y-43528000D01*
X58586714Y-43442285D01*
X58586714Y-43313714D01*
X58634333Y-43228000D01*
X58681952Y-43185142D01*
X58777190Y-43142285D01*
X59062904Y-43142285D01*
X59158142Y-43185142D01*
X59205761Y-43228000D01*
X59253380Y-43313714D01*
X59253380Y-43442285D01*
D12*
X57023000Y-41021000D02*
X57023000Y-41275000D01*
X127254000Y-41021000D02*
X57023000Y-41021000D01*
X87309000Y-68326000D02*
X87309000Y-69656000D01*
X87309000Y-69656000D02*
X85979000Y-69656000D01*
X84709000Y-69656000D02*
X82109000Y-69656000D01*
X82109000Y-66996000D02*
X82109000Y-69656000D01*
X84709000Y-66996000D02*
X82109000Y-66996000D01*
X84709000Y-66996000D02*
X84709000Y-69656000D01*
X62671000Y-66802000D02*
X60011000Y-66802000D01*
X62671000Y-66802000D02*
X62671000Y-64202000D01*
X62671000Y-64202000D02*
X60011000Y-64202000D01*
X60011000Y-66802000D02*
X60011000Y-64202000D01*
X60011000Y-69402000D02*
X60011000Y-68072000D01*
X61341000Y-69402000D02*
X60011000Y-69402000D01*
X121268000Y-46624000D02*
X121268000Y-42784000D01*
X121268000Y-42784000D02*
X113428000Y-42784000D01*
X113428000Y-42784000D02*
X113428000Y-46624000D01*
X113428000Y-46624000D02*
X121268000Y-46624000D01*
X123528000Y-44704000D02*
X121268000Y-44704000D01*
X111168000Y-44704000D02*
X113428000Y-44704000D01*
X120008000Y-46624000D02*
X120008000Y-42784000D01*
X119888000Y-46624000D02*
X119888000Y-42784000D01*
X120128000Y-46624000D02*
X120128000Y-42784000D01*
X60138000Y-46355000D02*
X62798000Y-46355000D01*
X60138000Y-46355000D02*
X60138000Y-48955000D01*
X60138000Y-48955000D02*
X62798000Y-48955000D01*
X62798000Y-46355000D02*
X62798000Y-48955000D01*
X62798000Y-43755000D02*
X62798000Y-45085000D01*
X61468000Y-43755000D02*
X62798000Y-43755000D01*
X76230000Y-49279000D02*
X76230000Y-55339000D01*
X76230000Y-55339000D02*
X73420000Y-55339000D01*
X68820000Y-55339000D02*
X66010000Y-55339000D01*
X66010000Y-55339000D02*
X66010000Y-49279000D01*
X66010000Y-45179000D02*
X66010000Y-42119000D01*
X66010000Y-42119000D02*
X76230000Y-42119000D01*
X76230000Y-42119000D02*
X76230000Y-45179000D01*
X72120000Y-55529000D02*
X70120000Y-55529000D01*
X103445000Y-69656000D02*
X106105000Y-69656000D01*
X103445000Y-69536000D02*
X103445000Y-69656000D01*
X106105000Y-69536000D02*
X106105000Y-69656000D01*
X106105000Y-66996000D02*
X106105000Y-68326000D01*
X104775000Y-66996000D02*
X106105000Y-66996000D01*
X91380000Y-69656000D02*
X94040000Y-69656000D01*
X91380000Y-69536000D02*
X91380000Y-69656000D01*
X94040000Y-69536000D02*
X94040000Y-69656000D01*
X94040000Y-66996000D02*
X94040000Y-68326000D01*
X92710000Y-66996000D02*
X94040000Y-66996000D01*
X79442000Y-55305000D02*
X82102000Y-55305000D01*
X79442000Y-55185000D02*
X79442000Y-55305000D01*
X82102000Y-55185000D02*
X82102000Y-55305000D01*
X82102000Y-52645000D02*
X82102000Y-53975000D01*
X80772000Y-52645000D02*
X82102000Y-52645000D01*
X77343000Y-66996000D02*
X78673000Y-66996000D01*
X78673000Y-66996000D02*
X78673000Y-68326000D01*
X78673000Y-69536000D02*
X78673000Y-69656000D01*
X76013000Y-69536000D02*
X76013000Y-69656000D01*
X76013000Y-69656000D02*
X78673000Y-69656000D01*
X103251000Y-53026000D02*
X104581000Y-53026000D01*
X104581000Y-53026000D02*
X104581000Y-54356000D01*
X104581000Y-55566000D02*
X104581000Y-55686000D01*
X101921000Y-55566000D02*
X101921000Y-55686000D01*
X101921000Y-55686000D02*
X104581000Y-55686000D01*
X92148000Y-42704000D02*
X92148000Y-44214000D01*
X88447000Y-42704000D02*
X88447000Y-44214000D01*
X85177000Y-44214000D02*
X95417000Y-44214000D01*
X95417000Y-42704000D02*
X95417000Y-47345000D01*
X85177000Y-42704000D02*
X85177000Y-47345000D01*
X85177000Y-47345000D02*
X95417000Y-47345000D01*
X85177000Y-42704000D02*
X95417000Y-42704000D01*
X108418000Y-48165000D02*
X118658000Y-48165000D01*
X108418000Y-52806000D02*
X118658000Y-52806000D01*
X108418000Y-48165000D02*
X108418000Y-52806000D01*
X118658000Y-48165000D02*
X118658000Y-52806000D01*
X108418000Y-49675000D02*
X118658000Y-49675000D01*
X111688000Y-48165000D02*
X111688000Y-49675000D01*
X115389000Y-48165000D02*
X115389000Y-49675000D01*
X87132000Y-52535000D02*
X87132000Y-52055000D01*
X87132000Y-52055000D02*
X97272000Y-52055000D01*
X97272000Y-52055000D02*
X97272000Y-52535000D01*
X87132000Y-55415000D02*
X87132000Y-55895000D01*
X87132000Y-55895000D02*
X97272000Y-55895000D01*
X97272000Y-55895000D02*
X97272000Y-55415000D01*
X109414000Y-68326000D02*
X109414000Y-66996000D01*
X109414000Y-66996000D02*
X110744000Y-66996000D01*
X112014000Y-66996000D02*
X114614000Y-66996000D01*
X114614000Y-69656000D02*
X114614000Y-66996000D01*
X112014000Y-69656000D02*
X114614000Y-69656000D01*
X112014000Y-69656000D02*
X112014000Y-66996000D01*
X97526000Y-64150000D02*
X97526000Y-63670000D01*
X87386000Y-64150000D02*
X97526000Y-64150000D01*
X87386000Y-63670000D02*
X87386000Y-64150000D01*
X97526000Y-60310000D02*
X97526000Y-60790000D01*
X87386000Y-60310000D02*
X97526000Y-60310000D01*
X87386000Y-60790000D02*
X87386000Y-60310000D01*
X108595000Y-61933000D02*
X108595000Y-61453000D01*
X108595000Y-61453000D02*
X118735000Y-61453000D01*
X118735000Y-61453000D02*
X118735000Y-61933000D01*
X108595000Y-64813000D02*
X108595000Y-65293000D01*
X108595000Y-65293000D02*
X118735000Y-65293000D01*
X118735000Y-65293000D02*
X118735000Y-64813000D01*
X81153000Y-42993000D02*
X82483000Y-42993000D01*
X82483000Y-42993000D02*
X82483000Y-44323000D01*
X82483000Y-45593000D02*
X82483000Y-48193000D01*
X79823000Y-48193000D02*
X82483000Y-48193000D01*
X79823000Y-45593000D02*
X79823000Y-48193000D01*
X79823000Y-45593000D02*
X82483000Y-45593000D01*
X78603000Y-62146000D02*
X78603000Y-62626000D01*
X78603000Y-62626000D02*
X68463000Y-62626000D01*
X68463000Y-62626000D02*
X68463000Y-62146000D01*
X78603000Y-59266000D02*
X78603000Y-58786000D01*
X78603000Y-58786000D02*
X68463000Y-58786000D01*
X68463000Y-58786000D02*
X68463000Y-59266000D01*
X120132000Y-59832000D02*
X120132000Y-59352000D01*
X109992000Y-59832000D02*
X120132000Y-59832000D01*
X109992000Y-59352000D02*
X109992000Y-59832000D01*
X120132000Y-55992000D02*
X120132000Y-56472000D01*
X109992000Y-55992000D02*
X120132000Y-55992000D01*
X109992000Y-56472000D02*
X109992000Y-55992000D01*
X104327000Y-45974000D02*
X101667000Y-45974000D01*
X104327000Y-45974000D02*
X104327000Y-43374000D01*
X104327000Y-43374000D02*
X101667000Y-43374000D01*
X101667000Y-45974000D02*
X101667000Y-43374000D01*
X101667000Y-48574000D02*
X101667000Y-47244000D01*
X102997000Y-48574000D02*
X101667000Y-48574000D01*
X69723000Y-66996000D02*
X69723000Y-69656000D01*
X69723000Y-66996000D02*
X67123000Y-66996000D01*
X67123000Y-66996000D02*
X67123000Y-69656000D01*
X69723000Y-69656000D02*
X67123000Y-69656000D01*
X72323000Y-69656000D02*
X70993000Y-69656000D01*
X72323000Y-68326000D02*
X72323000Y-69656000D01*
D13*
X84391666Y-66190761D02*
X84534523Y-66238380D01*
X84772619Y-66238380D01*
X84867857Y-66190761D01*
X84915476Y-66143142D01*
X84963095Y-66047904D01*
X84963095Y-65952666D01*
X84915476Y-65857428D01*
X84867857Y-65809809D01*
X84772619Y-65762190D01*
X84582142Y-65714571D01*
X84486904Y-65666952D01*
X84439285Y-65619333D01*
X84391666Y-65524095D01*
X84391666Y-65428857D01*
X84439285Y-65333619D01*
X84486904Y-65286000D01*
X84582142Y-65238380D01*
X84820238Y-65238380D01*
X84963095Y-65286000D01*
X85296428Y-65238380D02*
X85534523Y-66238380D01*
X85725000Y-65524095D01*
X85915476Y-66238380D01*
X86153571Y-65238380D01*
X87058333Y-66238380D02*
X86486904Y-66238380D01*
X86772619Y-66238380D02*
X86772619Y-65238380D01*
X86677380Y-65381238D01*
X86582142Y-65476476D01*
X86486904Y-65524095D01*
X63547666Y-66000380D02*
X63547666Y-66714666D01*
X63500047Y-66857523D01*
X63404809Y-66952761D01*
X63261952Y-67000380D01*
X63166714Y-67000380D01*
X63976238Y-66095619D02*
X64023857Y-66048000D01*
X64119095Y-66000380D01*
X64357190Y-66000380D01*
X64452428Y-66048000D01*
X64500047Y-66095619D01*
X64547666Y-66190857D01*
X64547666Y-66286095D01*
X64500047Y-66428952D01*
X63928619Y-67000380D01*
X64547666Y-67000380D01*
X116228904Y-42362380D02*
X116228904Y-41362380D01*
X116467000Y-41362380D01*
X116609857Y-41410000D01*
X116705095Y-41505238D01*
X116752714Y-41600476D01*
X116800333Y-41790952D01*
X116800333Y-41933809D01*
X116752714Y-42124285D01*
X116705095Y-42219523D01*
X116609857Y-42314761D01*
X116467000Y-42362380D01*
X116228904Y-42362380D01*
X117752714Y-42362380D02*
X117181285Y-42362380D01*
X117467000Y-42362380D02*
X117467000Y-41362380D01*
X117371761Y-41505238D01*
X117276523Y-41600476D01*
X117181285Y-41648095D01*
X124706095Y-48077380D02*
X124706095Y-47077380D01*
X125277523Y-48077380D02*
X124848952Y-47505952D01*
X125277523Y-47077380D02*
X124706095Y-47648809D01*
X63674666Y-45807380D02*
X63674666Y-46521666D01*
X63627047Y-46664523D01*
X63531809Y-46759761D01*
X63388952Y-46807380D01*
X63293714Y-46807380D01*
X64674666Y-46807380D02*
X64103238Y-46807380D01*
X64388952Y-46807380D02*
X64388952Y-45807380D01*
X64293714Y-45950238D01*
X64198476Y-46045476D01*
X64103238Y-46093095D01*
X68881666Y-55586380D02*
X68881666Y-56300666D01*
X68834047Y-56443523D01*
X68738809Y-56538761D01*
X68595952Y-56586380D01*
X68500714Y-56586380D01*
X69262619Y-55586380D02*
X69881666Y-55586380D01*
X69548333Y-55967333D01*
X69691190Y-55967333D01*
X69786428Y-56014952D01*
X69834047Y-56062571D01*
X69881666Y-56157809D01*
X69881666Y-56395904D01*
X69834047Y-56491142D01*
X69786428Y-56538761D01*
X69691190Y-56586380D01*
X69405476Y-56586380D01*
X69310238Y-56538761D01*
X69262619Y-56491142D01*
X104441666Y-65008380D02*
X104441666Y-65722666D01*
X104394047Y-65865523D01*
X104298809Y-65960761D01*
X104155952Y-66008380D01*
X104060714Y-66008380D01*
X105346428Y-65341714D02*
X105346428Y-66008380D01*
X105108333Y-64960761D02*
X104870238Y-65675047D01*
X105489285Y-65675047D01*
X92884666Y-65238380D02*
X92884666Y-65952666D01*
X92837047Y-66095523D01*
X92741809Y-66190761D01*
X92598952Y-66238380D01*
X92503714Y-66238380D01*
X93837047Y-65238380D02*
X93360857Y-65238380D01*
X93313238Y-65714571D01*
X93360857Y-65666952D01*
X93456095Y-65619333D01*
X93694190Y-65619333D01*
X93789428Y-65666952D01*
X93837047Y-65714571D01*
X93884666Y-65809809D01*
X93884666Y-66047904D01*
X93837047Y-66143142D01*
X93789428Y-66190761D01*
X93694190Y-66238380D01*
X93456095Y-66238380D01*
X93360857Y-66190761D01*
X93313238Y-66143142D01*
X77898666Y-53554380D02*
X77898666Y-54268666D01*
X77851047Y-54411523D01*
X77755809Y-54506761D01*
X77612952Y-54554380D01*
X77517714Y-54554380D01*
X78803428Y-53554380D02*
X78612952Y-53554380D01*
X78517714Y-53602000D01*
X78470095Y-53649619D01*
X78374857Y-53792476D01*
X78327238Y-53982952D01*
X78327238Y-54363904D01*
X78374857Y-54459142D01*
X78422476Y-54506761D01*
X78517714Y-54554380D01*
X78708190Y-54554380D01*
X78803428Y-54506761D01*
X78851047Y-54459142D01*
X78898666Y-54363904D01*
X78898666Y-54125809D01*
X78851047Y-54030571D01*
X78803428Y-53982952D01*
X78708190Y-53935333D01*
X78517714Y-53935333D01*
X78422476Y-53982952D01*
X78374857Y-54030571D01*
X78327238Y-54125809D01*
X77009666Y-65008380D02*
X77009666Y-65722666D01*
X76962047Y-65865523D01*
X76866809Y-65960761D01*
X76723952Y-66008380D01*
X76628714Y-66008380D01*
X77390619Y-65008380D02*
X78057285Y-65008380D01*
X77628714Y-66008380D01*
X103679666Y-55967380D02*
X103679666Y-56681666D01*
X103632047Y-56824523D01*
X103536809Y-56919761D01*
X103393952Y-56967380D01*
X103298714Y-56967380D01*
X104298714Y-56395952D02*
X104203476Y-56348333D01*
X104155857Y-56300714D01*
X104108238Y-56205476D01*
X104108238Y-56157857D01*
X104155857Y-56062619D01*
X104203476Y-56015000D01*
X104298714Y-55967380D01*
X104489190Y-55967380D01*
X104584428Y-56015000D01*
X104632047Y-56062619D01*
X104679666Y-56157857D01*
X104679666Y-56205476D01*
X104632047Y-56300714D01*
X104584428Y-56348333D01*
X104489190Y-56395952D01*
X104298714Y-56395952D01*
X104203476Y-56443571D01*
X104155857Y-56491190D01*
X104108238Y-56586428D01*
X104108238Y-56776904D01*
X104155857Y-56872142D01*
X104203476Y-56919761D01*
X104298714Y-56967380D01*
X104489190Y-56967380D01*
X104584428Y-56919761D01*
X104632047Y-56872142D01*
X104679666Y-56776904D01*
X104679666Y-56586428D01*
X104632047Y-56491190D01*
X104584428Y-56443571D01*
X104489190Y-56395952D01*
X90201761Y-42251619D02*
X90106523Y-42204000D01*
X90011285Y-42108761D01*
X89868428Y-41965904D01*
X89773190Y-41918285D01*
X89677952Y-41918285D01*
X89725571Y-42156380D02*
X89630333Y-42108761D01*
X89535095Y-42013523D01*
X89487476Y-41823047D01*
X89487476Y-41489714D01*
X89535095Y-41299238D01*
X89630333Y-41204000D01*
X89725571Y-41156380D01*
X89916047Y-41156380D01*
X90011285Y-41204000D01*
X90106523Y-41299238D01*
X90154142Y-41489714D01*
X90154142Y-41823047D01*
X90106523Y-42013523D01*
X90011285Y-42108761D01*
X89916047Y-42156380D01*
X89725571Y-42156380D01*
X91106523Y-42156380D02*
X90535095Y-42156380D01*
X90820809Y-42156380D02*
X90820809Y-41156380D01*
X90725571Y-41299238D01*
X90630333Y-41394476D01*
X90535095Y-41442095D01*
X116363761Y-47918619D02*
X116268523Y-47871000D01*
X116173285Y-47775761D01*
X116030428Y-47632904D01*
X115935190Y-47585285D01*
X115839952Y-47585285D01*
X115887571Y-47823380D02*
X115792333Y-47775761D01*
X115697095Y-47680523D01*
X115649476Y-47490047D01*
X115649476Y-47156714D01*
X115697095Y-46966238D01*
X115792333Y-46871000D01*
X115887571Y-46823380D01*
X116078047Y-46823380D01*
X116173285Y-46871000D01*
X116268523Y-46966238D01*
X116316142Y-47156714D01*
X116316142Y-47490047D01*
X116268523Y-47680523D01*
X116173285Y-47775761D01*
X116078047Y-47823380D01*
X115887571Y-47823380D01*
X116697095Y-46918619D02*
X116744714Y-46871000D01*
X116839952Y-46823380D01*
X117078047Y-46823380D01*
X117173285Y-46871000D01*
X117220904Y-46918619D01*
X117268523Y-47013857D01*
X117268523Y-47109095D01*
X117220904Y-47251952D01*
X116649476Y-47823380D01*
X117268523Y-47823380D01*
X91019333Y-51506380D02*
X90686000Y-51030190D01*
X90447904Y-51506380D02*
X90447904Y-50506380D01*
X90828857Y-50506380D01*
X90924095Y-50554000D01*
X90971714Y-50601619D01*
X91019333Y-50696857D01*
X91019333Y-50839714D01*
X90971714Y-50934952D01*
X90924095Y-50982571D01*
X90828857Y-51030190D01*
X90447904Y-51030190D01*
X91971714Y-51506380D02*
X91400285Y-51506380D01*
X91686000Y-51506380D02*
X91686000Y-50506380D01*
X91590761Y-50649238D01*
X91495523Y-50744476D01*
X91400285Y-50792095D01*
X108799333Y-66619380D02*
X108466000Y-66143190D01*
X108227904Y-66619380D02*
X108227904Y-65619380D01*
X108608857Y-65619380D01*
X108704095Y-65667000D01*
X108751714Y-65714619D01*
X108799333Y-65809857D01*
X108799333Y-65952714D01*
X108751714Y-66047952D01*
X108704095Y-66095571D01*
X108608857Y-66143190D01*
X108227904Y-66143190D01*
X109180285Y-65714619D02*
X109227904Y-65667000D01*
X109323142Y-65619380D01*
X109561238Y-65619380D01*
X109656476Y-65667000D01*
X109704095Y-65714619D01*
X109751714Y-65809857D01*
X109751714Y-65905095D01*
X109704095Y-66047952D01*
X109132666Y-66619380D01*
X109751714Y-66619380D01*
X92289333Y-59762380D02*
X91956000Y-59286190D01*
X91717904Y-59762380D02*
X91717904Y-58762380D01*
X92098857Y-58762380D01*
X92194095Y-58810000D01*
X92241714Y-58857619D01*
X92289333Y-58952857D01*
X92289333Y-59095714D01*
X92241714Y-59190952D01*
X92194095Y-59238571D01*
X92098857Y-59286190D01*
X91717904Y-59286190D01*
X92622666Y-58762380D02*
X93241714Y-58762380D01*
X92908380Y-59143333D01*
X93051238Y-59143333D01*
X93146476Y-59190952D01*
X93194095Y-59238571D01*
X93241714Y-59333809D01*
X93241714Y-59571904D01*
X93194095Y-59667142D01*
X93146476Y-59714761D01*
X93051238Y-59762380D01*
X92765523Y-59762380D01*
X92670285Y-59714761D01*
X92622666Y-59667142D01*
X111212333Y-61285380D02*
X110879000Y-60809190D01*
X110640904Y-61285380D02*
X110640904Y-60285380D01*
X111021857Y-60285380D01*
X111117095Y-60333000D01*
X111164714Y-60380619D01*
X111212333Y-60475857D01*
X111212333Y-60618714D01*
X111164714Y-60713952D01*
X111117095Y-60761571D01*
X111021857Y-60809190D01*
X110640904Y-60809190D01*
X112069476Y-60618714D02*
X112069476Y-61285380D01*
X111831380Y-60237761D02*
X111593285Y-60952047D01*
X112212333Y-60952047D01*
X83653333Y-46680380D02*
X83320000Y-46204190D01*
X83081904Y-46680380D02*
X83081904Y-45680380D01*
X83462857Y-45680380D01*
X83558095Y-45728000D01*
X83605714Y-45775619D01*
X83653333Y-45870857D01*
X83653333Y-46013714D01*
X83605714Y-46108952D01*
X83558095Y-46156571D01*
X83462857Y-46204190D01*
X83081904Y-46204190D01*
X84558095Y-45680380D02*
X84081904Y-45680380D01*
X84034285Y-46156571D01*
X84081904Y-46108952D01*
X84177142Y-46061333D01*
X84415238Y-46061333D01*
X84510476Y-46108952D01*
X84558095Y-46156571D01*
X84605714Y-46251809D01*
X84605714Y-46489904D01*
X84558095Y-46585142D01*
X84510476Y-46632761D01*
X84415238Y-46680380D01*
X84177142Y-46680380D01*
X84081904Y-46632761D01*
X84034285Y-46585142D01*
X73366333Y-64078380D02*
X73033000Y-63602190D01*
X72794904Y-64078380D02*
X72794904Y-63078380D01*
X73175857Y-63078380D01*
X73271095Y-63126000D01*
X73318714Y-63173619D01*
X73366333Y-63268857D01*
X73366333Y-63411714D01*
X73318714Y-63506952D01*
X73271095Y-63554571D01*
X73175857Y-63602190D01*
X72794904Y-63602190D01*
X74223476Y-63078380D02*
X74033000Y-63078380D01*
X73937761Y-63126000D01*
X73890142Y-63173619D01*
X73794904Y-63316476D01*
X73747285Y-63506952D01*
X73747285Y-63887904D01*
X73794904Y-63983142D01*
X73842523Y-64030761D01*
X73937761Y-64078380D01*
X74128238Y-64078380D01*
X74223476Y-64030761D01*
X74271095Y-63983142D01*
X74318714Y-63887904D01*
X74318714Y-63649809D01*
X74271095Y-63554571D01*
X74223476Y-63506952D01*
X74128238Y-63459333D01*
X73937761Y-63459333D01*
X73842523Y-63506952D01*
X73794904Y-63554571D01*
X73747285Y-63649809D01*
X114895333Y-55444380D02*
X114562000Y-54968190D01*
X114323904Y-55444380D02*
X114323904Y-54444380D01*
X114704857Y-54444380D01*
X114800095Y-54492000D01*
X114847714Y-54539619D01*
X114895333Y-54634857D01*
X114895333Y-54777714D01*
X114847714Y-54872952D01*
X114800095Y-54920571D01*
X114704857Y-54968190D01*
X114323904Y-54968190D01*
X115228666Y-54444380D02*
X115895333Y-54444380D01*
X115466761Y-55444380D01*
X102830333Y-50466380D02*
X102497000Y-49990190D01*
X102258904Y-50466380D02*
X102258904Y-49466380D01*
X102639857Y-49466380D01*
X102735095Y-49514000D01*
X102782714Y-49561619D01*
X102830333Y-49656857D01*
X102830333Y-49799714D01*
X102782714Y-49894952D01*
X102735095Y-49942571D01*
X102639857Y-49990190D01*
X102258904Y-49990190D01*
X103401761Y-49894952D02*
X103306523Y-49847333D01*
X103258904Y-49799714D01*
X103211285Y-49704476D01*
X103211285Y-49656857D01*
X103258904Y-49561619D01*
X103306523Y-49514000D01*
X103401761Y-49466380D01*
X103592238Y-49466380D01*
X103687476Y-49514000D01*
X103735095Y-49561619D01*
X103782714Y-49656857D01*
X103782714Y-49704476D01*
X103735095Y-49799714D01*
X103687476Y-49847333D01*
X103592238Y-49894952D01*
X103401761Y-49894952D01*
X103306523Y-49942571D01*
X103258904Y-49990190D01*
X103211285Y-50085428D01*
X103211285Y-50275904D01*
X103258904Y-50371142D01*
X103306523Y-50418761D01*
X103401761Y-50466380D01*
X103592238Y-50466380D01*
X103687476Y-50418761D01*
X103735095Y-50371142D01*
X103782714Y-50275904D01*
X103782714Y-50085428D01*
X103735095Y-49990190D01*
X103687476Y-49942571D01*
X103592238Y-49894952D01*
X68516666Y-66063761D02*
X68659523Y-66111380D01*
X68897619Y-66111380D01*
X68992857Y-66063761D01*
X69040476Y-66016142D01*
X69088095Y-65920904D01*
X69088095Y-65825666D01*
X69040476Y-65730428D01*
X68992857Y-65682809D01*
X68897619Y-65635190D01*
X68707142Y-65587571D01*
X68611904Y-65539952D01*
X68564285Y-65492333D01*
X68516666Y-65397095D01*
X68516666Y-65301857D01*
X68564285Y-65206619D01*
X68611904Y-65159000D01*
X68707142Y-65111380D01*
X68945238Y-65111380D01*
X69088095Y-65159000D01*
X69421428Y-65111380D02*
X69659523Y-66111380D01*
X69850000Y-65397095D01*
X70040476Y-66111380D01*
X70278571Y-65111380D01*
X70611904Y-65206619D02*
X70659523Y-65159000D01*
X70754761Y-65111380D01*
X70992857Y-65111380D01*
X71088095Y-65159000D01*
X71135714Y-65206619D01*
X71183333Y-65301857D01*
X71183333Y-65397095D01*
X71135714Y-65539952D01*
X70564285Y-66111380D01*
X71183333Y-66111380D01*
M02*
