M48
METRIC
T1C1.000
T2C1.100
T3C1.200
T4C1.600
%
G90
G05
T1
X70.993Y-68.326
X61.341Y-68.072
X104.775Y-68.326
X83.439Y-68.326
X85.979Y-68.326
X102.997Y-44.704
X102.997Y-47.244
X61.468Y-45.085
X61.468Y-47.625
X92.71Y-68.326
X68.453Y-68.326
X103.251Y-54.356
X61.341Y-65.532
X80.772Y-53.975
X110.744Y-68.326
X113.284Y-68.326
X77.343Y-68.326
X81.153Y-44.323
X81.153Y-46.863
T2
X110.998Y-51.435
X113.538Y-51.435
X116.078Y-51.435
X87.757Y-45.974
X90.297Y-45.974
X92.837Y-45.974
T3
X67.183Y-60.706
X79.883Y-60.706
X86.106Y-62.23
X98.806Y-62.23
X85.852Y-53.975
X98.552Y-53.975
X109.728Y-44.704
X124.968Y-44.704
X107.315Y-63.373
X120.015Y-63.373
X108.712Y-57.912
X121.412Y-57.912
T4
X71.12Y-45.229
T1
G00X66.62Y-47.979
M15
G01X66.62Y-46.479
M16
G05
G00X71.77Y-48.229
M15
G01X70.47Y-48.229
M16
G05
G00X72.12Y-54.229
M15
G01X70.12Y-54.229
M16
G05
G00X75.62Y-47.979
M15
G01X75.62Y-46.479
M16
G05
T0
M30
