iter,  energyf,      energyf-r
0  ,   1.00000E+00 , 1.00000E+00   
1  ,   1.02142E-04 , 1.37580E-03
2  ,   2.64600E-05 , 3.28572E-04
3  ,   1.66436E-05 , 1.26893E-04
4  ,   1.49574E-05 , 5.61184E-05
5  ,   1.46606E-05 , 4.10858E-05
6  ,   1.46082E-05 , 3.85116E-05
7  ,   1.45989E-05 , 3.80643E-05
8  ,   1.45972E-05 , 3.79819E-05
9  ,   1.45968E-05 , 3.79662E-05
10 ,   1.45968E-05 , 3.79643E-05
11 ,   1.45968E-05 , 3.79623E-05
12 ,   1.45968E-05 , 3.79623E-05
13 ,   1.45964E-05 , 3.79623E-05
14 ,   1.45964E-05 , 3.79643E-05
15 ,   1.45964E-05 , 3.79623E-05
16 ,   1.45964E-05 , 3.79623E-05
17 ,   1.45972E-05 , 3.79623E-05
18 ,   1.45972E-05 , 3.79643E-05
19 ,   1.45972E-05 , 3.79643E-05
20 ,   1.45968E-05 , 3.79643E-05
21 ,   1.45964E-05 , 3.79643E-05
22 ,   1.45964E-05 , 3.79643E-05
23 ,   1.45964E-05 , 3.79643E-05
24 ,   1.45964E-05 , 3.79643E-05
25 ,   1.45964E-05 , 3.79643E-05
                  
