iter,id001a_energy,id001b_energy,id001c_energy,operationA,operationB,operationC,Test-a,Test-b,Test-c,e-a,e-b,e-c
0,5.12000000E+04,5.12000000E+03,5.12000000E+05,-1.00000000E+00,-2.00000000E+00,0.00000000E+00,1.00000000E-01,1.00000000E-02,1.00000000E+00,1.00000000E+00,1.00000000E+00,1.00000000E+00
1,2.53000000E-01,3.82000000E-02,2.55000000E+00,-6.30605573E+00,-7.12754531E+00,-5.30198969E+00,4.94250000E-07,7.45510000E-08,4.98900000E-06,4.94140625E-06,7.46093750E-06,4.98046875E-06
2,6.94000000E-03,1.91000000E-02,1.75000000E-02,-7.86816412E+00,-7.42806354E+00,-7.46711660E+00,1.35470000E-08,3.73200000E-08,3.41100000E-08,1.35546875E-07,3.73046875E-06,3.41796875E-08
3,1.53000000E-03,1.45000000E-02,4.39000000E-04,-8.52514408E+00,-7.54772279E+00,-9.06700335E+00,2.98440000E-09,2.83320000E-08,8.57030000E-10,2.98828125E-08,2.83203125E-06,8.57421875E-10
4,3.38000000E-04,1.11000000E-02,1.11000000E-05,-9.18038383E+00,-7.66330111E+00,-1.06648668E+01,6.60110000E-10,2.17120000E-08,2.16340000E-11,6.60156250E-09,2.16796875E-06,2.16796875E-11
5,7.48000000E-05,8.57000000E-03,2.80000000E-07,-9.83519288E+00,-7.77607776E+00,-1.22627666E+01,1.46150000E-10,1.67460000E-08,5.46050000E-13,1.46093750E-09,1.67382813E-06,5.46875000E-13
6,1.66000000E-05,6.64000000E-03,7.06000000E-09,-1.04899405E+01,-7.88678096E+00,-1.38606089E+01,3.23640000E-11,1.29780000E-08,1.37850000E-14,3.24218750E-10,1.29687500E-06,1.37890625E-14
7,3.67000000E-06,5.17000000E-03,1.78000000E-10,-1.11446629E+01,-7.99578725E+00,-1.54584979E+01,7.16700000E-12,1.00970000E-08,3.47940000E-16,7.16796875E-11,1.00976563E-06,3.47656250E-16
8,8.13000000E-07,4.03000000E-03,4.50000000E-12,-1.17993338E+01,-8.10361467E+00,-1.70564036E+01,1.58730000E-12,7.87740000E-09,8.78210000E-18,1.58789063E-11,7.87109375E-07,8.78906250E-18
9,1.80000000E-07,3.15000000E-03,1.14000000E-13,-1.24541070E+01,-8.21051416E+00,-1.86541382E+01,3.51470000E-13,6.15870000E-09,2.21750000E-19,3.51562500E-12,6.15234375E-07,2.22656250E-19
10,3.98000000E-08,2.47000000E-03,2.87000000E-15,-1.31088259E+01,-8.31670708E+00,-2.02519647E+01,7.78350000E-14,4.82270000E-09,5.59800000E-21,7.77343750E-13,4.82421875E-07,5.60546875E-21
11,8.83000000E-09,1.94000000E-03,7.24000000E-17,-1.37634959E+01,-8.42232766E+00,-2.18497600E+01,1.72390000E-14,3.78160000E-09,1.41330000E-22,1.72460938E-13,3.78906250E-07,1.41406250E-22
12,1.95000000E-09,1.52000000E-03,1.83000000E-18,-1.44182416E+01,-8.52756704E+00,-2.34476147E+01,3.81730000E-15,2.96780000E-09,3.56770000E-24,3.80859375E-14,2.96875000E-07,3.57421875E-24
13,4.33000000E-10,1.19000000E-03,4.61000000E-20,-1.50729635E+01,-8.63246094E+00,-2.50453778E+01,8.45350000E-16,2.33100000E-09,9.00790000E-26,8.45703125E-15,2.32421875E-07,9.00390625E-26
14,9.59000000E-11,9.38000000E-04,1.16000000E-21,-1.57275732E+01,-8.73710035E+00,-2.66433322E+01,1.87250000E-16,1.83190000E-09,2.27340000E-27,1.87304688E-15,1.83203125E-07,2.26562500E-27
15,2.12000000E-11,7.38000000E-04,2.94000000E-23,-1.63823015E+01,-8.84144856E+00,-2.82410997E+01,4.14670000E-17,1.44060000E-09,5.73980000E-29,4.14062500E-16,1.44140625E-07,5.74218750E-29
16,4.70000000E-12,5.80000000E-04,7.38000000E-25,-1.70369280E+01,-8.94571520E+00,-2.98412131E+01,9.18480000E-18,1.13310000E-09,1.44140000E-30,9.17968750E-17,1.13281250E-07,1.44140625E-30
17,1.04000000E-12,4.56000000E-04,1.86000000E-26,-1.76915930E+01,-9.04983640E+00,-3.14405390E+01,2.03430000E-18,8.91590000E-10,3.62630000E-32,2.03125000E-17,8.90625000E-08,3.63281250E-32
18,2.31000000E-13,3.59000000E-04,5.10000000E-28,-1.83462760E+01,-9.15386216E+00,-3.30017000E+01,4.50530000E-19,7.01680000E-10,9.96090000E-34,4.51171875E-18,7.01171875E-08,9.96093750E-34
19,5.11000000E-14,2.83000000E-04,2.54000000E-29,-1.90009257E+01,-9.25780797E+00,-3.43042572E+01,9.97870000E-20,5.52320000E-10,4.96300000E-35,9.98046875E-19,5.52734375E-08,4.96093750E-35
20,1.13000000E-14,2.23000000E-04,8.43000000E-30,-1.96555176E+01,-9.36170493E+00,-3.47832491E+01,2.21050000E-20,4.34810000E-10,1.64720000E-35,2.20703125E-19,4.35546875E-08,1.64648438E-35
