{
  "configs": [
    "global.xml",
    "dataweave-example.xml"
  ],
  "secureProperties": [],
  "redeploymentEnabled": true,
  "name": "dataweave-example",
  "minMuleVersion": "4.1.1",
  "requiredProduct": "MULE_EE",
  "classLoaderModelLoaderDescriptor": {
    "id": "mule",
    "attributes": {
      "exportedResources": [],
      "exportedPackages": [
      	"com.perficient.apimc.mule.ibmmq"
      ]
    }
  },
  "bundleDescriptorLoader": {
    "id": "mule",
    "attributes": {}
  }
}