<?xml version="1.0" encoding="utf-8"?>
<!-- Generator: Adobe Illustrator 22.0.1, SVG Export Plug-In . SVG Version: 6.00 Build 0)  -->
<svg version="1.1" id="レイヤー_1" xmlns="http://www.w3.org/2000/svg" xmlns:xlink="http://www.w3.org/1999/xlink" x="0px"
	 y="0px" viewBox="0 0 24 24" style="enable-background:new 0 0 24 24;" xml:space="preserve">
<style type="text/css">
	.st0{fill:none;}
</style>
<path class="st0" d="M0,0h24v24H0V0z"/>
<path d="M12,2C6.5,2,2,6.5,2,12s4.5,10,10,10s10-4.5,10-10S17.5,2,12,2z M12,20c-4.4,0-8-3.6-8-8s3.6-8,8-8s8,3.6,8,8S16.4,20,12,20
	z"/>
<g>
	<path d="M17.9,11.9l-3.5-3.4c0,0-0.1-0.1-0.1-0.1c0,0-0.1,0-0.1,0.1l-0.4,0.4c0,0-0.1,0.1-0.1,0.1s0,0.1,0.1,0.1l3,2.8l-3,2.8
		c0,0-0.1,0.1-0.1,0.1c0,0,0,0.1,0.1,0.1l0.4,0.4c0,0,0.1,0.1,0.1,0.1c0,0,0.1,0,0.1-0.1l3.6-3.4c0,0,0.1-0.1,0.1-0.1
		C18,11.9,17.9,11.9,17.9,11.9L17.9,11.9z M7.3,12l3-2.8c0,0,0.1-0.1,0.1-0.1s0-0.1-0.1-0.1L9.9,8.5c0,0-0.1-0.1-0.1-0.1
		s-0.1,0-0.1,0.1l-3.6,3.4C6,11.9,6,12,6,12s0,0.1,0.1,0.1l3.6,3.4c0,0,0.1,0.1,0.1,0.1c0,0,0.1,0,0.1-0.1l0.4-0.4
		c0,0,0.1-0.1,0.1-0.1c0,0,0-0.1-0.1-0.1L7.3,12z"/>
	<circle cx="12" cy="12" r="0.7"/>
	<circle cx="10" cy="12" r="0.7"/>
	<circle cx="14" cy="12" r="0.7"/>
</g>
</svg>
