<?xml version="1.0" encoding="utf-8"?>
<!-- Generator: Adobe Illustrator 22.0.1, SVG Export Plug-In . SVG Version: 6.00 Build 0)  -->
<svg version="1.1" id="レイヤー_1" xmlns="http://www.w3.org/2000/svg" xmlns:xlink="http://www.w3.org/1999/xlink" x="0px"
	 y="0px" viewBox="0 0 74 24" style="enable-background:new 0 0 74 24;" xml:space="preserve">
<style type="text/css">
	.st0{fill:#2A2A2A;}
	.st1{font-family:'KozGoPr6N-Regular-83pv-RKSJ-H';}
	.st2{font-size:12px;}
</style>
<title>アートボード 1</title>
<path class="st0" d="M62,4c4.4,0,8,3.6,8,8s-3.6,8-8,8H12c-4.4,0-8-3.6-8-8s3.6-8,8-8H62 M62,2H12C6.5,2,2,6.5,2,12l0,0
	c0,5.5,4.5,10,10,10h50c5.5,0,10-4.5,10-10l0,0C72,6.5,67.5,2,62,2z"/>
<text transform="matrix(1 0 0 1 7.8398 16.2461)" class="st1 st2">写真を撮る</text>
</svg>
