<?xml version="1.0" encoding="utf-8"?>
<!-- Generator: Adobe Illustrator 22.0.1, SVG Export Plug-In . SVG Version: 6.00 Build 0)  -->
<svg version="1.1" id="レイヤー_1" xmlns="http://www.w3.org/2000/svg" xmlns:xlink="http://www.w3.org/1999/xlink" x="0px"
	 y="0px" viewBox="0 0 24 24" style="enable-background:new 0 0 24 24;" xml:space="preserve">
<style type="text/css">
	.st0{fill:none;}
	.st1{fill:#2A2A2A;}
	.st2{fill:#FFFFFF;}
</style>
<path class="st0" d="M0,0h24v24H0V0z"/>
<path class="st1" d="M9,16h2V8H9V16z M12,2C6.5,2,2,6.5,2,12s4.5,10,10,10s10-4.5,10-10S17.5,2,12,2z M12,20c-4.4,0-8-3.6-8-8
	s3.6-8,8-8s8,3.6,8,8S16.4,20,12,20z M13,16h2V8h-2V16z"/>
<circle class="st2" cx="12" cy="12" r="8"/>
<path d="M10.7,8L9.9,8.9H8.4C8,8.9,7.6,9.3,7.6,9.8v5.3C7.6,15.6,8,16,8.4,16h7.1c0.5,0,0.9-0.4,0.9-0.9V9.8c0-0.5-0.4-0.9-0.9-0.9
	h-1.4L13.3,8H10.7z M12,14.7c-1.2,0-2.2-1-2.2-2.2s1-2.2,2.2-2.2s2.2,1,2.2,2.2S13.2,14.7,12,14.7z"/>
</svg>
