<?xml version="1.0" encoding="utf-8"?>
<!-- Generator: Adobe Illustrator 22.0.1, SVG Export Plug-In . SVG Version: 6.00 Build 0)  -->
<svg version="1.1" id="レイヤー_1" xmlns="http://www.w3.org/2000/svg" xmlns:xlink="http://www.w3.org/1999/xlink" x="0px"
	 y="0px" viewBox="0 0 24 24" style="enable-background:new 0 0 24 24;" xml:space="preserve">
<style type="text/css">
	.st0{fill:none;}
</style>
<path class="st0" d="M0,0h24v24H0V0z"/>
<path d="M12,2C6.5,2,2,6.5,2,12s4.5,10,10,10s10-4.5,10-10S17.5,2,12,2z M12,20c-4.4,0-8-3.6-8-8s3.6-8,8-8s8,3.6,8,8S16.4,20,12,20
	z"/>
<g>
	<path d="M12,8.5v1.7L14.3,8L12,5.7v1.7c-2.5,0-4.6,2.1-4.6,4.6c0,0.9,0.3,1.7,0.7,2.5L9,13.6c-0.3-0.5-0.4-1-0.4-1.6
		C8.5,10.1,10.1,8.5,12,8.5z M15.9,9.5L15,10.4c0.3,0.5,0.4,1,0.4,1.6c0,1.9-1.5,3.5-3.5,3.5v-1.7L9.7,16l2.3,2.3v-1.7
		c2.5,0,4.6-2.1,4.6-4.6C16.6,11.1,16.3,10.3,15.9,9.5z"/>
</g>
</svg>
