{
  "name": "",
  "css_prefix_text": "icon-",
  "css_use_suffix": false,
  "hinting": true,
  "units_per_em": 1000,
  "ascent": 850,
  "glyphs": [
    {
      "uid": "2616bd069ef4390e7162b72bb5493e6a",
      "css": "grid",
      "code": 59392,
      "src": "custom_icons",
      "selected": true,
      "svg": {
        "path": "M437.5 562.5L437.5 1000 0 1000 0 562.5 437.5 562.5ZM1000 562.5L1000 1000 562.5 1000 562.5 562.5 1000 562.5ZM437.5 0L437.5 437.5 0 437.5 0 0 437.5 0ZM1000 0L1000 437.5 562.5 437.5 562.5 0 1000 0Z",
        "width": 1000
      },
      "search": [
        "grid"
      ]
    },
    {
      "uid": "375c7c079087f668ed88d188268c85e1",
      "css": "list",
      "code": 59393,
      "src": "custom_icons",
      "selected": true,
      "svg": {
        "path": "M1000 750L1000 1000 0 1000 0 750 1000 750ZM1000 375L1000 625 0 625 0 375 1000 375ZM1000 0L1000 250 0 250 0 0 1000 0Z",
        "width": 1000
      },
      "search": [
        "list"
      ]
    }
  ]
}