<svg width="1440" height="209" viewBox="0 0 1440 209" fill="none" xmlns="http://www.w3.org/2000/svg">
<path d="M-63 0L166.556 126.231C193.719 141.168 224.216 149 255.215 149H1184.78C1215.78 149 1246.28 141.168 1273.44 126.231L1503 0" stroke="url(#paint0_linear_15_164)" stroke-width="4"/>
<path d="M-63 15L166.556 141.231C193.719 156.168 224.216 164 255.215 164H1184.78C1215.78 164 1246.28 156.168 1273.44 141.231L1503 15" stroke="url(#paint1_linear_15_164)" stroke-width="4"/>
<path d="M-63 30L166.556 156.231C193.719 171.168 224.216 179 255.215 179H1184.78C1215.78 179 1246.28 171.168 1273.44 156.231L1503 30" stroke="url(#paint2_linear_15_164)" stroke-width="4"/>
<path d="M-63 45L166.556 171.231C193.719 186.168 224.216 194 255.215 194H1184.78C1215.78 194 1246.28 186.168 1273.44 171.231L1503 45" stroke="url(#paint3_linear_15_164)" stroke-width="4"/>
<path d="M-63 60L166.556 186.231C193.719 201.168 224.216 209 255.215 209H1184.78C1215.78 209 1246.28 201.168 1273.44 186.231L1503 60" stroke="url(#paint4_linear_15_164)" stroke-width="4"/>
<defs>
<linearGradient id="paint0_linear_15_164" x1="6.50002" y1="44.9998" x2="1031.5" y2="40.4999" gradientUnits="userSpaceOnUse">
<stop stop-color="#323D7B"/>
<stop offset="1" stop-color="#1D244D" stop-opacity="0"/>
</linearGradient>
<linearGradient id="paint1_linear_15_164" x1="6.50002" y1="59.9998" x2="1031.5" y2="55.4999" gradientUnits="userSpaceOnUse">
<stop stop-color="#323D7B"/>
<stop offset="1" stop-color="#1D244D" stop-opacity="0"/>
</linearGradient>
<linearGradient id="paint2_linear_15_164" x1="6.50002" y1="74.9998" x2="1031.5" y2="70.4999" gradientUnits="userSpaceOnUse">
<stop stop-color="#323D7B"/>
<stop offset="1" stop-color="#1D244D" stop-opacity="0"/>
</linearGradient>
<linearGradient id="paint3_linear_15_164" x1="6.50002" y1="89.9998" x2="1031.5" y2="85.4999" gradientUnits="userSpaceOnUse">
<stop stop-color="#323D7B"/>
<stop offset="1" stop-color="#1D244D" stop-opacity="0"/>
</linearGradient>
<linearGradient id="paint4_linear_15_164" x1="6.50002" y1="105" x2="1031.5" y2="100.5" gradientUnits="userSpaceOnUse">
<stop stop-color="#323D7B"/>
<stop offset="1" stop-color="#1D244D" stop-opacity="0"/>
</linearGradient>
</defs>
</svg>
