<svg width="307" height="204" viewBox="0 0 307 204" fill="none" xmlns="http://www.w3.org/2000/svg">
<g filter="url(#filter0_d_1_1595)">
<path d="M86.1664 51.6664V106.932C86.1664 111.177 85.1757 115.046 83.1944 118.537C81.213 122.027 78.359 124.811 74.6322 126.886C70.9054 128.962 66.4238 130 61.1874 130H28.2123L28.2123 28.598H61.1874C66.4238 28.598 70.9054 29.6359 74.6322 31.7115C78.359 33.7872 81.213 36.5705 83.1944 40.0615C85.1757 43.5524 86.1664 47.4207 86.1664 51.6664ZM49.0163 112.876C50.3372 112.923 51.5402 112.946 52.6252 112.946C57.5314 112.946 60.81 112.451 62.4611 111.46C64.3953 110.328 65.3624 107.238 65.3624 102.191V56.4075C65.3624 51.3598 64.3953 48.2699 62.4611 47.1377C60.81 46.147 57.5314 45.6517 52.6252 45.6517C51.5402 45.6517 50.3372 45.6752 49.0163 45.7224V112.876ZM139.303 42.7504L128.83 42.3258V115.211L139.303 115.423V130H100.596L94.4399 116.838L108.026 115.848V42.3258L100.596 42.6797L94.4399 28.6688L139.303 28.598V42.7504ZM189.185 28.598H209.918V130H189.185V78.8391L174.183 58.9549V130H153.733V28.4565L173.758 28.5272L174.254 29.0933L189.185 48.836V28.598ZM278.764 46.147L246.992 44.2364V82.3064H278.764V99.8554L246.992 97.9448V114.291L278.764 112.38V129.929H246.992L226.258 130V99.8554L218.545 82.3064H226.258V28.598H278.764V46.147Z" fill="url(#paint0_linear_1_1595)"/>
<path d="M28.2123 130H25.8049V132.407H28.2123V130ZM28.2123 28.598V26.1906H25.8049V28.598H28.2123ZM49.0163 112.876H46.6089V115.199L48.9304 115.281L49.0163 112.876ZM62.4611 111.46L61.2449 109.383L61.2337 109.389L61.2225 109.396L62.4611 111.46ZM62.4611 47.1377L61.2225 49.202L61.2337 49.2087L61.2449 49.2153L62.4611 47.1377ZM49.0163 45.7224L48.9304 43.3165L46.6089 43.3995V45.7224H49.0163ZM83.759 51.6664V106.932H88.5738V51.6664H83.759ZM83.759 106.932C83.759 110.786 82.8644 114.241 81.1007 117.348L85.2881 119.725C87.487 115.851 88.5738 111.569 88.5738 106.932H83.759ZM81.1007 117.348C79.351 120.431 76.8273 122.908 73.4608 124.783L75.8036 128.99C79.8906 126.713 83.0751 123.624 85.2881 119.725L81.1007 117.348ZM73.4608 124.783C70.1651 126.619 66.1062 127.593 61.1874 127.593V132.407C66.7414 132.407 71.6457 131.305 75.8036 128.99L73.4608 124.783ZM61.1874 127.593H28.2123L28.2123 132.407H61.1874V127.593ZM30.6197 130V28.598H25.8049V130H30.6197ZM28.2123 31.0054H61.1874V26.1906H28.2123V31.0054ZM61.1874 31.0054C66.1062 31.0054 70.1651 31.9792 73.4608 33.8147L75.8036 29.6083C71.6457 27.2926 66.7414 26.1906 61.1874 26.1906V31.0054ZM73.4608 33.8147C76.8273 35.6898 79.351 38.1669 81.1007 41.2498L85.2881 38.8731C83.0751 34.9742 79.8906 31.8847 75.8036 29.6083L73.4608 33.8147ZM81.1007 41.2498C82.8644 44.3573 83.759 47.8124 83.759 51.6664H88.5738C88.5738 47.0291 87.487 42.7474 85.2881 38.8731L81.1007 41.2498ZM48.9304 115.281C50.274 115.329 51.5062 115.354 52.6252 115.354V110.539C51.5742 110.539 50.4004 110.516 49.1022 110.47L48.9304 115.281ZM52.6252 115.354C55.1474 115.354 57.3233 115.227 59.1234 114.955C60.8816 114.69 62.4771 114.258 63.6997 113.525L61.2225 109.396C60.794 109.653 59.9246 109.965 58.4042 110.194C56.9256 110.418 55.0092 110.539 52.6252 110.539V115.354ZM63.6773 113.538C65.3507 112.558 66.3508 110.878 66.9346 109.013C67.5198 107.143 67.7698 104.838 67.7698 102.191H62.9549C62.9549 104.591 62.7214 106.355 62.3395 107.575C61.9562 108.799 61.5057 109.23 61.2449 109.383L63.6773 113.538ZM67.7698 102.191V56.4075H62.9549V102.191H67.7698ZM67.7698 56.4075C67.7698 53.76 67.5198 51.455 66.9346 49.5852C66.3508 47.72 65.3507 46.0396 63.6773 45.06L61.2449 49.2153C61.5057 49.3679 61.9562 49.7986 62.3395 51.0233C62.7214 52.2435 62.9549 54.0073 62.9549 56.4075H67.7698ZM63.6997 45.0733C62.4771 44.3398 60.8816 43.9084 59.1234 43.6428C57.3233 43.3708 55.1474 43.2443 52.6252 43.2443V48.0591C55.0092 48.0591 56.9256 48.1802 58.4042 48.4036C59.9246 48.6333 60.794 48.9449 61.2225 49.202L63.6997 45.0733ZM52.6252 43.2443C51.5062 43.2443 50.274 43.2686 48.9304 43.3165L49.1022 48.1283C50.4004 48.0819 51.5742 48.0591 52.6252 48.0591V43.2443ZM46.6089 45.7224V112.876H51.4237V45.7224H46.6089ZM139.303 42.7504L139.205 45.1558L141.71 45.2574V42.7504H139.303ZM128.83 42.3258L128.928 39.9204L126.423 39.8189V42.3258H128.83ZM128.83 115.211H126.423V117.57L128.781 117.618L128.83 115.211ZM139.303 115.423H141.71V113.064L139.352 113.016L139.303 115.423ZM139.303 130V132.407H141.71V130H139.303ZM100.596 130L98.4155 131.02L99.0645 132.407H100.596V130ZM94.4399 116.838L94.2648 114.437L90.778 114.691L92.2592 117.858L94.4399 116.838ZM108.026 115.848L108.201 118.249L110.434 118.086V115.848H108.026ZM108.026 42.3258H110.434V39.8011L107.912 39.9212L108.026 42.3258ZM100.596 42.6797L98.3922 43.6481L99.0578 45.163L100.711 45.0843L100.596 42.6797ZM94.4399 28.6688L94.4361 26.2614L90.7551 26.2672L92.2359 29.6372L94.4399 28.6688ZM139.303 28.598H141.71V26.1868L139.299 26.1906L139.303 28.598ZM139.401 40.345L128.928 39.9204L128.733 44.7313L139.205 45.1558L139.401 40.345ZM126.423 42.3258V115.211H131.238V42.3258H126.423ZM128.781 117.618L139.254 117.83L139.352 113.016L128.879 112.804L128.781 117.618ZM136.896 115.423V130H141.71V115.423H136.896ZM139.303 127.593H100.596V132.407H139.303V127.593ZM102.777 128.98L96.6205 115.818L92.2592 117.858L98.4155 131.02L102.777 128.98ZM94.615 119.239L108.201 118.249L107.851 113.447L94.2648 114.437L94.615 119.239ZM110.434 115.848V42.3258H105.619V115.848H110.434ZM107.912 39.9212L100.482 40.275L100.711 45.0843L108.141 44.7305L107.912 39.9212ZM102.8 41.7112L96.6439 27.7003L92.2359 29.6372L98.3922 43.6481L102.8 41.7112ZM94.4437 31.0762L139.307 31.0054L139.299 26.1906L94.4361 26.2614L94.4437 31.0762ZM136.896 28.598V42.7504H141.71V28.598H136.896ZM189.185 28.598V26.1906H186.777V28.598H189.185ZM209.918 28.598H212.325V26.1906H209.918V28.598ZM209.918 130V132.407H212.325V130H209.918ZM189.185 130H186.777V132.407H189.185V130ZM189.185 78.8391H191.592V78.0328L191.106 77.3891L189.185 78.8391ZM174.183 58.9549L176.105 57.505L171.776 51.7668V58.9549H174.183ZM174.183 130V132.407H176.59V130H174.183ZM153.733 130H151.325V132.407H153.733V130ZM153.733 28.4565L153.741 26.0491L151.325 26.0406V28.4565H153.733ZM173.758 28.5272L175.57 26.942L174.854 26.1237L173.767 26.1199L173.758 28.5272ZM174.254 29.0933L176.174 27.6412L176.122 27.5727L176.066 27.5081L174.254 29.0933ZM189.185 48.8359L187.264 50.2881L191.592 56.0103V48.8359H189.185ZM189.185 31.0054H209.918V26.1906H189.185V31.0054ZM207.51 28.598V130H212.325V28.598H207.51ZM209.918 127.593H189.185V132.407H209.918V127.593ZM191.592 130V78.8391H186.777V130H191.592ZM191.106 77.3891L176.105 57.505L172.261 60.4048L187.263 80.289L191.106 77.3891ZM171.776 58.9549V130H176.59V58.9549H171.776ZM174.183 127.593H153.733V132.407H174.183V127.593ZM156.14 130V28.4565L151.325 28.4565V130H156.14ZM153.724 30.8639L173.75 30.9346L173.767 26.1199L153.741 26.0491L153.724 30.8639ZM171.947 30.1125L172.442 30.6786L176.066 27.5081L175.57 26.942L171.947 30.1125ZM172.334 30.5455L187.264 50.2881L191.105 47.3838L176.174 27.6412L172.334 30.5455ZM191.592 48.8359V28.598H186.777V48.8359H191.592ZM278.764 46.147L278.619 48.5501L281.171 48.7035V46.147H278.764ZM246.992 44.2364L247.136 41.8334L244.584 41.6799V44.2364H246.992ZM246.992 82.3064H244.584V84.7138H246.992V82.3064ZM278.764 82.3064H281.171V79.899H278.764V82.3064ZM278.764 99.8554L278.619 102.258L281.171 102.412V99.8554H278.764ZM246.992 97.9448L247.136 95.5417L244.584 95.3883V97.9448H246.992ZM246.992 114.291H244.584V116.847L247.136 116.694L246.992 114.291ZM278.764 112.38H281.171V109.824L278.619 109.977L278.764 112.38ZM278.764 129.929V132.337H281.171V129.929H278.764ZM246.992 129.929V127.522L246.983 127.522L246.992 129.929ZM226.258 130H223.851V132.416L226.266 132.407L226.258 130ZM226.258 99.8554H228.666V99.3497L228.462 98.8867L226.258 99.8554ZM218.545 82.3064V79.899H214.857L216.341 83.2751L218.545 82.3064ZM226.258 82.3064V84.7138H228.666V82.3064H226.258ZM226.258 28.598V26.1906H223.851V28.598H226.258ZM278.764 28.598H281.171V26.1906H278.764V28.598ZM278.908 43.7439L247.136 41.8334L246.847 46.6395L278.619 48.5501L278.908 43.7439ZM244.584 44.2364V82.3064H249.399V44.2364H244.584ZM246.992 84.7138H278.764V79.899H246.992V84.7138ZM276.356 82.3064V99.8554H281.171V82.3064H276.356ZM278.908 97.4523L247.136 95.5417L246.847 100.348L278.619 102.258L278.908 97.4523ZM244.584 97.9448V114.291H249.399V97.9448H244.584ZM247.136 116.694L278.908 114.783L278.619 109.977L246.847 111.888L247.136 116.694ZM276.356 112.38V129.929H281.171V112.38H276.356ZM278.764 127.522H246.992V132.337H278.764V127.522ZM246.983 127.522L226.25 127.593L226.266 132.407L247 132.337L246.983 127.522ZM228.666 130V99.8554H223.851V130H228.666ZM228.462 98.8867L220.749 81.3377L216.341 83.2751L224.054 100.824L228.462 98.8867ZM218.545 84.7138H226.258V79.899H218.545V84.7138ZM228.666 82.3064V28.598H223.851V82.3064H228.666ZM226.258 31.0054H278.764V26.1906H226.258V31.0054ZM276.356 28.598V46.147H281.171V28.598H276.356Z" fill="url(#paint1_linear_1_1595)"/>
</g>
<g filter="url(#filter1_d_1_1595)">
<path d="M177.449 170.345C178.213 170.345 178.801 170.698 179.212 171.403C179.682 172.108 179.917 173.078 179.917 174.311C179.917 176.603 179.359 178.425 178.243 179.776C174.952 183.713 171.75 186.474 168.636 188.061C165.58 189.647 161.878 190.441 157.53 190.441C154.475 190.441 151.654 190.059 149.069 189.295C146.484 188.531 143.34 187.385 139.638 185.858C136.465 184.506 133.645 183.419 131.177 182.596C128.474 185.534 126.036 187.591 123.862 188.766C121.687 189.882 119.396 190.441 116.987 190.441C113.755 190.441 111.17 189.706 109.231 188.237C107.292 186.71 106.322 184.741 106.322 182.332C106.322 180.51 106.91 178.836 108.085 177.308C109.319 175.78 111.023 174.576 113.197 173.694C115.371 172.813 117.898 172.372 120.777 172.372C122.422 172.372 123.656 172.402 124.478 172.461C135.995 158.123 146.395 142.993 155.679 127.07C150.626 126.188 145.485 125.747 140.255 125.747C133.498 125.747 128.533 126.541 125.36 128.127C122.246 129.655 120.689 132.093 120.689 135.443C120.689 136.442 120.806 137.294 121.041 137.999C121.276 138.704 121.629 139.526 122.099 140.466C122.628 141.524 122.892 142.288 122.892 142.758C122.892 143.933 122.334 144.932 121.217 145.755C120.16 146.519 118.926 146.901 117.516 146.901C116.047 146.901 114.842 146.46 113.902 145.578C112.786 144.58 111.875 143.228 111.17 141.524C110.523 139.761 110.2 137.793 110.2 135.619C110.2 128.744 113.05 123.662 118.75 120.371C124.449 117.081 131.97 115.435 141.313 115.435C145.955 115.435 150.685 115.7 155.503 116.229C160.38 116.757 164.934 117.609 169.164 118.785C170.927 119.255 172.102 119.93 172.69 120.812C173.278 121.634 173.571 122.721 173.571 124.073C173.571 125.659 173.16 126.893 172.337 127.775C171.515 128.656 170.369 129.097 168.9 129.097H168.283C161.937 139.438 155.503 149.368 148.981 158.887C143.751 166.467 140.079 171.609 137.964 174.311C141.372 175.075 144.339 175.78 146.866 176.427C149.98 177.249 152.477 177.866 154.357 178.278C156.296 178.63 157.971 178.806 159.381 178.806C162.789 178.806 165.698 178.248 168.107 177.132C170.575 175.957 172.896 174.106 175.07 171.579C175.775 170.757 176.568 170.345 177.449 170.345ZM221.19 162.942C221.954 162.942 222.541 163.324 222.953 164.087C223.364 164.851 223.57 165.821 223.57 166.996C223.57 169.816 222.718 171.491 221.014 172.02C217.488 173.254 213.61 173.959 209.379 174.135C208.263 179.071 206.06 183.037 202.769 186.034C199.479 188.972 195.747 190.441 191.576 190.441C188.05 190.441 185.024 189.589 182.497 187.885C180.029 186.181 178.149 183.918 176.857 181.098C175.564 178.278 174.917 175.222 174.917 171.932C174.917 167.466 175.769 163.5 177.473 160.033C179.177 156.508 181.528 153.775 184.525 151.836C187.521 149.838 190.841 148.84 194.484 148.84C198.95 148.84 202.534 150.397 205.237 153.511C207.999 156.566 209.614 160.356 210.085 164.881C212.846 164.704 216.137 164.117 219.956 163.118C220.426 163 220.837 162.942 221.19 162.942ZM192.281 181.098C194.161 181.098 195.777 180.334 197.128 178.806C198.538 177.279 199.479 175.075 199.949 172.196C198.127 170.962 196.717 169.346 195.718 167.349C194.778 165.351 194.308 163.235 194.308 161.003C194.308 160.062 194.396 159.122 194.572 158.182H194.132C191.781 158.182 189.813 159.328 188.226 161.62C186.699 163.852 185.935 167.025 185.935 171.138C185.935 174.37 186.552 176.838 187.786 178.542C189.078 180.246 190.577 181.098 192.281 181.098ZM220.5 190.441C218.267 190.441 216.681 189.266 215.74 186.915C214.859 184.565 214.418 180.804 214.418 175.634C214.418 167.995 215.505 160.738 217.68 153.863C218.208 152.159 219.06 150.926 220.236 150.162C221.469 149.339 223.173 148.928 225.348 148.928C226.523 148.928 227.345 149.075 227.815 149.368C228.285 149.662 228.52 150.22 228.52 151.043C228.52 151.983 228.08 154.098 227.198 157.389C226.611 159.739 226.141 161.796 225.788 163.559C225.436 165.321 225.142 167.495 224.907 170.081C226.846 165.028 229.02 160.914 231.429 157.742C233.838 154.569 236.188 152.306 238.48 150.955C240.83 149.603 242.975 148.928 244.914 148.928C248.733 148.928 250.643 150.837 250.643 154.657C250.643 156.948 249.997 161.091 248.704 167.084C247.588 172.196 247.029 175.575 247.029 177.22C247.029 179.57 247.881 180.746 249.585 180.746C250.761 180.746 252.141 180.04 253.728 178.63C255.373 177.161 257.547 174.811 260.25 171.579C260.955 170.757 261.748 170.345 262.63 170.345C263.394 170.345 263.981 170.698 264.393 171.403C264.863 172.108 265.098 173.078 265.098 174.311C265.098 176.662 264.54 178.483 263.423 179.776C260.896 182.89 258.164 185.446 255.226 187.444C252.347 189.442 249.057 190.441 245.355 190.441C242.358 190.441 240.096 189.589 238.568 187.885C237.04 186.122 236.277 183.595 236.277 180.305C236.277 178.66 236.688 175.722 237.511 171.491C238.274 167.789 238.656 165.233 238.656 163.823C238.656 162.883 238.333 162.413 237.687 162.413C236.923 162.413 235.836 163.412 234.426 165.41C233.074 167.349 231.664 169.934 230.195 173.166C228.785 176.397 227.639 179.805 226.758 183.39C226.111 186.151 225.348 188.032 224.466 189.03C223.644 189.971 222.321 190.441 220.5 190.441ZM287.757 172.989C288.521 172.989 289.109 173.342 289.52 174.047C289.99 174.752 290.225 175.722 290.225 176.956C290.225 179.071 289.726 180.892 288.727 182.42C287.082 184.947 284.908 186.915 282.205 188.325C279.561 189.736 276.388 190.441 272.686 190.441C267.045 190.441 262.668 188.766 259.553 185.417C256.439 182.009 254.882 177.426 254.882 171.667C254.882 167.613 255.734 163.852 257.438 160.386C259.142 156.86 261.492 154.069 264.489 152.013C267.544 149.956 270.982 148.928 274.801 148.928C278.209 148.928 280.941 149.956 282.998 152.013C285.055 154.01 286.083 156.743 286.083 160.209C286.083 164.264 284.614 167.76 281.676 170.698C278.797 173.577 273.861 175.869 266.869 177.573C268.279 180.275 270.659 181.627 274.008 181.627C276.417 181.627 278.385 181.069 279.913 179.952C281.5 178.836 283.321 176.956 285.378 174.311C286.083 173.43 286.876 172.989 287.757 172.989ZM273.303 157.565C271.129 157.565 269.278 158.829 267.75 161.355C266.281 163.882 265.547 166.937 265.547 170.522V170.698C269.013 169.875 271.746 168.641 273.744 166.996C275.741 165.351 276.74 163.441 276.74 161.267C276.74 160.151 276.417 159.269 275.771 158.623C275.183 157.918 274.36 157.565 273.303 157.565Z" fill="#ED1F98"/>
</g>
<defs>
<filter id="filter0_d_1_1595" x="0.527094" y="0.771357" width="305.922" height="156.914" filterUnits="userSpaceOnUse" color-interpolation-filters="sRGB">
<feFlood flood-opacity="0" result="BackgroundImageFix"/>
<feColorMatrix in="SourceAlpha" type="matrix" values="0 0 0 0 0 0 0 0 0 0 0 0 0 0 0 0 0 0 127 0" result="hardAlpha"/>
<feOffset/>
<feGaussianBlur stdDeviation="13.8426"/>
<feComposite in2="hardAlpha" operator="out"/>
<feColorMatrix type="matrix" values="0 0 0 0 0.894118 0 0 0 0 0.756863 0 0 0 0 0.447059 0 0 0 0.23 0"/>
<feBlend mode="normal" in2="BackgroundImageFix" result="effect1_dropShadow_1_1595"/>
<feBlend mode="normal" in="SourceGraphic" in2="effect1_dropShadow_1_1595" result="shape"/>
</filter>
<filter id="filter1_d_1_1595" x="94.0807" y="103.194" width="208.386" height="99.4881" filterUnits="userSpaceOnUse" color-interpolation-filters="sRGB">
<feFlood flood-opacity="0" result="BackgroundImageFix"/>
<feColorMatrix in="SourceAlpha" type="matrix" values="0 0 0 0 0 0 0 0 0 0 0 0 0 0 0 0 0 0 127 0" result="hardAlpha"/>
<feOffset/>
<feGaussianBlur stdDeviation="6.12069"/>
<feComposite in2="hardAlpha" operator="out"/>
<feColorMatrix type="matrix" values="0 0 0 0 0.85098 0 0 0 0 0.00784314 0 0 0 0 0.501961 0 0 0 1 0"/>
<feBlend mode="normal" in2="BackgroundImageFix" result="effect1_dropShadow_1_1595"/>
<feBlend mode="normal" in="SourceGraphic" in2="effect1_dropShadow_1_1595" result="shape"/>
</filter>
<linearGradient id="paint0_linear_1_1595" x1="158" y1="27" x2="158" y2="129.6" gradientUnits="userSpaceOnUse">
<stop stop-color="#FAFFF3"/>
<stop offset="0.270481" stop-color="#E8C473"/>
<stop offset="0.435804" stop-color="#D9B568"/>
<stop offset="0.476216" stop-color="#C49013"/>
<stop offset="0.626842" stop-color="#E6D76D"/>
<stop offset="0.814873" stop-color="white"/>
<stop offset="1" stop-color="#DBB554"/>
</linearGradient>
<linearGradient id="paint1_linear_1_1595" x1="149.172" y1="21" x2="159.203" y2="128.719" gradientUnits="userSpaceOnUse">
<stop stop-color="#755F22"/>
<stop offset="0.519449" stop-color="white"/>
<stop offset="1" stop-color="#77632A"/>
</linearGradient>
</defs>
</svg>
