<svg width="351" height="76" viewBox="0 0 351 76" fill="none" xmlns="http://www.w3.org/2000/svg">
<g clip-path="url(#clip0_71_152)">
<path d="M5.38646 -32.3156C6.08717 -46.1459 17.5051 -57 31.3532 -57H320.164C334.061 -57 345.502 -46.0718 346.137 -32.1894L349.755 46.8106C350.433 61.6214 338.608 74 323.782 74H27.3506C12.4745 74 0.631209 61.5415 1.38394 46.6844L5.38646 -32.3156Z" fill="url(#paint0_linear_71_152)" stroke="url(#paint1_linear_71_152)" stroke-width="3"/>
</g>
<defs>
<linearGradient id="paint0_linear_71_152" x1="175.5" y1="-57" x2="175.5" y2="74" gradientUnits="userSpaceOnUse">
<stop stop-color="#2B356F"/>
<stop offset="1" stop-color="#111634"/>
</linearGradient>
<linearGradient id="paint1_linear_71_152" x1="175.5" y1="-28.7896" x2="175.5" y2="74" gradientUnits="userSpaceOnUse">
<stop offset="0.413592" stop-color="#1F2753" stop-opacity="0"/>
<stop offset="1" stop-color="#394796"/>
</linearGradient>
<clipPath id="clip0_71_152">
<rect width="351" height="76" fill="white"/>
</clipPath>
</defs>
</svg>
