{
  "swagger": "2.0",
  "info": {
    "title": "connectrpc/questions/v1/questions.proto",
    "version": "version not set"
  },
  "tags": [
    {
      "name": "QuestionsService"
    }
  ],
  "consumes": [
    "application/json"
  ],
  "produces": [
    "application/json"
  ],
  "paths": {},
  "definitions": {
    "v1DifficultyLevel": {
      "type": "string",
      "enum": [
        "DIFFICULTY_LEVEL_UNSPECIFIED",
        "DIFFICULTY_LEVEL_EASY",
        "DIFFICULTY_LEVEL_MEDIUM",
        "DIFFICULTY_LEVEL_HARD"
      ],
      "default": "DIFFICULTY_LEVEL_UNSPECIFIED"
    },
    "v1GenerateQuestionSetResponse": {
      "type": "object",
      "properties": {
        "questionSet": {
          "$ref": "#/definitions/v1QuestionSet"
        }
      }
    },
    "v1GetQuestionSetResponse": {
      "type": "object",
      "properties": {
        "questionSet": {
          "$ref": "#/definitions/v1QuestionSet"
        }
      }
    },
    "v1Question": {
      "type": "object",
      "properties": {
        "id": {
          "type": "string"
        },
        "type": {
          "$ref": "#/definitions/v1QuestionType"
        },
        "query": {
          "type": "string"
        },
        "answer": {
          "type": "string"
        }
      }
    },
    "v1QuestionSet": {
      "type": "object",
      "properties": {
        "id": {
          "type": "string"
        },
        "level": {
          "$ref": "#/definitions/v1DifficultyLevel"
        },
        "questions": {
          "type": "array",
          "items": {
            "type": "object",
            "$ref": "#/definitions/v1Question"
          }
        },
        "shuffle": {
          "type": "boolean"
        }
      }
    },
    "v1QuestionType": {
      "type": "string",
      "enum": [
        "QUESTION_TYPE_UNSPECIFIED",
        "QUESTION_TYPE_BINARY_TO_DECIMAL",
        "QUESTION_TYPE_DECIMAL_TO_BINARY"
      ],
      "default": "QUESTION_TYPE_UNSPECIFIED"
    }
  }
}
