{
  "swagger": "2.0",
  "info": {
    "title": "gateway/events/v1/events.proto",
    "version": "version not set"
  },
  "tags": [
    {
      "name": "EventsService"
    }
  ],
  "consumes": [
    "application/json"
  ],
  "produces": [
    "application/json"
  ],
  "paths": {},
  "definitions": {
    "gatewayeventsv1DifficultyLevel": {
      "type": "string",
      "enum": [
        "DIFFICULTY_LEVEL_UNSPECIFIED",
        "DIFFICULTY_LEVEL_EASY",
        "DIFFICULTY_LEVEL_MEDIUM",
        "DIFFICULTY_LEVEL_HARD"
      ],
      "default": "DIFFICULTY_LEVEL_UNSPECIFIED"
    },
    "v1Event": {
      "type": "object",
      "properties": {
        "eventId": {
          "type": "string"
        },
        "eventTime": {
          "type": "string",
          "format": "date-time"
        },
        "eventType": {
          "$ref": "#/definitions/v1EventType"
        },
        "roomId": {
          "type": "string"
        },
        "description": {
          "type": "string"
        },
        "genericEvent": {
          "$ref": "#/definitions/v1GenericEvent"
        },
        "userEvent": {
          "$ref": "#/definitions/v1RoomUserEvent"
        },
        "roomStartingEvent": {
          "$ref": "#/definitions/v1RoomStartingEvent",
          "title": "Multiple microservices"
        },
        "userJoinedEvent": {
          "$ref": "#/definitions/v1UserJoinedEvent"
        },
        "guessEvent": {
          "$ref": "#/definitions/v1GuessEvent"
        },
        "leaderboardUpdatedEvent": {
          "$ref": "#/definitions/v1LeaderboardUpdatedEvent"
        }
      },
      "title": "Message representing an event"
    },
    "v1EventType": {
      "type": "string",
      "enum": [
        "EVENT_TYPE_UNSPECIFIED",
        "EVENT_TYPE_ROOM_STARTING",
        "EVENT_TYPE_ROOM_PLAYING",
        "EVENT_TYPE_ROOM_ENDING",
        "EVENT_TYPE_ROOM_USER_JOINED",
        "EVENT_TYPE_ROOM_USER_LEFT",
        "EVENT_TYPE_ROOM_USER_BANNED",
        "EVENT_TYPE_ROOM_USER_UNBANNED",
        "EVENT_TYPE_ROOM_USER_HOST_CHANGED",
        "EVENT_TYPE_ROOM_USER_LOST_CONNECTION",
        "EVENT_TYPE_GUESS_SUBMITTED",
        "EVENT_TYPE_LEADERBOARD_UPDATED"
      ],
      "default": "EVENT_TYPE_UNSPECIFIED",
      "title": "Enum for different types of events"
    },
    "v1GenericEvent": {
      "type": "object",
      "title": "Used when no data is present at the event"
    },
    "v1GuessEvent": {
      "type": "object",
      "properties": {
        "userId": {
          "type": "string"
        },
        "questionId": {
          "type": "string"
        },
        "correct": {
          "type": "boolean"
        }
      }
    },
    "v1LeaderboardData": {
      "type": "object",
      "properties": {
        "ranks": {
          "type": "array",
          "items": {
            "type": "object",
            "$ref": "#/definitions/v1RankElement"
          }
        }
      }
    },
    "v1LeaderboardUpdatedEvent": {
      "type": "object",
      "properties": {
        "data": {
          "$ref": "#/definitions/v1LeaderboardData"
        }
      }
    },
    "v1Question": {
      "type": "object",
      "properties": {
        "id": {
          "type": "string"
        },
        "type": {
          "$ref": "#/definitions/v1QuestionType"
        },
        "query": {
          "type": "string"
        },
        "answer": {
          "type": "string"
        }
      }
    },
    "v1QuestionSet": {
      "type": "object",
      "properties": {
        "id": {
          "type": "string"
        },
        "level": {
          "$ref": "#/definitions/gatewayeventsv1DifficultyLevel"
        },
        "questions": {
          "type": "array",
          "items": {
            "type": "object",
            "$ref": "#/definitions/v1Question"
          }
        }
      }
    },
    "v1QuestionType": {
      "type": "string",
      "enum": [
        "QUESTION_TYPE_UNSPECIFIED",
        "QUESTION_TYPE_BINARY_TO_DECIMAL",
        "QUESTION_TYPE_DECIMAL_TO_BINARY"
      ],
      "default": "QUESTION_TYPE_UNSPECIFIED"
    },
    "v1RankElement": {
      "type": "object",
      "properties": {
        "userId": {
          "type": "string"
        },
        "score": {
          "type": "number",
          "format": "float"
        },
        "comboMultiplierIdx": {
          "type": "integer",
          "format": "int64"
        },
        "comboMultiplier": {
          "type": "number",
          "format": "float"
        }
      }
    },
    "v1RoomStartingEvent": {
      "type": "object",
      "properties": {
        "questions": {
          "$ref": "#/definitions/v1QuestionSet"
        },
        "startsIn": {
          "type": "string"
        }
      }
    },
    "v1RoomUserEvent": {
      "type": "object",
      "properties": {
        "userId": {
          "type": "string"
        }
      }
    },
    "v1SubscribeEventsResponse": {
      "type": "object",
      "properties": {
        "event": {
          "$ref": "#/definitions/v1Event"
        }
      }
    },
    "v1UserJoinedEvent": {
      "type": "object",
      "properties": {
        "userId": {
          "type": "string"
        },
        "nickname": {
          "type": "string"
        },
        "emoji": {
          "type": "string"
        }
      }
    }
  }
}
