{
  "compilerOptions": {
    "baseUrl": ".",
    "paths": {
      "@/styles/*": ["./src/styles/*"],
      "@/layouts/*": ["./src/layouts/*"],
      "@/components/*": ["./src/components/*"],
      "@/containers/*": ["./src/containers/*"],
      "@/redux/*": ["./src/redux/*"],
      "@/images/*": ["./public/*"],
      "@/lib/*": ["./src/libraries/*"],
    }
  },
}