<?xml version="1.0" standalone="no"?>
<!DOCTYPE svg PUBLIC "-//W3C//DTD SVG 20010904//EN"
 "http://www.w3.org/TR/2001/REC-SVG-20010904/DTD/svg10.dtd">
<svg version="1.0" xmlns="http://www.w3.org/2000/svg"
 width="341.000000pt" height="341.000000pt" viewBox="0 0 341.000000 341.000000"
 preserveAspectRatio="xMidYMid meet">
<metadata>
Created by potrace 1.14, written by Peter Selinger 2001-2017
</metadata>
<g transform="translate(0.000000,341.000000) scale(0.100000,-0.100000)"
fill="#000000" stroke="none">
<path d="M531 2263 c0 -646 5 -1176 10 -1213 20 -145 25 -165 55 -263 69 -220
212 -419 394 -552 52 -38 255 -148 288 -156 10 -2 21 -6 77 -23 157 -49 435
-57 605 -18 222 52 408 156 571 321 142 143 230 286 283 461 28 93 33 124 43
247 l6 83 -427 0 -426 0 0 -30 c0 -54 -38 -135 -87 -184 -79 -80 -144 -104
-280 -100 -139 4 -204 42 -241 139 -11 30 -15 47 -28 134 -11 74 -10 560 1
564 17 6 338 0 373 -7 151 -30 246 -122 259 -252 3 -30 9 -54 12 -55 8 0 812
0 830 0 30 2 -10 265 -60 400 -165 445 -532 712 -1024 747 -55 4 -167 7 -249
8 l-150 1 0 448 0 447 -418 0 -418 0 1 -1147z"/>
</g>
</svg>
