<svg width="312" height="320" viewBox="0 0 312 320" fill="none" xmlns="http://www.w3.org/2000/svg">
<path d="M114.781 241.72H15.0098V318.672H114.781V241.72Z" fill="#EBEBEB"/>
<path d="M89.7901 318.135C89.656 318.135 89.541 300.978 89.541 279.816C89.541 258.655 89.656 241.498 89.7901 241.498C89.9242 241.498 90.0392 258.655 90.0392 279.816C90.0392 300.978 89.9242 318.135 89.7901 318.135Z" fill="#E0E0E0"/>
<path d="M106.324 301.16H98.6797V309.811H106.324V301.16Z" fill="#FAFAFA"/>
<path d="M56.7877 241.919H45.4551V258.338H56.7877V241.919Z" fill="#E0E0E0"/>
<path d="M56.7877 302.023H45.4551V318.443H56.7877V302.023Z" fill="#E0E0E0"/>
<path d="M295.826 222.426H170.018V319.457H295.826V222.426Z" fill="#EBEBEB"/>
<path d="M264.3 318.768C264.166 318.768 264.051 297.147 264.051 270.468C264.051 243.789 264.166 222.168 264.3 222.168C264.434 222.168 264.549 243.789 264.549 270.468C264.549 297.147 264.444 318.768 264.3 318.768Z" fill="#E0E0E0"/>
<path d="M285.164 297.367H275.518V308.269H285.164V297.367Z" fill="#FAFAFA"/>
<path d="M222.695 222.675H208.402V243.376H222.695V222.675Z" fill="#E0E0E0"/>
<path d="M222.695 298.457H208.402V319.159H222.695V298.457Z" fill="#E0E0E0"/>
<path d="M270.555 293.862C270.599 293.722 270.657 293.587 270.728 293.459C270.862 293.172 271.044 292.789 271.264 292.3C271.93 290.804 272.466 289.252 272.864 287.664C273.917 283.544 274.291 277.251 272.73 269.779C271.882 265.704 270.771 261.688 269.406 257.756C268.007 253.493 266.369 248.972 265.037 244.076C263.534 238.971 262.807 233.668 262.882 228.347C263.083 222.781 264.731 217.235 266.541 211.698C268.352 206.161 270.22 200.767 270.775 195.307C271.393 190.071 270.34 184.773 267.767 180.171C265.372 175.755 262.355 171.971 260.104 168.063C257.996 164.431 256.443 160.505 255.496 156.414C254.137 150.491 254.035 144.349 255.199 138.385C255.623 136.203 256.265 134.069 257.115 132.015C257.089 132.158 257.051 132.299 257 132.436L256.617 133.653C256.291 134.726 255.86 136.335 255.448 138.443C254.377 144.38 254.537 150.474 255.917 156.347C256.878 160.388 258.438 164.262 260.544 167.842C262.796 171.674 265.823 175.506 268.275 179.941C270.911 184.636 271.994 190.045 271.369 195.393C270.804 200.93 268.927 206.381 267.116 211.908C265.305 217.436 263.677 222.925 263.476 228.395C263.39 233.663 264.101 238.915 265.583 243.971C266.896 248.838 268.505 253.359 269.894 257.641C271.247 261.594 272.335 265.633 273.151 269.731C274.674 277.26 274.243 283.621 273.151 287.75C272.724 289.342 272.15 290.891 271.436 292.377L270.842 293.517C270.76 293.642 270.664 293.758 270.555 293.862Z" fill="#263238"/>
<path d="M263.17 171.923C263.17 171.923 258.591 157.256 266.81 148.673C266.874 148.604 266.956 148.554 267.046 148.529C267.137 148.503 267.233 148.503 267.323 148.529C267.413 148.555 267.495 148.606 267.558 148.675C267.622 148.744 267.665 148.83 267.682 148.922C268.123 151.346 268.669 158.722 263.17 171.923Z" fill="#D6D6D6"/>
<path d="M265.92 153.56C265.905 154.468 265.803 155.373 265.613 156.261C265.307 158.129 264.952 160.313 264.569 162.727C264.186 165.141 263.831 167.335 263.535 169.193C263.451 170.099 263.291 170.997 263.056 171.876C262.966 170.97 262.985 170.056 263.113 169.155C263.266 167.479 263.563 165.18 263.975 162.651C264.387 160.122 264.837 157.861 265.192 156.204C265.332 155.297 265.576 154.41 265.92 153.56Z" fill="#263238"/>
<path d="M268.555 206.515C268.555 206.515 271.362 191.408 282.646 187.672C282.735 187.641 282.831 187.635 282.923 187.656C283.015 187.676 283.1 187.721 283.167 187.787C283.235 187.853 283.283 187.936 283.306 188.027C283.329 188.118 283.326 188.214 283.298 188.304C282.55 190.632 279.59 197.405 268.555 206.515Z" fill="#D6D6D6"/>
<path d="M279.572 191.552C279.134 192.35 278.621 193.103 278.039 193.803L274.083 199.024L270.155 204.264C269.66 205.024 269.099 205.739 268.479 206.4C268.828 205.557 269.279 204.759 269.82 204.024C270.778 202.616 272.08 200.719 273.651 198.679C275.223 196.639 276.65 194.847 277.732 193.544C278.27 192.815 278.887 192.146 279.572 191.552Z" fill="#263238"/>
<path d="M265.508 244.383C265.508 244.383 263.803 229.113 273.516 222.264C273.591 222.205 273.681 222.17 273.776 222.16C273.87 222.151 273.966 222.17 274.05 222.213C274.135 222.256 274.205 222.323 274.253 222.405C274.301 222.487 274.325 222.581 274.321 222.676C274.292 225.138 273.42 232.476 265.508 244.383Z" fill="#D6D6D6"/>
<path d="M271.736 226.881C271.557 227.773 271.284 228.643 270.921 229.477L268.661 235.627C267.818 237.926 267.061 240.005 266.419 241.777C266.173 242.649 265.853 243.499 265.461 244.316C265.55 243.407 265.749 242.513 266.055 241.653C266.524 240.043 267.252 237.821 268.143 235.426C269.034 233.031 269.906 230.876 270.567 229.333C270.872 228.478 271.264 227.656 271.736 226.881Z" fill="#263238"/>
<path d="M274.005 282.491C274.005 282.491 272.856 267.164 282.799 260.669C282.877 260.615 282.968 260.584 283.063 260.58C283.157 260.575 283.251 260.597 283.333 260.643C283.416 260.689 283.484 260.756 283.53 260.839C283.577 260.921 283.599 261.015 283.595 261.109C283.48 263.571 282.349 270.88 274.005 282.491Z" fill="#D6D6D6"/>
<path d="M280.826 265.228C280.612 266.112 280.307 266.973 279.916 267.795C279.207 269.538 278.364 271.627 277.435 273.859C276.506 276.091 275.692 278.17 274.983 279.923C274.699 280.787 274.337 281.624 273.9 282.423C274.027 281.517 274.262 280.629 274.6 279.779C275.127 278.189 275.931 276.005 276.908 273.638C277.885 271.272 278.824 269.146 279.543 267.632C279.884 266.787 280.314 265.981 280.826 265.228Z" fill="#263238"/>
<path d="M256.58 159.039C256.58 159.039 242.996 151.912 242.699 140.043C242.698 139.95 242.723 139.858 242.77 139.778C242.817 139.698 242.884 139.631 242.966 139.586C243.047 139.541 243.139 139.519 243.232 139.522C243.325 139.525 243.416 139.552 243.494 139.602C245.516 141.001 251.129 145.829 256.58 159.039Z" fill="#D6D6D6"/>
<path d="M245.527 144.123C246.165 144.775 246.733 145.49 247.223 146.259C248.334 147.782 249.627 149.583 251.055 151.566L254.887 156.854C255.47 157.55 255.99 158.297 256.438 159.086C255.738 158.503 255.111 157.838 254.57 157.103C253.488 155.82 252.07 153.98 250.576 151.902C249.081 149.823 247.769 147.897 246.868 146.489C246.34 145.749 245.891 144.956 245.527 144.123Z" fill="#263238"/>
<path d="M271.206 190.526C271.206 190.526 257.182 184.251 256.195 172.402C256.187 172.308 256.205 172.215 256.247 172.131C256.289 172.048 256.353 171.977 256.432 171.928C256.511 171.878 256.603 171.852 256.696 171.851C256.789 171.85 256.881 171.875 256.962 171.923C259.059 173.197 264.951 177.661 271.206 190.526Z" fill="#D6D6D6"/>
<path d="M259.283 176.312C259.959 176.92 260.569 177.597 261.103 178.333L265.261 183.4L269.428 188.449C270.052 189.11 270.616 189.824 271.114 190.585C270.379 190.043 269.71 189.416 269.121 188.717C267.972 187.491 266.439 185.747 264.82 183.764C263.201 181.781 261.783 179.933 260.787 178.582C260.203 177.883 259.699 177.122 259.283 176.312Z" fill="#263238"/>
<path d="M263.112 225.675C263.112 225.675 253.533 213.7 258.007 202.684C258.042 202.597 258.101 202.522 258.176 202.467C258.251 202.411 258.34 202.378 258.433 202.37C258.526 202.362 258.62 202.38 258.704 202.422C258.787 202.464 258.857 202.528 258.907 202.607C260.239 204.686 263.429 211.353 263.112 225.675Z" fill="#D6D6D6"/>
<path d="M258.973 207.549C259.301 208.4 259.539 209.283 259.682 210.183C260.085 212.022 260.554 214.187 261.071 216.582C261.589 218.977 262.077 221.133 262.48 222.972C262.736 223.845 262.912 224.74 263.006 225.645C262.586 224.83 262.264 223.968 262.048 223.077C261.579 221.458 261.004 219.246 260.468 216.697C259.931 214.149 259.51 211.908 259.242 210.26C259.053 209.369 258.963 208.46 258.973 207.549Z" fill="#263238"/>
<path d="M272.693 266.972C272.693 266.972 258.774 260.467 257.989 248.608C257.979 248.513 257.997 248.418 258.039 248.333C258.081 248.248 258.147 248.176 258.227 248.126C258.308 248.077 258.401 248.05 258.496 248.051C258.591 248.051 258.684 248.078 258.765 248.129C260.824 249.441 266.639 254.011 272.693 266.972Z" fill="#D6D6D6"/>
<path d="M260.977 252.555C261.635 253.183 262.231 253.872 262.758 254.614L266.83 259.739L270.911 264.864C271.524 265.535 272.076 266.259 272.558 267.029C271.845 266.47 271.202 265.827 270.642 265.114C269.502 263.868 268.008 262.096 266.418 260.084C264.828 258.073 263.448 256.205 262.471 254.835C261.886 254.135 261.384 253.37 260.977 252.555Z" fill="#263238"/>
<path d="M300.387 206.582C300.387 206.582 300.387 206.697 300.387 206.917C300.387 207.138 300.387 207.502 300.387 207.875C300.387 208.833 300.292 210.05 300.224 211.602C300.052 214.878 299.793 219.447 299.496 224.908C298.538 230.464 295.665 236.624 291.833 242.611C289.045 247.017 286.085 251.022 283.594 254.748C281.321 258.018 279.279 261.444 277.483 264.998C276.293 267.4 275.331 269.908 274.609 272.489C274.369 273.4 274.178 274.118 274.072 274.607C274.027 274.861 273.96 275.111 273.871 275.354C273.874 275.096 273.907 274.839 273.967 274.587C274.034 274.089 274.178 273.361 274.398 272.432C275.043 269.806 275.958 267.254 277.128 264.816C278.909 261.233 280.948 257.785 283.23 254.499C285.74 250.744 288.643 246.73 291.421 242.352C295.205 236.394 298.021 230.33 299.085 224.86C299.468 219.409 299.784 214.849 300.042 211.573C300.167 210.021 300.272 208.785 300.349 207.856C300.349 207.473 300.416 207.147 300.445 206.898C300.412 206.796 300.393 206.689 300.387 206.582Z" fill="#263238"/>
<path d="M292.102 241.509C292.102 241.509 297.993 227.332 290.588 218.03C290.531 217.955 290.454 217.898 290.366 217.865C290.278 217.832 290.182 217.823 290.089 217.841C289.997 217.859 289.911 217.902 289.842 217.966C289.773 218.03 289.723 218.112 289.697 218.202C289.036 220.578 287.82 227.868 292.102 241.509Z" fill="#D6D6D6"/>
<path d="M291.03 222.983C291.284 223.858 291.441 224.757 291.499 225.666C291.71 227.333 291.94 229.641 292.122 232.199C292.304 234.757 292.39 237.075 292.39 238.761C292.448 239.671 292.393 240.585 292.227 241.482C292.062 240.587 291.982 239.68 291.988 238.771C291.863 236.855 291.71 234.68 291.547 232.237C291.384 229.794 291.231 227.582 291.097 225.704C290.985 224.802 290.963 223.89 291.03 222.983Z" fill="#263238"/>
<g opacity="0.3">
<path opacity="0.3" d="M292.102 241.509C292.102 241.509 297.993 227.332 290.588 218.03C290.531 217.955 290.454 217.898 290.366 217.865C290.278 217.832 290.182 217.823 290.089 217.841C289.997 217.859 289.911 217.902 289.842 217.966C289.773 218.03 289.723 218.112 289.697 218.202C289.036 220.578 287.82 227.868 292.102 241.509Z" fill="black"/>
</g>
<path d="M273.853 275.699C273.853 275.699 278.575 261.081 270.433 252.421C270.37 252.352 270.289 252.302 270.199 252.276C270.109 252.25 270.014 252.249 269.924 252.274C269.833 252.299 269.752 252.348 269.688 252.416C269.624 252.484 269.58 252.569 269.561 252.66C269.101 255.074 268.479 262.451 273.853 275.699Z" fill="#D6D6D6"/>
<path d="M271.277 257.285C271.609 258.137 271.841 259.024 271.967 259.929C272.312 261.567 272.724 263.857 273.117 266.386C273.509 268.915 273.778 271.223 273.921 272.9C274.046 273.805 274.062 274.721 273.969 275.63C273.742 274.75 273.588 273.853 273.509 272.948C273.232 271.08 272.906 268.896 272.551 266.472C272.197 264.048 271.852 261.864 271.593 259.996C271.399 259.105 271.293 258.197 271.277 257.285Z" fill="#263238"/>
<g opacity="0.3">
<path opacity="0.3" d="M273.851 275.699C273.851 275.699 278.573 261.081 270.431 252.421C270.368 252.352 270.287 252.302 270.197 252.276C270.107 252.25 270.012 252.249 269.922 252.274C269.832 252.299 269.75 252.348 269.686 252.416C269.622 252.484 269.578 252.569 269.559 252.66C269.099 255.074 268.477 262.451 273.851 275.699Z" fill="black"/>
</g>
<path d="M299.611 224.18C299.611 224.18 312.189 215.367 310.925 203.545C310.915 203.453 310.88 203.364 310.823 203.29C310.766 203.216 310.69 203.159 310.603 203.125C310.516 203.091 310.421 203.082 310.329 203.099C310.237 203.116 310.152 203.158 310.082 203.22C308.252 204.867 303.347 210.347 299.611 224.18Z" fill="#D6D6D6"/>
<g opacity="0.3">
<path opacity="0.3" d="M299.611 224.18C299.611 224.18 312.189 215.367 310.925 203.545C310.915 203.453 310.88 203.364 310.823 203.29C310.766 203.216 310.69 203.159 310.603 203.125C310.516 203.091 310.421 203.082 310.329 203.099C310.237 203.116 310.152 203.158 310.082 203.22C308.252 204.867 303.347 210.347 299.611 224.18Z" fill="black"/>
</g>
<path d="M308.645 207.962C308.396 208.839 308.045 209.685 307.601 210.481C306.883 211.995 305.838 214.064 304.622 216.325C303.405 218.586 302.237 220.588 301.336 222.006C300.893 222.801 300.356 223.541 299.736 224.209C300.073 223.366 300.49 222.558 300.982 221.795C301.882 220.138 302.945 218.202 304.114 216.047L307.237 210.299C307.629 209.476 308.101 208.693 308.645 207.962Z" fill="#263238"/>
<path d="M278.93 261.204C278.93 261.204 294.104 258.838 298.165 247.669C298.198 247.581 298.207 247.487 298.189 247.395C298.172 247.304 298.13 247.219 298.068 247.15C298.006 247.08 297.925 247.03 297.836 247.003C297.747 246.976 297.652 246.974 297.562 246.998C295.196 247.707 288.337 250.437 278.93 261.204Z" fill="#D6D6D6"/>
<g opacity="0.3">
<path opacity="0.3" d="M278.93 261.204C278.93 261.204 294.104 258.838 298.165 247.669C298.198 247.581 298.207 247.487 298.189 247.395C298.172 247.304 298.13 247.219 298.068 247.15C298.006 247.08 297.925 247.03 297.836 247.003C297.747 246.976 297.652 246.974 297.562 246.998C295.196 247.707 288.337 250.437 278.93 261.204Z" fill="black"/>
</g>
<path d="M294.18 250.63C293.565 251.301 292.878 251.902 292.13 252.421C290.818 253.475 288.969 254.874 286.89 256.368C284.811 257.862 282.867 259.137 281.43 260.018C280.681 260.54 279.87 260.968 279.016 261.292C279.695 260.686 280.43 260.144 281.209 259.673L286.555 255.899L291.891 252.067C292.601 251.508 293.368 251.026 294.18 250.63Z" fill="#263238"/>
<path d="M264.447 289.139L260.021 318.931H287.611L284.037 289.139H264.447Z" fill="#455A64"/>
<path d="M285.148 298.363C285.148 298.526 280.167 298.651 274.026 298.651C267.886 298.651 262.895 298.526 262.895 298.363C266.598 298.08 270.313 297.984 274.026 298.076C277.736 297.984 281.448 298.08 285.148 298.363Z" fill="#263238"/>
<path d="M285.684 300.74C285.684 300.902 280.54 301.027 274.189 301.027C267.838 301.027 262.693 300.902 262.693 300.74C262.693 300.577 267.838 300.452 274.189 300.452C280.54 300.452 285.684 300.577 285.684 300.74Z" fill="#263238"/>
<path d="M178.401 0.112937C178.401 0.112937 178.143 0.112937 177.645 0.112937C176.917 0.0697386 176.188 0.0697386 175.46 0.112937C172.647 0.277652 169.883 0.925758 167.289 2.02884C163.178 3.7521 159.6 6.53957 156.924 10.1044C155.274 12.3303 154.047 14.8403 153.303 17.5094C151.626 23.8676 152.532 30.6307 155.822 36.3237C156.719 37.8999 157.814 39.355 159.079 40.6537C160.356 42.0296 161.844 43.1937 163.486 44.1023C165.171 45.0508 167.08 45.5304 169.013 45.4914C171.007 45.4674 172.918 44.6946 174.368 43.3264C175.069 42.592 175.619 41.7267 175.985 40.7799C176.352 39.8332 176.528 38.8235 176.505 37.8086C176.49 35.6999 175.82 33.6478 174.589 31.9363C172.108 28.4397 168.084 26.0927 163.802 24.8282C159.362 23.5812 154.673 23.5151 150.199 24.6366C147.916 25.2307 145.715 26.1059 143.647 27.2423C141.559 28.4204 139.663 29.9095 138.023 31.6585C137.631 32.1087 137.18 32.5206 136.826 33.0188L135.744 34.4749C135.085 35.5009 134.496 36.5698 133.981 37.6744C132.956 39.9172 132.256 42.2944 131.902 44.7346C131.207 49.6094 131.87 54.5816 133.818 59.1039C135.68 63.5228 138.923 67.2198 143.062 69.6415C145.069 70.788 147.309 71.4659 149.615 71.6245C151.876 71.7509 154.124 71.2114 156.081 70.0726C158.023 68.9989 159.559 67.3157 160.449 65.2828C161.289 63.2792 161.347 61.0334 160.612 58.989C159.855 57.0165 158.617 55.2647 157.01 53.8927C155.452 52.5459 153.655 51.5029 151.713 50.8176C147.925 49.6233 143.872 49.5534 140.045 50.6164C136.464 51.5867 133.175 53.4186 130.465 55.9523C127.997 58.317 126.117 61.2271 124.976 64.4493C122.981 70.0403 123.072 76.164 125.235 81.6926C126.921 85.8199 129.635 89.4474 133.119 92.2301C135.313 93.9901 137.757 95.4139 140.37 96.4547C141.271 96.79 141.97 97.0391 142.449 97.1732L143.158 97.4031C143.158 97.4031 142.909 97.3552 142.43 97.2211C141.722 97.0316 141.025 96.8046 140.342 96.5409C137.694 95.5459 135.218 94.1432 133.004 92.3834C129.461 89.6026 126.693 85.9573 124.966 81.798C122.766 76.2171 122.654 70.0297 124.65 64.3727C125.793 61.1016 127.694 58.1473 130.197 55.7511C132.945 53.1666 136.283 51.2922 139.92 50.2907C143.827 49.2006 147.967 49.2672 151.837 50.4823C153.837 51.1796 155.686 52.249 157.288 53.634C158.958 55.051 160.243 56.8665 161.024 58.9124C161.812 61.0482 161.778 63.4006 160.928 65.5127C159.983 67.6257 158.38 69.3764 156.359 70.5036C154.329 71.6864 151.999 72.2523 149.653 72.1322C147.291 71.9674 144.998 71.2663 142.947 70.0821C138.714 67.6266 135.39 63.8656 133.473 59.3626C131.483 54.7574 130.8 49.6928 131.5 44.725C131.865 42.2355 132.581 39.8102 133.626 37.5212C134.153 36.3931 134.754 35.3017 135.427 34.2545L136.539 32.7697C136.893 32.262 137.353 31.8117 137.755 31.3711C139.433 29.589 141.371 28.071 143.503 26.8687C145.619 25.7106 147.872 24.8224 150.209 24.2247C154.768 23.0822 159.546 23.1516 164.07 24.4259C168.439 25.7287 172.529 28.114 175.106 31.7351C176.401 33.5181 177.105 35.6623 177.118 37.866C177.164 40.0348 176.348 42.1332 174.847 43.7C173.315 45.1387 171.297 45.9491 169.195 45.9704C167.184 46.016 165.198 45.5161 163.448 44.5238C161.766 43.596 160.246 42.4023 158.945 40.989C157.663 39.6612 156.553 38.1775 155.64 36.5728C152.291 30.774 151.382 23.8828 153.111 17.4137C153.878 14.7136 155.135 12.1775 156.819 9.93199C159.544 6.34007 163.183 3.54475 167.356 1.83726C169.971 0.755469 172.757 0.145722 175.585 0.0362986C176.319 -0.0120995 177.055 -0.0120995 177.788 0.0362986L178.401 0.112937Z" fill="#263238"/>
<path d="M210.395 95.9658H76.0801V199.559H210.395V95.9658Z" fill="#D6D6D6"/>
<path d="M76.0801 95.9658L100.882 119.11H232.926L210.395 95.9658H76.0801Z" fill="#D6D6D6"/>
<path opacity="0.5" d="M76.377 97.1064L100.134 127.225H210.395V119.111H100.882L76.377 97.1064Z" fill="black"/>
<path d="M204.995 175.841H193.154V189.223H204.995V175.841Z" fill="#F5F5F5"/>
<path d="M76.0816 95.9658L48.502 119.11H76.0816V95.9658Z" fill="#D6D6D6"/>
<g opacity="0.4">
<path opacity="0.4" d="M76.0816 95.9658L48.502 119.11H76.0816V95.9658Z" fill="black"/>
</g>
<path d="M214.364 199.561H59.9316V318.673H214.364V199.561Z" fill="#D6D6D6"/>
<path opacity="0.3" d="M214.364 199.561H59.9316V318.673H214.364V199.561Z" fill="black"/>
<path d="M175.661 317.83C175.527 317.83 175.412 291.285 175.412 258.542C175.412 225.799 175.527 199.244 175.661 199.244C175.795 199.244 175.91 225.789 175.91 258.542C175.91 291.294 175.795 317.83 175.661 317.83Z" fill="#263238"/>
<path d="M201.268 291.562H189.428V304.944H201.268V291.562Z" fill="#F5F5F5"/>
<path d="M124.581 199.865H107.041V225.28H124.581V199.865Z" fill="#263238"/>
<path d="M124.581 292.903H107.041V318.318H124.581V292.903Z" fill="#263238"/>
<path d="M213.013 199.56H212.611H211.452L206.997 199.608L190.587 199.684L136.472 199.809L82.3381 199.742L65.9378 199.665L61.4834 199.617H60.3146H59.9219H60.3146H61.4834L65.9378 199.569L82.3381 199.493L136.472 199.416L190.587 199.493L206.997 199.569L211.452 199.617H212.611L213.013 199.56Z" fill="#263238"/>
</svg>
