<svg class="Heart" width="56" height="56" viewBox="0 0 56 56" fill="none" xmlns="http://www.w3.org/2000/svg">
<g filter="url(#filter0_d_59050_5915)">
<circle cx="28" cy="24" r="18" fill="white" stroke="none" />
<path d="M27.9997 29.8205C15.1429 22.7143 24.1429 15 27.9997 19.878C31.8571 15 40.8571 22.7143 27.9997 29.8205Z" fill="current" stroke="current" stroke-width="2"/>
</g>
<defs>
<filter id="filter0_d_59050_5915" x="0" y="0" width="56" height="56" filterUnits="userSpaceOnUse" color-interpolation-filters="sRGB">
<feFlood flood-opacity="0" result="BackgroundImageFix"/>
<feColorMatrix in="SourceAlpha" type="matrix" values="0 0 0 0 0 0 0 0 0 0 0 0 0 0 0 0 0 0 127 0" result="hardAlpha"/>
<feOffset dy="4"/>
<feGaussianBlur stdDeviation="5"/>
<feColorMatrix type="matrix" values="0 0 0 0 0.129412 0 0 0 0 0.266667 0 0 0 0 0.341176 0 0 0 0.2 0"/>
<feBlend mode="normal" in2="BackgroundImageFix" result="effect1_dropShadow_59050_5915"/>
<feBlend mode="normal" in="SourceGraphic" in2="effect1_dropShadow_59050_5915" result="shape"/>
</filter>
</defs>
</svg>
