<svg width="20" height="20" viewBox="0 0 20 20" fill="none" xmlns="http://www.w3.org/2000/svg">
<path d="M2.142 1.99999L4.01 14.136C4.04361 14.3779 4.16438 14.5991 4.34962 14.7582C4.53487 14.9173 4.77184 15.0033 5.016 15H16C16.2151 15 16.4245 14.9306 16.5971 14.8022C16.7697 14.6738 16.8963 14.4931 16.958 14.287L19.958 4.28699C20.0027 4.13768 20.0119 3.97998 19.9849 3.82648C19.9579 3.67297 19.8953 3.52792 19.8022 3.40289C19.7092 3.27786 19.5882 3.17631 19.4489 3.10636C19.3096 3.0364 19.1559 2.99998 19 2.99999H4.32L3.99 0.861991C3.95667 0.61723 3.83331 0.39368 3.644 0.234991C3.45967 0.0793947 3.22518 -0.00409711 2.984 -9.28964e-06H1C0.868678 -9.2924e-06 0.738642 0.0258564 0.617316 0.0761111C0.495991 0.126366 0.385752 0.200025 0.292893 0.292884C0.200035 0.385742 0.126375 0.495982 0.0761204 0.617307C0.0258657 0.738633 0 0.868669 0 0.999991C0 1.13131 0.0258657 1.26135 0.0761204 1.38267C0.126375 1.504 0.200035 1.61424 0.292893 1.7071C0.385752 1.79996 0.495991 1.87362 0.617316 1.92387C0.738642 1.97413 0.868678 1.99999 1 1.99999H2.142ZM5.858 13L4.628 4.99999H17.656L15.256 13H5.858ZM8 18C8 18.5304 7.78929 19.0391 7.41421 19.4142C7.03914 19.7893 6.53043 20 6 20C5.46957 20 4.96086 19.7893 4.58579 19.4142C4.21071 19.0391 4 18.5304 4 18C4 17.4696 4.21071 16.9608 4.58579 16.5858C4.96086 16.2107 5.46957 16 6 16C6.53043 16 7.03914 16.2107 7.41421 16.5858C7.78929 16.9608 8 17.4696 8 18ZM17 18C17 18.5304 16.7893 19.0391 16.4142 19.4142C16.0391 19.7893 15.5304 20 15 20C14.4696 20 13.9609 19.7893 13.5858 19.4142C13.2107 19.0391 13 18.5304 13 18C13 17.4696 13.2107 16.9608 13.5858 16.5858C13.9609 16.2107 14.4696 16 15 16C15.5304 16 16.0391 16.2107 16.4142 16.5858C16.7893 16.9608 17 17.4696 17 18Z" fill="#9098B1"/>
</svg>
