<svg width="30" height="30" viewBox="0 0 30 30" fill="none" xmlns="http://www.w3.org/2000/svg">
<path d="M15.1134 30C23.2284 30 29.807 23.4215 29.807 15.3063C29.807 7.19121 23.2284 0.61264 15.1134 0.61264C6.99825 0.61264 0.419678 7.19121 0.419678 15.3063C0.419678 23.4215 6.99825 30 15.1134 30ZM12.1876 12.3806L22.6221 7.79739L18.0391 18.2319L7.60455 22.8151L12.1876 12.3806Z" fill="#FF385C"/>
</svg>
