<?xml version="1.0" encoding="UTF-8"?>
<!DOCTYPE svg PUBLIC "-//W3C//DTD SVG 1.1//EN" "http://www.w3.org/Graphics/SVG/1.1/DTD/svg11.dtd">
<!-- Creator: CorelDRAW 2019 (64-Bit) -->
<svg xmlns="http://www.w3.org/2000/svg" xml:space="preserve" width="4226px" height="1080px" version="1.1" style="shape-rendering:geometricPrecision; text-rendering:geometricPrecision; image-rendering:optimizeQuality; fill-rule:evenodd; clip-rule:evenodd"
viewBox="0 0 4226 1080.06"
 xmlns:xlink="http://www.w3.org/1999/xlink"
 xmlns:xodm="http://www.corel.com/coreldraw/odm/2003">
 <defs>
  <style type="text/css">
   <![CDATA[
    .fil1 {fill:#FDD100}
    .fil2 {fill:#F39910}
    .fil0 {fill:#EA5B24}
    .fil3 {fill:#007242;fill-rule:nonzero}
   ]]>
  </style>
 </defs>
 <g id="Layer_x0020_1">
  <metadata id="CorelCorpID_0Corel-Layer"/>
  <polygon class="fil0" points="0,0 1470.06,324.71 0,324.71 "/>
  <polygon class="fil1" points="670.81,0 1470.06,324.71 670.81,324.71 "/>
  <polygon class="fil2" points="4226,931.82 1470.06,324.71 4226,324.71 "/>
  <polygon class="fil1" points="3141.63,931.82 1470.06,324.71 3141.63,324.71 "/>
  <path class="fil3" d="M102.71 701.41l0 303.16 43.57 0c32.14,0 54.32,-9.63 66.41,-29.02 12.21,-19.27 18.26,-60.16 18.26,-122.55 0,-62.4 -6.05,-103.29 -18.26,-122.57 -12.09,-19.38 -34.27,-29.02 -66.41,-29.02l-43.57 0zm-102.71 -66.55l159.83 0c62.27,0 106.07,16.13 131.38,48.49 25.2,32.27 37.86,89.18 37.86,170.86 0,81.47 -12.66,138.29 -37.86,170.55 -25.31,32.37 -69.11,48.5 -131.38,48.5l-159.83 0 0 -438.4zm397.72 212.55l0 -5.99c0,-26.58 11.32,-46.66 33.83,-60.47 22.52,-13.8 55.45,-20.69 98.79,-20.69 42.78,0 74.26,7.1 94.31,21.41 20.05,14.3 30.01,36.83 30.01,67.47l0 152.19c0,13.39 0.56,26.17 1.68,38.14 1.01,11.98 2.69,23.24 4.94,33.79l-84 0 -7.18 -34.8c-8.62,11.06 -21.17,20.09 -37.97,26.89 -16.69,6.79 -34.38,10.25 -52.97,10.25 -27.78,0 -49.85,-8.53 -66.2,-25.68 -16.24,-17.14 -24.42,-40.37 -24.42,-69.8 0,-34.29 11.76,-59.66 35.4,-76.2 23.63,-16.53 61.71,-26.17 114.24,-28.71l29.9 0 0 -13.9c0,-21 -2.9,-35.71 -8.73,-44.24 -5.83,-8.52 -15.45,-12.78 -29.01,-12.78 -14.9,0 -26.09,3.66 -33.71,10.85 -7.51,7.21 -11.32,17.97 -11.32,32.27l-87.59 0zm170.36 74.17c-33.93,0 -57.35,4.16 -70.22,12.38 -12.88,8.21 -19.38,22.73 -19.38,43.52 0,15.12 3.25,26.79 9.64,35.11 6.49,8.32 15.46,12.48 26.77,12.48 17.13,0 30.24,-6.6 39.41,-19.79 9.19,-13.19 13.78,-32.16 13.78,-56.91l0 -26.79zm252.35 151.68l-94.87 0 0 -250.81c0,-14.1 -0.22,-24.96 -0.67,-32.56 -0.45,-7.72 -1.24,-15.12 -2.24,-22.22l95.2 0 2.58 31.55c7.61,-12.68 17.92,-22.33 30.69,-29.02 12.76,-6.59 27.67,-9.94 44.79,-9.94 29.46,0 52.09,6.89 67.77,20.69 15.57,13.81 23.41,33.69 23.41,59.87l0 232.44 -94.86 0 0 -208.6c0,-19.89 -2.36,-33.48 -7.07,-40.89 -4.7,-7.41 -12.87,-11.16 -24.41,-11.16 -12.21,0 -22.07,3.96 -29.34,11.77 -7.28,7.81 -10.98,18.36 -10.98,31.66l0 217.22zm234.53 -225.85l0 -5.99c0,-26.58 11.31,-46.66 33.83,-60.47 22.51,-13.8 55.44,-20.69 98.78,-20.69 42.79,0 74.26,7.1 94.31,21.41 20.05,14.3 30.02,36.83 30.02,67.47l0 152.19c0,13.39 0.56,26.17 1.67,38.14 1.02,11.98 2.69,23.24 4.94,33.79l-84 0 -7.18 -34.8c-8.62,11.06 -21.17,20.09 -37.96,26.89 -16.69,6.79 -34.39,10.25 -52.98,10.25 -27.77,0 -49.84,-8.53 -66.19,-25.68 -16.24,-17.14 -24.43,-40.37 -24.43,-69.8 0,-34.29 11.77,-59.66 35.4,-76.2 23.64,-16.53 61.71,-26.17 114.24,-28.71l29.9 0 0 -13.9c0,-21 -2.89,-35.71 -8.72,-44.24 -5.83,-8.52 -15.46,-12.78 -29.02,-12.78 -14.89,0 -26.09,3.66 -33.71,10.85 -7.5,7.21 -11.31,17.97 -11.31,32.27l-87.59 0zm170.35 74.17c-33.93,0 -57.34,4.16 -70.22,12.38 -12.87,8.21 -19.37,22.73 -19.37,43.52 0,15.12 3.25,26.79 9.63,35.11 6.49,8.32 15.46,12.48 26.77,12.48 17.13,0 30.24,-6.6 39.42,-19.79 9.19,-13.19 13.77,-32.16 13.77,-56.91l0 -26.79zm252.36 -122.36c7.61,-12.68 17.92,-22.33 30.68,-29.02 12.77,-6.59 27.67,-9.94 44.8,-9.94 21.85,0 40.22,4.06 55.11,12.17 14.9,8.12 25.31,19.79 31.47,34.8 8.74,-15.62 19.83,-27.39 33.15,-35.21 13.33,-7.81 29.01,-11.76 46.94,-11.76 29.45,0 52.08,6.89 67.75,20.69 15.57,13.81 23.41,33.69 23.41,59.87l0 232.44 -94.86 0 0 -208.6c0,-20.29 -2.24,-33.99 -6.83,-41.2 -4.6,-7.2 -12.65,-10.85 -23.98,-10.85 -12.2,0 -22.17,3.96 -29.68,11.87 -7.5,7.92 -11.31,18.46 -11.31,31.56l0 217.22 -94.86 0 0 -208.6c0,-19.89 -2.35,-33.48 -7.06,-40.89 -4.7,-7.41 -12.87,-11.16 -24.42,-11.16 -12.21,0 -22.06,3.96 -29.34,11.77 -7.28,7.81 -10.97,18.36 -10.97,31.66l0 217.22 -94.88 0 0 -250.81c0,-14.1 -0.21,-24.96 -0.67,-32.56 -0.45,-7.72 -1.23,-15.12 -2.23,-22.22l95.19 0 2.59 31.55zm534.81 -38.96c48.72,0 83.79,11.87 105.06,35.51 21.39,23.64 32.04,63 32.04,117.89 0,63.93 -10.2,107.65 -30.48,131.19 -20.38,23.44 -56.56,35.21 -108.63,35.21 -52.31,0 -88.71,-11.77 -109.1,-35.41 -20.49,-23.54 -30.69,-67.27 -30.69,-130.99 0,-55.29 10.98,-94.66 32.82,-118.19 21.84,-23.45 58.13,-35.21 108.98,-35.21zm-46.26 157.26c0,43.02 3.25,71.93 9.63,86.95 6.5,14.92 18.04,22.43 34.62,22.43 16.57,0 28.11,-7.51 34.6,-22.43 6.39,-15.02 9.63,-43.93 9.63,-86.95 0,-42.21 -3.24,-70.01 -9.63,-83.4 -6.49,-13.39 -18.25,-20.09 -35.28,-20.09 -16.57,0 -28,6.7 -34.27,20.2 -6.16,13.49 -9.3,41.29 -9.3,83.29zm339.37 155.74l-94.87 0 0 -250.81c0,-14.1 -0.22,-24.96 -0.67,-32.56 -0.45,-7.72 -1.24,-15.12 -2.24,-22.22l95.2 0 2.58 31.55c7.61,-12.68 17.92,-22.33 30.69,-29.02 12.77,-6.59 27.66,-9.94 44.79,-9.94 29.46,0 52.09,6.89 67.77,20.69 15.57,13.81 23.41,33.69 23.41,59.87l0 232.44 -94.86 0 0 -208.6c0,-19.89 -2.36,-33.48 -7.07,-40.89 -4.69,-7.41 -12.87,-11.16 -24.41,-11.16 -12.21,0 -22.06,3.96 -29.34,11.77 -7.28,7.81 -10.98,18.36 -10.98,31.66l0 217.22z"/>
  <polygon class="fil0" points="3141.63,692.94 1470.06,324.71 3141.63,324.71 "/>
  <polygon class="fil2" points="670.79,148.16 1470.06,324.71 670.79,324.71 "/>
 </g>
</svg>
