<svg width="24" height="24" viewBox="0 0 24 24" fill="none" xmlns="http://www.w3.org/2000/svg">
<path d="M19.0781 22.1719C17.915 22.1719 16.9688 21.2256 16.9688 20.0625V13.9688C16.9688 13.5811 16.6533 13.2656 16.2656 13.2656C15.878 13.2656 15.5625 13.5811 15.5625 13.9688V16.2656C15.5625 17.4287 14.6162 18.375 13.4531 18.375H12.3281V16.9688H13.4531C13.8408 16.9688 14.1562 16.6533 14.1562 16.2656V13.9688C14.1562 12.8057 15.1025 11.8594 16.2656 11.8594C17.4287 11.8594 18.375 12.8057 18.375 13.9688V20.0625C18.375 20.4501 18.6905 20.7656 19.0781 20.7656C19.4658 20.7656 19.7812 20.4501 19.7812 20.0625V9.75H21.1875V20.0625C21.1875 21.2256 20.2412 22.1719 19.0781 22.1719Z" fill="#3E5959"/>
<path d="M7.40625 0H8.8125V2.71875H7.40625V0Z" fill="#4A696F"/>
<path d="M8.10938 0H8.8125V2.71875H8.10938V0Z" fill="#3E5959"/>
<path d="M9.75 17.1562H6.46875V2.71875H9.75V17.1562Z" fill="#4A696F"/>
<path d="M9.75 17.1562H8.10938V2.71875H9.75V17.1562Z" fill="#3E5959"/>
<path d="M14.9062 23.2969H1.3125V21.8906C1.3125 18.1428 4.36157 15.0938 8.10938 15.0938C11.8572 15.0938 14.9062 18.1428 14.9062 21.8906V23.2969Z" fill="#FF6C6C"/>
<path d="M14.9062 21.8906C14.9062 18.1428 11.8572 15.0938 8.10938 15.0938V23.2969H14.9062V21.8906Z" fill="#FF415B"/>
<path d="M7.40625 20.7188H8.8125V23.2969H7.40625V20.7188Z" fill="#457899"/>
<path d="M4.59375 20.7188H6V23.2969H4.59375V20.7188Z" fill="#457899"/>
<path d="M10.2188 20.7188H11.625V23.2969H10.2188V20.7188Z" fill="#2B495D"/>
<path d="M8.10938 20.7188H8.8125V23.2969H8.10938V20.7188Z" fill="#2B495D"/>
<path d="M0 22.5938H16.2188V24H0V22.5938Z" fill="#3E5959"/>
<path d="M13.8467 5.79436C10.6828 2.63597 5.53516 2.63597 2.37146 5.79436L1.37793 4.79936C5.08948 1.09386 11.1287 1.09386 14.8402 4.79936L13.8467 5.79436Z" fill="#457899"/>
<path d="M5.0625 6.375H11.1562V7.78125H5.0625V6.375Z" fill="#457899"/>
<path d="M22.125 10.4531H18.8438V6.70312H22.125V10.4531Z" fill="#FF415B"/>
<path d="M8.10938 22.5938H16.2188V24H8.10938V22.5938Z" fill="#293939"/>
<path d="M8.10938 6.375H11.1562V7.78125H8.10938V6.375Z" fill="#2B495D"/>
<path d="M13.847 5.79437L14.8405 4.79938C12.9847 2.94653 10.5471 2.0202 8.10938 2.0202V3.42554C10.1873 3.42554 12.2651 4.21527 13.847 5.79437Z" fill="#2B495D"/>
<path d="M24 7.64062H16.9688V3.89062H24V7.64062Z" fill="#FF6C6C"/>
</svg>
