{
    "name": "Blog",
    "alias": "blog",
    "description": "",
    "keywords": [],
    "active": 1,
    "order": 0,
    "providers": [
        "Modules\\Blog\\Providers\\BlogServiceProvider",
        "Modules\\Blog\\Providers\\MorphServiceProvider"
    ],
    "aliases": {},
    "files": [
        "start.php"
    ],
    "requires": []
}
