device,modsim001,1,,
poll,coil,0,16,BE_BE
ref,coil01-08,0,bool,rw
ref,coil09-16,8,bool,rw
poll,holding_register,40000,20,BE_BE
ref,holding_reg01,40000,uint16,rw
ref,holding_reg02,40001,uint16,rw
ref,holding_reg03,40002,uint16,rw
ref,holding_reg04,40003,uint16,rw
ref,holding_reg05,40004,int16,rw
ref,holding_reg06,40005,int16,rw
ref,holding_reg07,40006,int16,rw
ref,holding_reg08,40007,int16,rw
ref,holding_reg09,40008,uint32,rw
ref,holding_reg10,40010,uint32,rw
ref,holding_reg11,40012,int32,rw
ref,holding_reg12,40014,int32,rw
ref,holding_reg13,40016,float32,rw
ref,holding_reg14,40018,float32,rw
