// =============================================================================
// Scilab ( http://www.scilab.org/ ) - This file is part of Scilab
// Copyright (C) 2005-2008 - INRIA - Pierre MARECHAL <pierre.marechal@inria.fr>
//
//  This file is distributed under the same license as the Scilab package.
// =============================================================================
// <-- TEST WITH GRAPHIC -->
// <-- Non-regression test for bug 1786 -->
//
// <-- GitLab URL -->
// https://gitlab.com/scilab/scilab/-/issues/1786
//
// <-- Short Description -->
//    Scilab 4.0-RC1
//    Handle Label : rotation of the text
//
//    Changing field Label.auto_rotation to off does not causes the rotation of the
//    text. To force the rotation, it is necessary to re-affect the value of
//    Label.font_angle.
//
//    jacques-Deric
hf  = scf (1);
ha  = gca ();
hlt = ha.title;
hlt.text = "Titre/Title";
if hlt.auto_rotation <> "on" then bugmes();quit;end
if hlt.auto_position <> "on" then bugmes();quit;end
hlt.font_angle = 180;
if hlt.auto_rotation <> "off" then bugmes();quit;end
hlt.position = [0.5,0.5];
if hlt.auto_position == "on" then bugmes();quit;end
