//<-- CLI SHELL MODE -->
// =============================================================================
// Scilab ( http://www.scilab.org/ ) - This file is part of Scilab
// Copyright (C) 2015 - Scilab Enterprises - Clement DAVID
//
//  This file is distributed under the same license as the Scilab package.
// =============================================================================
// <-- Non-regression test for bug 13924 -->
//
// <-- GitLab URL -->
// https://gitlab.com/scilab/scilab/-/issues/13924
//
// <-- Short Description -->
// rationals: r1==r2 and r1~=r2 may be wrong and operate unconsistenly.
a = %z/(1-%z);
b = -%z / -(1-%z);
assert_checkequal(a,b)
 ans  =
  T
assert_checkequal(size([a b]==[a a], "*"), 2)
 ans  =
  T
assert_checkequal(size([a b]~=[a a], "*"), 2)
 ans  =
  T
// Disable simplification mode
simp_mode(%f)
a = %z/(1-%z);
b = -%z / -(1-%z);
c = 0 / (1-%z);
d = 0 / (2+%z);
assert_checkequal(a,b)
 ans  =
  T
assert_checkequal(c,d)
 ans  =
  T
assert_checkequal(size([a b c d]==[a a c c], "*"), 4)
 ans  =
  T
assert_checkequal(size([a b c d]~=[a a c c], "*"), 4)
 ans  =
  T
