// =============================================================================
// Scilab ( http://www.scilab.org/ ) - This file is part of Scilab
// Copyright (C) 2009 - DIGITEO - Allan CORNET
//
//  This file is distributed under the same license as the Scilab package.
// =============================================================================
// <-- Non-regression test for bug 4626 -->
//
// <-- GitLab URL -->
// https://gitlab.com/scilab/scilab/-/issues/4626
//
// <-- Short Description -->
// 
// when using the CLI version (NO GRAPHICS), the autocompletion feature make Scilab crash
// <-- CLI SHELL MODE -->
r = completion('a','graphic_properties');
if ~isdef('r') then bugmes();quit;end
