// =============================================================================
// Scilab ( http://www.scilab.org/ ) - This file is part of Scilab
// Copyright (C) 2008 - INRIA - Serge STEER
//
//  This file is distributed under the same license as the Scilab package.
// =============================================================================
// <-- ENGLISH IMPOSED -->
// <-- CLI SHELL MODE -->
// <-- Non-regression test for bug 2119 -->
//
// <-- GitLab URL -->
// https://gitlab.com/scilab/scilab/-/issues/2119
//
// <-- Short Description -->
// There is problem in the scilab fortran interface provided by
//  the "call" function. The bug have been found by Mark (coding a "call"
//  interface for the lapack routine dgesv) and exposed in the 
//  newsgroup. See the newsgroup thread for some details, I write
//  here only a (complicated) way to get the bug.
//create fortran code a copy of the lapack dgesv routine
curdir=pwd();
mputl(['      subroutine dgesvtst( n,nrhs,a,lda,ipiv,b,ldb,info )'
       '      integer            info,lda,ldb,n,nrhs,ipiv( * )'
       '      double precision   a(lda,*),b(ldb,*)'
       '      external           dgetrf,dgetrs'
       '      info = 0'
       '      call dgetrf(n,n,a,lda,ipiv,info)'
       '      if(info.eq.0) then'
       '         call dgetrs(''no transpose'',n,nrhs,a,lda,ipiv,b,ldb,info)'
       '      end if'
       '      return'
       '      end'],TMPDIR+'/dgesvtst.f');
function [X, LU, IPIV, INFO] = msolve(A,B)
// Simplified From Mark code, solve AX = B for matrix X with DGESV from LAPACK
  [N, NCA]     = size(A);
  [LDB,NRHS]   = size(B);
  LDA          = N;
  INFO         = 0;
  [LU, IPIV, X, INFO]  =  call ('dgesvtst',...
				N   , 1, "i", ...
				NRHS, 2, "i", ...
				A   , 3, "d", ...
				LDA , 4, "i", ...
				B   , 6, "d", ...
				LDB , 7, "i", ...
				"out", ...
				3,...
				[N,1],5, "i", ...
				6,...
				[1,1],8, "i");
endfunction
chdir(TMPDIR);
libn=ilib_for_link('dgesvtst','dgesvtst.f',[],'f');
   Generate a loader file
   Generate a Makefile
   Running the Makefile
   Compilation of dgesvtst.f
   Building shared library (be patient)
   Generate a cleaner file
exec loader.sce;
Shared archive loaded.
Link done.
chdir(curdir),
 ans  =
  T
n=44;
A=eye(n,n);B=(1:n)';
[X, LU, IPIV, INFO] = msolve(A,B);
if norm(A*X-B)>1d-15 then bugmes();quit;end
