// =============================================================================
// Scilab ( http://www.scilab.org/ ) - This file is part of Scilab
// Copyright (C) 2013 - Scilab Enterprises - Paul Bignier
//
//  This file is distributed under the same license as the Scilab package.
// =============================================================================
//
// <-- CLI SHELL MODE -->
//
// <-- ENGLISH IMPOSED -->
//
// <-- Non-regression test for bug 9697 -->
//
// <-- GitLab URL -->
// https://gitlab.com/scilab/scilab/-/issues/9697
//
// <-- Short Description -->
// The optim/"qn" /"gc" with bounds and iprint=1 did not print the basic information of the problem.
//
function [f, g, ind] = woodFG(x, ind)
    if ind == 2 | ind == 3 | ind == 4 then
        A = x(2)-x(1)^2
        B = x(4)-x(3)^2
    end
    if ind == 2 | ind == 4 then
        f = 100*A^2+(1-x(1))^2+90*B^2+(1-x(3))^2+...
        10.1*((x(2)-1)^2+(x(4)-1)^2)+19.8*(x(2)-1)*(x(4)-1)
    else
        f = 0
    end
    if ind == 3 | ind == 4 then
        g(1) = -2*(200*x(1)*A+1.-x(1))
        g(2) = 2*(100*A+10.1*(x(2)-1)+9.9*(x(4)-1))
        g(3) = -2*(180*x(3)*B+1.-x(3))
        g(4) = 2*(90*B+10.1*(x(4)-1)+9.9*(x(2)-1))
    else
        g = zeros(x)
    end
endfunction
x0 = [-3 -1 -3 -1];
binf = [-10 -10 -10 -10];
bsup = [0 0 0 0];
[fopt, xopt, gopt] = optim(woodFG, "b", binf, bsup, x0, "qn", iprint=1);
 *********** qnbd (with bound cstr) ****************
dimension=         4, epsq=  0.2220446049250313E-15, verbosity level: iprint=         1
max number of iterations allowed: iter=       100
max number of calls to costf allowed: nap=       100
------------------------------------------------
 qnbd : retour cause gradient projete petit= 0.0000D+00
 qnbd : indqn=       1
optim: Norm of projected gradient lower than 2.22045e-16.
[fopt, xopt, gopt] = optim(woodFG, "b", binf, bsup, x0, "gc", iprint=1);
 gcdb: entry point
     dimension of the problem (n):     4
     expected decrease for f (df0): 0.10D+01
     relative precision on g (epsg): 0.22D-15
     maximal number of iterations (itmax):   100
     maximal number of simulations (napmax):   100
     printing level (iprint):   1
 gcbd : retour avec indgc=       1
 f,norme grad,nap,iter,indgc= 0.4200E+02 0.0000E+00    16   -11     1
optim: Norm of projected gradient lower than 2.22045e-16.
