// =============================================================================
// Scilab ( http://www.scilab.org/ ) - This file is part of Scilab
// Copyright (C) 2010 - DIGITEO - Allan CORNET
//
//  This file is distributed under the same license as the Scilab package.
// =============================================================================
//
// <-- Non-regression test for bug 7946 -->
//
// <-- CLI SHELL MODE -->
// 
// <-- GitLab URL -->
// https://gitlab.com/scilab/scilab/-/issues/7946
//
// <-- Short Description -->
// error(0, "bye") crashed Scilab
if execstr("error(0, ""bye"");", "errcatch") <> 999 then bugmes();quit;end
if lasterror() <> msprintf(_("%s: Wrong value for input argument #%d: Value greater than 0 expected.\n"), "error", 1) then bugmes();quit;end
if execstr("error(-10, ""bye"");", "errcatch") <> 999 then bugmes();quit;end
if lasterror() <> msprintf(_("%s: Wrong value for input argument #%d: Value greater than 0 expected.\n"), "error", 1) then bugmes();quit;end
if execstr("error(""bye"", -10);", "errcatch") <> 999 then bugmes();quit;end
if lasterror() <> msprintf(_("%s: Wrong value for input argument #%d: Value greater than 0 expected.\n"), "error", 2) then bugmes();quit;end
if execstr("error(""bye"", 0);", "errcatch") <> 999 then bugmes();quit;end
if lasterror() <> msprintf(_("%s: Wrong value for input argument #%d: Value greater than 0 expected.\n"), "error", 2) then bugmes();quit;end
if execstr("error(""Hello"", 2000);", "errcatch") <> 2000 then bugmes();quit;end
if lasterror() <> "Hello" then bugmes();quit;end
if execstr("error(2000, ""Hello"");", "errcatch") <> 2000 then bugmes();quit;end
if lasterror() <> "Hello" then bugmes();quit;end
