// =============================================================================
// Scilab ( http://www.scilab.org/ ) - This file is part of Scilab
// Copyright (C) 2008 - INRIA - Pierre MARECHAL <pierre.marechal@inria.fr>
//
//  This file is distributed under the same license as the Scilab package.
// =============================================================================
// <-- CLI SHELL MODE -->
// <-- Non-regression test for bug 3661 -->
//
// <-- GitLab URL -->
// https://gitlab.com/scilab/scilab/-/issues/3661
//
// <-- Short Description -->
// cotg and coth do not work.
if execstr("cotg(1);","errcatch")<>0 then bugmes();quit;end
if execstr("coth(1);","errcatch")<>0 then bugmes();quit;end
