// =============================================================================
// Scilab ( http://www.scilab.org/ ) - This file is part of Scilab
// Copyright (C) 2011 - DIGITEO - Bruno JOFRET
//
//  This file is distributed under the same license as the Scilab package.
// =============================================================================
//
// <-- Non-regression test for bug 9600 -->
//
// <-- CLI SHELL MODE -->
//
// <-- GitLab URL -->
// https://gitlab.com/scilab/scilab/-/issues/9600
//
// <-- Short Description -->
// Can not assign empty matrix in a list or cell
l = list();
if execstr("l(1) = []", "errcatch") <> 0 then bugmes();quit;end
if l(1) <> [] then bugmes();quit;end
l = list();
if execstr("l(1) = {}", "errcatch") <> 0 then bugmes();quit;end
if l(1) <> {} then bugmes();quit;end
c = {};
if execstr("c{1} = []", "errcatch") <> 0 then bugmes();quit;end
if c{1} <> [] then bugmes();quit;end
if execstr("c{1} = {}", "errcatch") <> 0 then bugmes();quit;end
if c{1} <> {} then bugmes();quit;end
if execstr("c{1} = list()", "errcatch") <> 0 then bugmes();quit;end
if c{1} <> list() then bugmes();quit;end
