// =============================================================================
// Scilab ( http://www.scilab.org/ ) - This file is part of Scilab
// Copyright (C) 2013 - Scilab Enterprises - Antoine ELIAS
//
//  This file is distributed under the same license as the Scilab package.
// =============================================================================
// <-- CLI SHELL MODE -->
//
// <-- Non-regression test for bug 14024 -->
//
// <-- GitLab URL -->
// https://gitlab.com/scilab/scilab/-/issues/14082
//
// <-- Short Description -->
// print of macrofile display a debug message instead of macro prototype.
a = acot
 a  = 
[y]=a(x)
