// =============================================================================
// Scilab ( http://www.scilab.org/ ) - This file is part of Scilab
// Copyright (C) 2013 - Scilab Enterprises - Charlotte HECQUET
//
//  This file is distributed under the same license as the Scilab package.
// =============================================================================
//
// <-- CLI SHELL MODE -->
//
// <-- Non-regression test for bug 6693 -->
//
// <-- GitLab URL -->
// https://gitlab.com/scilab/scilab/-/issues/6693
//
// <-- Short Description -->
// modulo does not accept polynomial inputs.
assert_checkequal(modulo(%z^2,%z),0);
