// =============================================================================
// Scilab ( http://www.scilab.org/ ) - This file is part of Scilab
// Copyright (C) 2008 - INRIA - Vincent COUVERT
//
//  This file is distributed under the same license as the Scilab package.
// =============================================================================
// <-- TEST WITH GRAPHIC -->
//
// <-- Non-regression test for bug 2565 -->
//
// <-- GitLab URL -->
// https://gitlab.com/scilab/scilab/-/issues/2565
//
// <-- Short Description -->
//    Sscalar uicontrol('listbox') string entries are tcl-substituted, vector string
//    entries not (i.e., dollars, brackets, backslashes are taken literally, etc.)
f = figure(1);
h = uicontrol(f,"style","listbox",..
    "position",[10 10 150 150],..
    "string",["\Q\q"]);
if get(h,"string") <> "\Q\q" then bugmes();quit;end
set(h,"string",["\Q","\q"])
if or(get(h,"string") <> ["\Q","\q"]) then bugmes();quit;end
