// =============================================================================
// Scilab ( http://www.scilab.org/ ) - This file is part of Scilab
// Copyright (C) 2008 - DIGITEO - Sylvestre LEDRU
//
//  This file is distributed under the same license as the Scilab package.
// =============================================================================
// <-- CLI SHELL MODE -->
// <-- Non-regression test for bug 3529 -->
//
// <-- GitLab URL -->
// https://gitlab.com/scilab/scilab/-/issues/3529
//
// <-- Short Description -->
// rmdir() change directory permissions instead of deleting them.
wm = warning('query');
warning('off');
baseDir=TMPDIR+"/plop";
mkdir(baseDir);
mkdir(baseDir+"/aze");
mkdir(baseDir+"/aze/aze");
mkdir(baseDir+"/aze/aze/qsdq");
res=rmdir(baseDir,'s');
if res <> 1 then bugmes();quit;end
if isdir(baseDir) <> %f then bugmes();quit;end
