// =============================================================================
// Scilab ( http://www.scilab.org/ ) - This file is part of Scilab
// Copyright (C) 2005 - INRIA - Farid BELAHCENE
//
//  This file is distributed under the same license as the Scilab package.
// =============================================================================
// <-- CLI SHELL MODE -->
// <-- ENGLISH IMPOSED -->
// <-- Non-regression test for bug 1468 -->
//
// <-- GitLab URL -->
// https://gitlab.com/scilab/scilab/-/issues/1468
//
// <-- Short Description -->
//    1) 'macr2tree' function doesn't work correctly with the following script
MFILECONTENTS=["beep";
		"beep on";
		"beep off";
		"s = beep()"]
 MFILECONTENTS  = 
  "beep"      
  "beep on"   
  "beep off"  
  "s = beep()"
MFILE=TMPDIR+"/bug1468.m"
 MFILE  = 
  "TMPDIR/bug1468.m"
SCIFILE=TMPDIR+"/bug1468.sci"
 SCIFILE  = 
  "TMPDIR/bug1468.sci"
mputl(MFILECONTENTS,MFILE);
mfile2sci(MFILE,TMPDIR,%f,%t);
  ****** Beginning of mfile2sci() session ******
  File to convert: TMPDIR/bug1468.m
  Result file path: TMPDIR/
  Recursive mode: OFF
  Only double values used in M-file: YES
  Verbose mode: 3
  Generate formatted code: NO
  M-file reading...
  M-file reading: Done
  Syntax modification...
  Syntax modification: Done
  Macro to tree conversion...
  Conversion of M-tree...
  Conversion of M-tree: Done
  Macro to tree conversion: Done
  ****** End of mfile2sci() session ******
SCIFILECONTENTS=mgetl(SCIFILE);
SCIFILECONTENTSREF=[
        ""
        "beep"
        "beep(""on"")"
        "beep(""off"")"
        "s = beep()"];
if or(SCIFILECONTENTSREF<>SCIFILECONTENTS) then bugmes();quit;end
