// =============================================================================
// Scilab ( http://www.scilab.org/ ) - This file is part of Scilab
// Copyright (C) 2008 - INRIA - Pierre MARECHAL <pierre.marechal@inria.fr>
//
//  This file is distributed under the same license as the Scilab package.
// =============================================================================
// <-- CLI SHELL MODE -->
// <-- Non-regression test for bug 2692 -->
//
// <-- GitLab URL -->
// https://gitlab.com/scilab/scilab/-/issues/2692
//
// <-- Short Description -->
//   bitand( int8(x) , int8(y) ) doesn't return an int8 object.
// uint8
// =============================================================================
a = uint8(77);
b = uint8(89);
c = bitand(a,b);
if inttype(c) <> 11 then bugmes();quit;end
c = bitor(a,b);
if inttype(c) <> 11 then bugmes();quit;end
c = bitxor(a,b);
if inttype(c) <> 11 then bugmes();quit;end
// uint16
// =============================================================================
a = uint16(58);
b = uint16(24);
c = bitand(a,b);
if inttype(c) <> 12 then bugmes();quit;end
c = bitor(a,b);
if inttype(c) <> 12 then bugmes();quit;end
c = bitxor(a,b);
if inttype(c) <> 12 then bugmes();quit;end
// uint32
// =============================================================================
a = uint32(44);
b = uint32(56);
c = bitand(a,b);
if inttype(c) <> 14 then bugmes();quit;end
c = bitor(a,b);
if inttype(c) <> 14 then bugmes();quit;end
c = bitxor(a,b);
if inttype(c) <> 14 then bugmes();quit;end
