//<-- CLI SHELL MODE -->
// =============================================================================
// Scilab ( http://www.scilab.org/ ) - This file is part of Scilab
// Copyright (C) 2009 - DIGITEO - Sylvestre LEDRU
//
//  This file is distributed under the same license as the Scilab package.
// =============================================================================
// <-- Non-regression test for bug 4297 -->
//
// <-- GitLab URL -->
// https://gitlab.com/scilab/scilab/-/issues/4297
//
// <-- Short Description -->
//     A spelling mistake was causing in some cases with the pfss function
W=ssrand(1,1,6);
if execstr("pfss(W,10);","errcatch")<>0 then bugmes();quit;end
