// =============================================================================
// Scilab ( http://www.scilab.org/ ) - This file is part of Scilab
// Copyright (C) 2018 - Stéphane MOTTELET
//
//  This file is distributed under the same license as the Scilab package.
// =============================================================================
//
// <-- CLI SHELL MODE -->
//
// <-- Non-regression test for bug 15640 -->
//
// <-- GitLab URL -->
// https://gitlab.com/scilab/scilab/-/issues/15640
//
// <-- Short Description -->
// display in mode format("e") is corrupted (regression w.r.t. Scilab 5.5.2)
format("e",25)
256
 ans  =
   2.560000000000000000D+02
%pi
 %pi  = 
   3.141592653589793116D+00
nearfloat("succ",0)
 ans  =
   4.94065645841246544D-324
format("v",10)
X=testmatrix('magi',4)/3;
X([2 3 4 7 8 12])=%eps*[2 3 4 7 8 12]/8
 X  = 
   5.3333333   0.6666667   1.          4.3333333
   5.551D-17   3.6666667   3.3333333   2.6666667
   8.327D-17   1.943D-16   2.          4.       
   1.110D-16   2.220D-16   3.331D-16   0.3333333
X=[1 2;3 4]
 X  = 
   1.   2.
   3.   4.
exp(%i*%pi*X)
 ans  =
  -1. + 1.225D-16i   1. - 2.449D-16i
  -1. + 3.674D-16i   1. - 4.899D-16i
exp(%i*%pi*X/2)
 ans  =
   6.123D-17 + i    -1. + 1.225D-16i
  -1.837D-16 - i     1. - 2.449D-16i
exp(%i*%pi*X/4)
 ans  =
   0.7071068 + 0.7071068i   6.123D-17 + i         
  -0.7071068 + 0.7071068i  -1.        + 1.225D-16i
X=[1 20;300 4000]
 X  = 
   1.     20.  
   300.   4000.
string(X)
 ans  =
  "1"    "20"  
  "300"  "4000"
