// =============================================================================
// Scilab ( http://www.scilab.org/ ) - This file is part of Scilab
// Copyright (C) 2008-2008 - INRIA - Jean-Baptiste Silvy
//
//  This file is distributed under the same license as the Scilab package.
// =============================================================================
// <-- TEST WITH GRAPHIC -->
// <-- Non-regression test for bug 2146 -->
//
// <-- GitLab URL -->
// https://gitlab.com/scilab/scilab/-/issues/2146
//
// <-- Short Description -->
// Plot of large data feezes Scilab
// should not freeze Scilab
t=1:100000;y=sin(t./10);plot(y)
