//<-- CLI SHELL MODE -->
// =============================================================================
// Scilab ( http://www.scilab.org/ ) - This file is part of Scilab
// Copyright (C) 2013 - Scilab Enterprises - Charlotte HECQUET
//
//  This file is distributed under the same license as the Scilab package.
// =============================================================================
// <-- Non-regression test for bug 11996 -->
//
// <-- GitLab URL -->
// https://gitlab.com/scilab/scilab/-/issues/11996
//
// <-- Short Description -->
// Extend eye() to hypermatrix
ref222(:,:,1) = [1,0;0,0];
ref222(:,:,2) = [0,0;0,1];
assert_checkequal(eye(rand(2,2,2)), ref222);
ref4445(:,:,1,1) = [1,0,0,0;0,0,0,0;0,0,0,0;0,0,0,0];
ref4445(:,:,2,1) = zeros(4,4);
ref4445(:,:,3,1) = zeros(4,4);
ref4445(:,:,4,1) = zeros(4,4);
ref4445(:,:,1,2) = zeros(4,4);
ref4445(:,:,2,2) = [0,0,0,0;0,1,0,0;0,0,0,0;0,0,0,0];
ref4445(:,:,3,2) = zeros(4,4);
ref4445(:,:,4,2) = zeros(4,4);
ref4445(:,:,1,3) = zeros(4,4);
ref4445(:,:,2,3) = zeros(4,4);
ref4445(:,:,3,3) = [0,0,0,0;0,0,0,0;0,0,1,0;0,0,0,0];
ref4445(:,:,4,3) = zeros(4,4);
ref4445(:,:,1,4) = zeros(4,4);
ref4445(:,:,2,4) = zeros(4,4);
ref4445(:,:,3,4) = zeros(4,4);
ref4445(:,:,4,4) = [0,0,0,0;0,0,0,0;0,0,0,0;0,0,0,1];
ref4445(:,:,1,5) = zeros(4,4);
ref4445(:,:,2,5) = zeros(4,4);
ref4445(:,:,3,5) = zeros(4,4);
ref4445(:,:,4,5) = zeros(4,4);
assert_checkequal(eye(zeros(4,4,4,5)), ref4445);
M = matrix(1:24, [2 3 2 2]);
ref2322(:,:,1,1) = [1,0,0;0,0,0];
ref2322(:,:,2,1) = zeros(2,3);
ref2322(:,:,1,2) = zeros(2,3);
ref2322(:,:,2,2) = [0,0,0;0,1,0];
assert_checkequal(eye(M), ref2322);
ref5(:,:,1) = [1,0,0,0;0,0,0,0;0,0,0,0;0,0,0,0];
ref5(:,:,2) = [0,0,0,0;0,1,0,0;0,0,0,0;0,0,0,0];
ref5(:,:,3) = [0,0,0,0;0,0,0,0;0,0,1,0;0,0,0,0];
ref5(:,:,4) = [0,0,0,0;0,0,0,0;0,0,0,0;0,0,0,1];
assert_checkequal(eye(4,4,4), ref5);
