// =============================================================================
// Scilab ( http://www.scilab.org/ ) - This file is part of Scilab
// Copyright (C) 2009 - DIGITEO - Allan CORNET
//
//  This file is distributed under the same license as the Scilab package.
// =============================================================================
// <-- CLI SHELL MODE -->
function a = test_mode_foo(level_mode)
  mode(level_mode);
  a = mode();
endfunction
ierr = execstr('mode(7.2);','errcatch');
if ierr <> 999 then bugmes();quit;end
ierr = execstr('mode(''ffo'');','errcatch');
if ierr <> 999 then bugmes();quit;end
ierr = execstr('mode([1 2]);','errcatch');
if ierr <> 999 then bugmes();quit;end
ierr = execstr('mode(%t);','errcatch');
if ierr <> 999 then bugmes();quit;end
ref = -1;
r = test_mode_foo(ref);
if r <> ref then bugmes();quit;end
ref = 0;
r = test_mode_foo(ref);
if r <> ref then bugmes();quit;end
ref = 500;
r = test_mode_foo(ref);
if r <> ref then bugmes();quit;end
ref = 2;
mode(ref);
exec mode : 2
exec mode : 2
 a  = 
   1.
 b  = 
   2.
 c  = 
   3.
 d  = 
   4.
 e  = 
   5.
 f  = 
   6.
 g  = 
   7.
 h  = 
   8.
 i  = 
   9.
 j  = 
   10.
printf("exec mode : %d\n", mode());
exec mode : 2
a = 1
 a  = 
   1.
b = 2,c=3
 b  = 
   2.
 c  = 
   3.
d = 4,if(1) e = 5
end;
 d  = 
   4.
 e  = 
   5.
f = 6,if(1)
    g = 7
end;
 f  = 
   6.
 g  = 
   7.
h = 8,if(1)
    i = 9
end;j=10
 h  = 
   8.
 i  = 
   9.
 j  = 
   10.
exec mode : 2
 a  = 
   1.
 b  = 
   2.
 c  = 
   3.
 d  = 
   4.
 e  = 
   5.
 f  = 
   6.
 g  = 
   7.
 h  = 
   8.
 i  = 
   9.
 j  = 
   10.
printf("exec mode : %d\n", mode());
exec mode : 2
a = 1
 a  = 
   1.
b = 2,c=3
 b  = 
   2.
 c  = 
   3.
d = 4,if(1) e = 5
end;
 d  = 
   4.
 e  = 
   5.
f = 6,if(1)
    g = 7
end;
 f  = 
   6.
 g  = 
   7.
h = 8,if(1)
    i = 9
end;j=10
 h  = 
   8.
 i  = 
   9.
 j  = 
   10.
script mode : -1
script mode : 0
 a  = 
   1.
 b  = 
   2.
 c  = 
   3.
 d  = 
   4.
 e  = 
   5.
 f  = 
   6.
 g  = 
   7.
 h  = 
   8.
 i  = 
   9.
 j  = 
   10.
printf("script mode : %d\n", mode());
script mode : 1
a = 1
 a  = 
   1.
b = 2,c=3
 b  = 
   2.
 c  = 
   3.
d = 4,if(1) e = 5
end;
 d  = 
   4.
 e  = 
   5.
f = 6,if(1)
    g = 7
end;
 f  = 
   6.
 g  = 
   7.
h = 8,if(1)
    i = 9
end;j=10
 h  = 
   8.
 i  = 
   9.
 j  = 
   10.
script mode : 2
 a  = 
   1.
 b  = 
   2.
 c  = 
   3.
 d  = 
   4.
 e  = 
   5.
 f  = 
   6.
 g  = 
   7.
 h  = 
   8.
 i  = 
   9.
 j  = 
   10.
printf("script mode : %d\n", mode());
script mode : 3
a = 1
 a  = 
   1.
b = 2,c=3
 b  = 
   2.
 c  = 
   3.
d = 4,if(1) e = 5
end;
 d  = 
   4.
 e  = 
   5.
f = 6,if(1)
    g = 7
end;
 f  = 
   6.
 g  = 
   7.
h = 8,if(1)
    i = 9
end;j=10
 h  = 
   8.
 i  = 
   9.
 j  = 
   10.
