// =============================================================================
// Scilab ( http://www.scilab.org/ ) - This file is part of Scilab
// Copyright (C) 2010 - DIGITEO - Allan CORNET
//
//  This file is distributed under the same license as the Scilab package.
// =============================================================================
//
// <-- CLI SHELL MODE -->
//
// <-- Non-regression test for bug 7124 -->
//
// <-- GitLab URL -->
// https://gitlab.com/scilab/scilab/-/issues/7124
//
// <-- Short Description -->
// mputl returned a wrong error message if file does not exist.
//
ierr = execstr("mputl(""ABC"", ""xzwz\names"")", "errcatch");
if ierr <> 999 then bugmes();quit;end
if lasterror() <> strsubst(msprintf(_("%s: Cannot open file %s.\n"), "mputl", "xzwz/names"), "/", "\") then bugmes();quit;end
