// =============================================================================
// Scilab ( http://www.scilab.org/ ) - This file is part of Scilab
// Copyright (C) 2008-2008 - INRIA - Jean-Baptiste Silvy
//
//  This file is distributed under the same license as the Scilab package.
// =============================================================================
// <-- TEST WITH GRAPHIC -->
// <-- Non-regression test for bug 2918 -->
//
// <-- GitLab URL -->
// https://gitlab.com/scilab/scilab/-/issues/2918
//
// <-- Short Description -->
// In the demo of contourf, some black points are drawn near the X-axis and Y-axis intersection.
// often use in old scripts
// should not display black dots on the edges of the axes
plot2d([0;1],[0;1],0,strf="121",leg=" ",rect=[0, 0, 1, 1],nax=[1,10,1,10]);
