// =============================================================================
// Scilab ( http://www.scilab.org/ ) - This file is part of Scilab
// Copyright (C) ????-2008 - INRIA - Vincent COUVERT <vincent.couvert@inria.fr>
// Copyright (C) 2005-2008 - INRIA - Pierre MARECHAL <pierre.marechal@inria.fr>
//
//  This file is distributed under the same license as the Scilab package.
// =============================================================================
// <-- CLI SHELL MODE -->
// <-- ENGLISH IMPOSED -->
// <-- Non-regression test for bug 924 -->
//
// <-- GitLab URL -->
// https://gitlab.com/scilab/scilab/-/issues/924
//
// <-- Short Description -->
//    Bad handling of variable display in functions.
//    Following Matlab code :
//    function test
//    a='milou'
//    a
//    should be converted to Scilab code :
//    function test
//    a='milou'
//    disp(a)
//    but it is not....
MFILECONTENTS=["function bug924";
"a=''milou'';";
"a=''milou'',";
"a=''milou''";
"a;";
"a,";
"a";
"[c,d]=svd(1);";
"[c,d]=svd(1),";
"[c,d]=svd(1)";
"b=a;";
"b=a,";
"b=a"];
MFILE=TMPDIR+"/bug924.m";
SCIFILE=TMPDIR+"/bug924.sci";
mputl(MFILECONTENTS,MFILE);
mfile2sci(MFILE,TMPDIR);
  ****** Beginning of mfile2sci() session ******
  File to convert: TMPDIR/bug924.m
  Result file path: TMPDIR/
  Recursive mode: OFF
  Only double values used in M-file: NO
  Verbose mode: 3
  Generate formatted code: NO
  M-file reading...
  M-file reading: Done
  Syntax modification...
  Syntax modification: Done
  Macro to tree conversion...
  Conversion of M-tree...
  Conversion of M-tree: Done
  Macro to tree conversion: Done
  ****** End of mfile2sci() session ******
SCIFILECONTENTS=mgetl(SCIFILE);
SCIFILECONTENTSREF=["function [] = bug924()";
"";
"a = ""milou"";";
"a = ""milou""";
"a = ""milou""";
"a;";
"a";
"a";
"[c,d] = svd(1);";
"[c,d] = svd(1)";
"[c,d] = svd(1)";
"b = a;";
"b = a";
"b = a";
"endfunction"];
if or(SCIFILECONTENTSREF<>SCIFILECONTENTS) then bugmes();quit;end
