// =============================================================================
// Scilab ( http://www.scilab.org/ ) - This file is part of Scilab
// Copyright (C) 2005 - INRIA - Farid BELAHCENE
//
//  This file is distributed under the same license as the Scilab package.
// =============================================================================
// <-- CLI SHELL MODE -->
// <-- ENGLISH IMPOSED -->
// <-- Non-regression test for bug 1971 -->
//
// <-- GitLab URL -->
// https://gitlab.com/scilab/scilab/-/issues/1971
//
// <-- Short Description -->
//    the mtlb_fprintf does not work. It should be re-written to follow the Matlab doc
//    of fprintf
MFILECONTENTS=[
"fprintf(''qsdfsdcvwqghcv'')";
];
MFILE=TMPDIR+"/bug1971.m";
SCIFILE=TMPDIR+"/bug1971.sci";
fd=mopen(MFILE,"w");
mputl(MFILECONTENTS,fd);
mclose(fd);
mfile2sci(MFILE,TMPDIR);
  ****** Beginning of mfile2sci() session ******
  File to convert: TMPDIR/bug1971.m
  Result file path: TMPDIR/
  Recursive mode: OFF
  Only double values used in M-file: NO
  Verbose mode: 3
  Generate formatted code: NO
  M-file reading...
  M-file reading: Done
  Syntax modification...
  Syntax modification: Done
  Macro to tree conversion...
  Conversion of M-tree...
  L.1: No simple equivalent, so mtlb_fprintf() is called.
  Conversion of M-tree: Done
  Macro to tree conversion: Done
  ****** End of mfile2sci() session ******
fd=mopen(SCIFILE,"r");
SCIFILECONTENTS=mgetl(fd,-1);
mclose(fd);
SCIFILECONTENTSREF=[
    ""
    "// L.1: No simple equivalent, so mtlb_fprintf() is called."
    "mtlb_fprintf(""qsdfsdcvwqghcv"")"
    ];
if or(SCIFILECONTENTSREF<>SCIFILECONTENTS) then bugmes();quit;end
instr = 'mtlb_fprintf(""qsdfsdcvwqghcv"")';
ierr  = execstr(instr,'errcatch');
qsdfsdcvwqghcv 
if ierr<>0  then bugmes();quit;end
