// =============================================================================
// Scilab ( http://www.scilab.org/ ) - This file is part of Scilab
// Copyright (C) 2012 - Scilab Enterprises - Cedric Delamarre
//
//  This file is distributed under the same license as the Scilab package.
// =============================================================================
// <-- TEST WITH GRAPHIC -->
// <-- Non-regression test for bug 11449 -->
//
// <-- GitLab URL -->
// https://gitlab.com/scilab/scilab/-/issues/11449
//
// <-- Short Description -->
// color('red') create a visible figure
f=gdf();
s = size(f.color_map, 'r');
newColor = color(240,240,240);
assert_checkequal(size(f.color_map, 'r'), s + 1);
assert_checkequal(color(240,240,240), newColor);
color('red');
assert_checkequal(winsid(), []);
