//<-- CLI SHELL MODE -->
// =============================================================================
// Scilab ( http://www.scilab.org/ ) - This file is part of Scilab
// Copyright (C) 2009 - DIGITEO - Allan CORNET
//
//  This file is distributed under the same license as the Scilab package.
// =============================================================================
// <-- Non-regression test for bug 6734 -->
//
// <-- GitLab URL -->
// https://gitlab.com/scilab/scilab/-/issues/6734
//
// <-- Short Description -->
//
// read_csv function contains erroneous error message.
ierr = execstr("M = read_csv(''doesnotexist.txt'')", "errcatch");
assert_checkequal(ierr,999)
 ans  =
  T
L = lasterror();
assert_checkequal(grep(L(1),"doesnotexist.txt"), 1);
