// =============================================================================
// Scilab ( http://www.scilab.org/ ) - This file is part of Scilab
// Copyright (C) 2014 - Scilab Enterprises - Calixte DENIZET
//
//  This file is distributed under the same license as the Scilab package.
// =============================================================================
//
// <-- Non-regression test for bug 13150 -->
//
// <-- GitLab URL -->
// https://gitlab.com/scilab/scilab/-/issues/13150
//
// <-- Short Description -->
// Vectorial export used too much memory for grayplot
driver("png")
 ans  =
  "Rec"
xinit(TMPDIR+"/plop.png")
m = rand(500,500);
grayplot(1:500, 1:500, m);
xend();
