//<-- CLI SHELL MODE -->
// =============================================================================
// Scilab ( http://www.scilab.org/ ) - This file is part of Scilab
// Copyright (C) ????-2008 - INRIA
//
//  This file is distributed under the same license as the Scilab package.
// =============================================================================
// <-- Non-regression test for bug 474 -->
//
// <-- GitLab URL -->
// https://gitlab.com/scilab/scilab/-/issues/474
//
// <-- Short Description -->
//    Bug Report Id: 120442003624174827
//    k should be a 2 element vector!! like
//
//    -->a=matrix(1:9,3,3); [m,k]=min(a)       
//     k  =
//
//    !   1.    1. !
//     m  =
//
//        1.  
//
//    -->a=matrix(1:9,3,3); [m,k]=max(a)
//     k  =
//
//    !   3.    3. !
//     m  =
//
//        9.
//
//
// ...
//correct=%F
a=matrix(1:9,3,3)
 a  = 
   1.   4.   7.
   2.   5.   8.
   3.   6.   9.
[mia,kia]=min(a)
 mia  = 
   1.
 kia  = 
   1.   1.
[maa,kaa]=max(a)
 maa  = 
   9.
 kaa  = 
   3.   3.
b=int16(matrix(1:9,3,3))
 b  = 
  1  4  7
  2  5  8
  3  6  9
[mib,kib]=min(b)
 mib  = 
  1
 kib  = 
   1.   1.
[mab,kab]=max(b)
 mab  = 
  9
 kab  = 
   3.   3.
if mia<>mib     then bugmes();quit;end
if or(kia<>kib) then bugmes();quit;end
if maa<>mab     then bugmes();quit;end
if or(kaa<>kab) then bugmes();quit;end
