// =============================================================================
// Scilab ( http://www.scilab.org/ ) - This file is part of Scilab
// Copyright (C) 2010 - DIGITEO - Allan CORNET
//
//  This file is distributed under the same license as the Scilab package.
// =============================================================================
// <-- TEST WITH GRAPHIC -->
// <-- Non-regression test for bug 7688 -->
//
// <-- GitLab URL -->
// https://gitlab.com/scilab/scilab/-/issues/7688
//
// <-- Short Description -->
// set("color_map", hsvcolormap(128)) produced a EXCEPTION_STACK_OVERFLOW 
if execstr("set(""color_map"", hsvcolormap(128))", "errcatch") <> 999 then bugmes();quit;end
