// =============================================================================
// Scilab ( http://www.scilab.org/ ) - This file is part of Scilab
// Copyright (C) 2009 - DIGITEO - Allan CORNET
//
//  This file is distributed under the same license as the Scilab package.
// =============================================================================
// <-- Non-regression test for bug 5456 -->
//
// <-- GitLab URL -->
// https://gitlab.com/scilab/scilab/-/issues/5456
//
// <-- Short Description -->
// TCL_UpVar(source,alias) returns %T even if the TCL variable source did not exist and then aliasing had not been performed.
//
// =============================================================================
if TCL_ExistVar("tmp") <> %f then bugmes();quit;end
if TCL_UpVar("tmp","tmp2") <> %f then bugmes();quit;end
if TCL_ExistVar("tmp2") <> %f then bugmes();quit;end
// =============================================================================
if TCL_SetVar("tmp","OK") <> %t then bugmes();quit;end
if TCL_ExistVar("tmp") <> %t then bugmes();quit;end
if TCL_UpVar("tmp","tmp2") <> %t then bugmes();quit;end
if TCL_ExistVar("tmp2") <> %t then bugmes();quit;end
if TCL_GetVar("tmp2") <> "OK" then bugmes();quit;end
// =============================================================================
if TCL_SetVar("Scilab","OK") <> %t then bugmes();quit;end
if TCL_UpVar("Scilab","ScilabBis") <> %t then bugmes();quit;end
if TCL_GetVar("ScilabBis") <> "OK" then bugmes();quit;end
if TCL_SetVar("Scilab","NOK") <> %t then bugmes();quit;end
if TCL_GetVar("ScilabBis")<> "NOK" then bugmes();quit;end
if TCL_SetVar("ScilabBis","modified") <> %t then bugmes();quit;end
if TCL_GetVar("ScilabBis") <> "modified" then bugmes();quit;end
if TCL_GetVar("Scilab") <>  "modified" then bugmes();quit;end
if TCL_GetVar("Scilab") <> TCL_GetVar("ScilabBis") then bugmes();quit;end
// =============================================================================
if TCL_CreateSlave('InterpBis') <> 'InterpBis' then bugmes();quit;end
if TCL_SetVar("Scilab","Good",'InterpBis') <> %t then bugmes();quit;end
if TCL_UpVar("Scilab","ScilabBis",'InterpBis') <> %t then bugmes();quit;end
if TCL_GetVar("ScilabBis",'InterpBis') <> 'Good' then bugmes();quit;end
if TCL_SetVar("Scilab","Not good",'InterpBis') <> %t then bugmes();quit;end
if TCL_GetVar("ScilabBis",'InterpBis') <> "Not good" then bugmes();quit;end
if TCL_SetVar("ScilabBis","modified again",'InterpBis') <> %t then bugmes();quit;end
if TCL_GetVar("ScilabBis",'InterpBis') <> "modified again" then bugmes();quit;end
if TCL_GetVar("Scilab",'InterpBis') <> TCL_GetVar("ScilabBis",'InterpBis') then bugmes();quit;end
TCL_DeleteInterp('InterpBis')
// =============================================================================
