// =============================================================================
// Scilab ( http://www.scilab.org/ ) - This file is part of Scilab
// Copyright (C) 2008 - INRIA - Vincent COUVERT
//
//  This file is distributed under the same license as the Scilab package.
// =============================================================================
// <-- INTERACTIVE TEST -->
//
// <-- Non-regression test for bug 3924 -->
//
// <-- GitLab URL -->
// https://gitlab.com/scilab/scilab/-/issues/3924
//
// <-- Short Description -->
//    I used uicontrol with bad parameters, but uicontrol makes scilab hangs.
ierr = execstr("uicontrol(1,""style"",""text"",""string"",""Solution"",""position"",[603,30,192,120],""horizontalalignment"",""center"")", "errcacth");
msg = lasterror();
if ierr==0 | msg<>msprintf(gettext("%s: Wrong type for input argument #%d: A ''%s'' or a ''%s'' handle expected.\n"),"uicontrol", 1, "Figure", "Frame uicontrol") then
  pause
end
ierr = execstr("uicontrol(""Parent"",1,""style"",""text"",""string"",""Solution"",""position"",[603,30,192,120],""horizontalalignment"",""center"")", "errcatch");
msg = lasterror();
if ierr==0 | msg<>msprintf(gettext("%s: Wrong type for ''%s'' property: A ''%s'' or a ''%s'' handle expected.\n"),"set_parent_property","Parent","Figure", "Frame uicontrol") then
  pause
end
ierr = execstr("uicontrol(1)", "errcatch");
msg = lasterror();
if ierr==0 | msg<>msprintf(gettext("%s: Wrong type for input argument #%d: A graphic handle expected.\n"),"uicontrol", 1) then
  pause
end
