// =============================================================================
// Scilab ( http://www.scilab.org/ ) - This file is part of Scilab
// Copyright (C) 2010 - DIGITEO - Clément DAVID
//
//  This file is distributed under the same license as the Scilab package.
// =============================================================================
// <-- XCOS TEST -->
//
// <-- Non-regression test for bug 8235 -->
//
// <-- GitLab URL -->
// https://gitlab.com/scilab/scilab/-/issues/8235
//
// <-- Short Description -->
// Masked superblock has their parameters overriden by the context.
importXcosDiagram(SCI + "/modules/xcos/tests/nonreg_tests/bug_8235.zcos");
xcos_simulate(scs_m, 4);
if or(B.values <> 2*A.values) then bugmes();quit;end
if or(C.values <> 3*A.values) then bugmes();quit;end
