// =============================================================================
// Scilab ( http://www.scilab.org/ ) - This file is part of Scilab
// Copyright (C) 2005 - INRIA - Farid BELAHCENE
//
//  This file is distributed under the same license as the Scilab package.
// =============================================================================
// <-- CLI SHELL MODE -->
// <-- ENGLISH IMPOSED -->
// <-- Non-regression test for bug 1124 -->
//
// <-- GitLab URL -->
// https://gitlab.com/scilab/scilab/-/issues/1124
//
// <-- Short Description -->
//    incapacity to use a function name as an identifier
MFILECONTENTS=[
"load([rep,''alpha'']);";
"load([rep,''beta'']);";
"mu=beta*alpha;";
];
MFILE=TMPDIR+"/bug1124.m";
SCIFILE=TMPDIR+"/bug1124.sci";
fd=mopen(MFILE,"w");
mputl(MFILECONTENTS,fd);
mclose(fd);
mfile2sci(MFILE,TMPDIR,,%T);
  ****** Beginning of mfile2sci() session ******
  File to convert: TMPDIR/bug1124.m
  Result file path: TMPDIR/
  Recursive mode: OFF
  Only double values used in M-file: YES
  Verbose mode: 3
  Generate formatted code: NO
  M-file reading...
  M-file reading: Done
  Syntax modification...
  Syntax modification: Done
  Macro to tree conversion...
  Conversion of M-tree...
  ! L.1: mtlb(rep) can be replaced by rep() or rep whether rep is an M-file or not.
  ! L.2: mtlb(rep) can be replaced by rep() or rep whether rep is an M-file or not.
  Conversion of M-tree: Done
  Macro to tree conversion: Done
  Translation may be improved: see the //! comments and for all mtlb_<funname> function call\n  Type help mtlb_<funname> in Scilab command window to get information about improvements.
  ****** End of mfile2sci() session ******
fd=mopen(SCIFILE,"r");
SCIFILECONTENTS=mgetl(fd,-1);
mclose(fd);
SCIFILECONTENTSREF=[
    ""
    "// ! L.1: mtlb(rep) can be replaced by rep() or rep whether rep is an M-file or not."
    "loadmatfile(mtlb(rep)+""alpha"");"
    "// ! L.2: mtlb(rep) can be replaced by rep() or rep whether rep is an M-file or not."
    "loadmatfile(mtlb(rep)+""beta"");"
    "mu = beta*alpha;"
    ];
if or(SCIFILECONTENTSREF<>SCIFILECONTENTS) then bugmes();quit;end
