// =============================================================================
// Scilab ( http://www.scilab.org/ ) - This file is part of Scilab
// Copyright (C) 2012 - INRIA - Serge Steer
//
//  This file is distributed under the same license as the Scilab package.
// =============================================================================
// <-- Non-regression test for bug 11333 -->
//
// <-- GitLab URL -->
// https://gitlab.com/scilab/scilab/-/issues/11333
//
// <-- Short Description -->
// Missing argument number checking
ierr=execstr("comet()","errcatch");
assert_checkequal(ierr,10000);
