// =============================================================================
// Scilab ( http://www.scilab.org/ ) - This file is part of Scilab
// Copyright (C) 2019 - ESI - Antoine ELIAS
//
//  This file is distributed under the same license as the Scilab package.
// =============================================================================
//
// <-- CLI SHELL MODE -->
//
// <-- Non-regression test for bug 15974 -->
//
// <-- GitLab URL -->
// https://gitlab.com/scilab/scilab/-/issues/15974
//
// <-- Short Description -->
// msprintf(*, %nan) doesn't return Nan
mprintf("%f\n",%inf)
Inf
mprintf("%f\n",-%inf)
-Inf
mprintf("%f\n",%nan)
Nan
mfprintf(6,"%f\n",%inf)
Inf
mfprintf(6,"%f\n",-%inf)
-Inf
mfprintf(6,"%f\n",%nan)
Nan
infStr = msprintf("%f",%inf);
minusInfStr = msprintf("%f",-%inf);
nanStr = msprintf("%f",%nan);
assert_checkequal(infStr,"Inf");
assert_checkequal(minusInfStr,"-Inf");
assert_checkequal(nanStr,"Nan");
