//<-- CLI SHELL MODE -->
// Scilab ( http://www.scilab.org/ ) - This file is part of Scilab
// Copyright (C) 2013 - Scilab Enterprises - Charlotte HECQUET
//
//  This file is distributed under the same license as the Scilab package.
// =============================================================================
//
// <-- Non-regression test for bug 12828 -->
//
// <-- GitLab URL -->
// https://gitlab.com/scilab/scilab/-/issues/12828
//
// <-- Short Description -->
// routh_t() function with two input argument (routh_t(h,kp)) gives a wrong table for the special case
// in which the first element of a row is zero.
s=%s;
P=s^3+3*s;
kp=2;
routh_t(1/P, kp);
assert_checkequal(routh_t(1/P, kp), routh_t(P+kp));
