// =============================================================================
// Scilab ( http://www.scilab.org/ ) - This file is part of Scilab
// Copyright (C) 2019 - Samuel GOUGEON
//
//  This file is distributed under the same license as the Scilab package.
// =============================================================================
//
// <-- CLI SHELL MODE -->
// <-- ENGLISH IMPOSED -->
//
// <-- Non-regression test for bug 16158 -->
//
// <-- GitLab URL -->
// https://gitlab.com/scilab/scilab/-/issues/16158
//
// <-- Short Description -->
// When a multicolumn array of rationals was displayed column per column,
// columns #2:$ were replaced with its column #2
p = poly(ones(1,15),"x","coeff");
R = [1 2 3] ./ p
 R  = 
 
         column 1
 
                                 1                                
   -------------------------------------------------------------  
   1 +x +x² +x³ +x⁴ +x⁵ +x⁶ +x⁷ +x⁸ +x⁹ +x¹⁰ +x¹¹ +x¹² +x¹³ +x¹⁴  
 
         column 2
 
                                 2                                
   -------------------------------------------------------------  
   1 +x +x² +x³ +x⁴ +x⁵ +x⁶ +x⁷ +x⁸ +x⁹ +x¹⁰ +x¹¹ +x¹² +x¹³ +x¹⁴  
 
         column 3
 
                                 3                                
   -------------------------------------------------------------  
   1 +x +x² +x³ +x⁴ +x⁵ +x⁶ +x⁷ +x⁸ +x⁹ +x¹⁰ +x¹¹ +x¹² +x¹³ +x¹⁴  
R = [1;1]*[1 2 3] ./ p
 R  = 
 
         column 1
 
                                 1                                
   -------------------------------------------------------------  
   1 +x +x² +x³ +x⁴ +x⁵ +x⁶ +x⁷ +x⁸ +x⁹ +x¹⁰ +x¹¹ +x¹² +x¹³ +x¹⁴  
                                 1                                
   -------------------------------------------------------------  
   1 +x +x² +x³ +x⁴ +x⁵ +x⁶ +x⁷ +x⁸ +x⁹ +x¹⁰ +x¹¹ +x¹² +x¹³ +x¹⁴  
 
         column 2
 
                                 2                                
   -------------------------------------------------------------  
   1 +x +x² +x³ +x⁴ +x⁵ +x⁶ +x⁷ +x⁸ +x⁹ +x¹⁰ +x¹¹ +x¹² +x¹³ +x¹⁴  
                                 2                                
   -------------------------------------------------------------  
   1 +x +x² +x³ +x⁴ +x⁵ +x⁶ +x⁷ +x⁸ +x⁹ +x¹⁰ +x¹¹ +x¹² +x¹³ +x¹⁴  
 
         column 3
 
                                 3                                
   -------------------------------------------------------------  
   1 +x +x² +x³ +x⁴ +x⁵ +x⁶ +x⁷ +x⁸ +x⁹ +x¹⁰ +x¹¹ +x¹² +x¹³ +x¹⁴  
                                 3                                
   -------------------------------------------------------------  
   1 +x +x² +x³ +x⁴ +x⁵ +x⁶ +x⁷ +x⁸ +x⁹ +x¹⁰ +x¹¹ +x¹² +x¹³ +x¹⁴  
p = poly(ones(1,7),"x","coeff");
R = [1 2 3] ./ p
 R  = 
 
         columns 1 to 2
 
              1                         2              
   ------------------------  ------------------------  
   1 +x +x² +x³ +x⁴ +x⁵ +x⁶  1 +x +x² +x³ +x⁴ +x⁵ +x⁶  
 
         column 3
 
              3              
   ------------------------  
   1 +x +x² +x³ +x⁴ +x⁵ +x⁶  
R = [1;1]*[1 2 3] ./ p
 R  = 
 
         columns 1 to 2
 
              1                         2              
   ------------------------  ------------------------  
   1 +x +x² +x³ +x⁴ +x⁵ +x⁶  1 +x +x² +x³ +x⁴ +x⁵ +x⁶  
              1                         2              
   ------------------------  ------------------------  
   1 +x +x² +x³ +x⁴ +x⁵ +x⁶  1 +x +x² +x³ +x⁴ +x⁵ +x⁶  
 
         column 3
 
              3              
   ------------------------  
   1 +x +x² +x³ +x⁴ +x⁵ +x⁶  
              3              
   ------------------------  
   1 +x +x² +x³ +x⁴ +x⁵ +x⁶  
