// =============================================================================
// Scilab ( http://www.scilab.org/ ) - This file is part of Scilab
// Copyright (C) ????-2008 - INRIA - Serge Steer
//
//  This file is distributed under the same license as the Scilab package.
// =============================================================================
// <-- CLI SHELL MODE -->
// <-- Non-regression test for bug 2645 -->
//
// <-- GitLab URL -->
// https://gitlab.com/scilab/scilab/-/issues/2645
//
// <-- Short Description -->
// integration of an expression reduced to the variable name
   if norm(integrate('x','x',0,10)-50)>1d-10 then bugmes();quit;end
