// =============================================================================
// Scilab ( http://www.scilab.org/ ) - This file is part of Scilab
// Copyright (C) 2015 - Scilab Enterprises - Cedric Delamarre
//
//  This file is distributed under the same license as the Scilab package.
// =============================================================================
//
// <-- CLI SHELL MODE -->
// <-- ENGLISH IMPOSED -->
//
// <-- Non-regression test for bug 14300 -->
//
// <-- GitLab URL -->
// https://gitlab.com/scilab/scilab/-/issues/14300
//
// <-- Short Description -->
// Crash when playing with structures.
clear s;
s.a.h = 1;
s.b.h = 2;
errmsg = msprintf("Unknown field : %s.", "h");
assert_checkerror("s(:).h;", errmsg);
assert_checkerror("s(1)(:).h;", errmsg);
