// =============================================================================
// Scilab ( http://www.scilab.org/ ) - This file is part of Scilab
// Copyright (C) 2010 - DIGITEO - Allan CORNET
//
//  This file is distributed under the same license as the Scilab package.
// =============================================================================
// <-- Non-regression test for bug 6387 -->
//
// <-- GitLab URL -->
// https://gitlab.com/scilab/scilab/-/issues/6489
//
// <-- Short Description -->
// removed a wrong dependendy on Wininet.dll 
if getos() == 'Windows' then
  r = dllinfo(SCI+'/bin/windows_tools.dll','imports');
  for i = 1 : size(r)
    if grep(r(i)(1),'/WININET.DLL/i','r') <> [] then bugmes();quit;end
  end
end
