// =============================================================================
// Scilab ( http://www.scilab.org/ ) - This file is part of Scilab
// Copyright (C) 2014 - Scilab Enterprises - Pierre-Aime Agnel
//
//  This file is distributed under the same license as the Scilab package.
// =============================================================================
//
// <-- Non-regression test for bug  -->
//
// <-- GitLab URL -->
// https://gitlab.com/scilab/scilab/-/issues/13421
//
// <-- Short Description -->
// Callback functions for genetic algorithms were missing
//
// <-- CLI SHELL MODE -->
// <-- ENGLISH IMPOSED -->
// Objective function
function y=f(x)
    y = sum(x.^2)
endfunction
// Output function with a stop criterion
function stop=output_ga_custom(gen_index, nb_generation, Pop, FObj_Pop, param)
    [threshold, err] = get_param(param, "threshold", 1E-10); // default value for the threshold
    printf(_("%s: iteration %d / %d \n"), "optim_ga", gen_index, nb_generation);
    printf(_("    min / max value found = %.4E / %.4E\n"), min(FObj_Pop), max(FObj_Pop));
    stop = %f
    if abs(max(FObj_Pop) - min(FObj_Pop)) < threshold then
        printf(_("    Stop criterion reached: Delta Max to Min under threshold"));
        stop = %t
    end
endfunction
PopSize     = 100;
Proba_cross = 0.7;
Proba_mut   = 0.1;
NbGen       = 20;
NbCouples   = 110;
Log         = %T;
pressure    = 0.05;
ga_params = init_param();
// Parameters to adapt to the shape of the optimization problem
ga_params = add_param(ga_params,"minbound",[-2; -2]);
ga_params = add_param(ga_params,"maxbound",[2; 2]);
ga_params = add_param(ga_params,"dimension",2);
ga_params = add_param(ga_params,"beta",0);
ga_params = add_param(ga_params,"delta",0.1);
// Parameters to fine tune the Genetic algorithm.
// All these parameters are optional for continuous optimization
// If you need to adapt the GA to a special problem, you
ga_params = add_param(ga_params,"init_func",init_ga_default);
ga_params = add_param(ga_params,"crossover_func",crossover_ga_default);
ga_params = add_param(ga_params,"mutation_func",mutation_ga_default);
ga_params = add_param(ga_params,"codage_func",coding_ga_identity);
ga_params = add_param(ga_params,"selection_func",selection_ga_elitist);
//ga_params = add_param(ga_params,"selection_func",selection_ga_random);
ga_params = add_param(ga_params,"nb_couples",NbCouples);
ga_params = add_param(ga_params,"pressure",pressure);
// Customized output function with a stop criterion added
ga_params = add_param(ga_params, "threshold", 1E-6); // User defined parameter for the output function
ga_params = add_param(ga_params, "output_func", output_ga_custom);
[pop_opt, fobj_pop_opt, pop_init, fobj_pop_init] = ..
optim_ga(f, PopSize, NbGen, Proba_mut, Proba_cross, Log, ga_params);
optim_ga: iteration 1 / 20 
    min / max value found = 6.4854E-03 / 1.1026E+00
optim_ga: iteration 2 / 20 
    min / max value found = 2.3589E-03 / 2.6003E-01
optim_ga: iteration 3 / 20 
    min / max value found = 2.2987E-04 / 2.8928E-02
optim_ga: iteration 4 / 20 
    min / max value found = 8.7067E-05 / 5.3993E-03
optim_ga: iteration 5 / 20 
    min / max value found = 5.9943E-06 / 1.3897E-03
optim_ga: iteration 6 / 20 
    min / max value found = 9.6671E-07 / 3.8156E-04
optim_ga: iteration 7 / 20 
    min / max value found = 9.6671E-07 / 8.9321E-05
optim_ga: iteration 8 / 20 
    min / max value found = 4.4313E-07 / 1.9341E-05
optim_ga: iteration 9 / 20 
    min / max value found = 2.3784E-08 / 6.0478E-06
optim_ga: iteration 10 / 20 
    min / max value found = 2.3784E-08 / 1.7507E-06
optim_ga: iteration 11 / 20 
    min / max value found = 1.6279E-08 / 3.5704E-07
    Stop criterion reached: Delta Max to Min under threshold
assert_checktrue(max(fobj_pop_opt) - min(fobj_pop_opt) <= 1E-6);
