// =============================================================================
// Scilab ( http://www.scilab.org/ ) - This file is part of Scilab
// Copyright (C) 2017 - Scilab Enterprises
//
//  This file is distributed under the same license as the Scilab package.
// =============================================================================
//
// <-- Non-regression test for bug 15034 -->
//
// <-- GitLab URL -->
// https://gitlab.com/scilab/scilab/-/issues/15034
//
// <-- Short Description -->
// Unable to create a structure using mlist.
a = mlist(["st", "dims", "champs"], int32([1 1]));
disp(a);
             (1)
!st  dims  champs  !
             (2)
  1  1
