// =============================================================================
// Scilab ( http://www.scilab.org/ ) - This file is part of Scilab
// Copyright (C) 2016 - Samuel GOUGEON
//
//  This file is distributed under the same license as the Scilab package.
// =============================================================================
// <-- TEST WITH GRAPHIC -->
// <-- Non-regression test for bug 13966 -->
//
// <-- GitLab URL -->
// https://gitlab.com/scilab/scilab/-/issues/13966
//
// <-- Short Description -->
// twinkle() and twinkle(n) were not available
close(winsid());
twinkle();
twinkle(2);
plot2d(1:10);
twinkle();
twinkle(2);
close(gcf());
