// =============================================================================
// Scilab ( http://www.scilab.org/ ) - This file is part of Scilab
// Copyright (C) 2008 - INRIA - Vincent COUVERT
//
//  This file is distributed under the same license as the Scilab package.
// =============================================================================
// <-- CLI SHELL MODE -->
// <-- Non-regression test for bug 2581 -->
//
// <-- GitLab URL -->
// https://gitlab.com/scilab/scilab/-/issues/2581
//
// <-- Short Description -->
//    mprintf is broken
colors=["red";"green";"blue";"pink";"black"];
RGB=[1 0 0;0 1 0;0 0 1;1 0.75 0.75;0 0 0];
if execstr("mprintf(""%d\t%s\t%f\t%f\t%f\n"",(1:5)'',colors,RGB);", "errcatch")<>0 then bugmes();quit;end
1	red	1.000000	0.000000	0.000000
2	green	0.000000	1.000000	0.000000
3	blue	0.000000	0.000000	1.000000
4	pink	1.000000	0.750000	0.750000
5	black	0.000000	0.000000	0.000000
