// =============================================================================
// Scilab ( http://www.scilab.org/ ) - This file is part of Scilab
// Copyright (C) 2008-2008 - INRIA - Jean-Baptiste Silvy
//
//  This file is distributed under the same license as the Scilab package.
// =============================================================================
// <-- TEST WITH GRAPHIC -->
// <-- Non-regression test for bug 3448 -->
//
// <-- GitLab URL -->
// https://gitlab.com/scilab/scilab/-/issues/3448
//
// <-- Short Description -->
// getting data property of polylines fails if the polyline is empty.
xpoly([],[]);
// should not fail
e = gce();
if (e.data <> []) then bugmes();quit;end
