// =============================================================================
// Scilab ( http://www.scilab.org/ ) - This file is part of Scilab
// Copyright (C) 2011 - Ruben Bibas
//
//  This file is distributed under the same license as the Scilab package.
// =============================================================================
// <-- CLI SHELL MODE -->
//
// <-- Non-regression test for bug 9811 -->
//
// <-- GitLab URL -->
// https://gitlab.com/scilab/scilab/-/issues/9811
//
// <-- Short Description -->
// fminsearch may produce a warning, but output.message is wrong
//
function y=banana(x)
  y = 100*(x(2)-x(1)^2)^2 + (1-x(1))^2;
endfunction
// regular ending
[x,fval,exitflag,output] = fminsearch ( banana , [-1.2 1] );
assert_checkfalse(isempty(strstr(output.message,"satisfies")));
// maximum number of iterations exceeded
opt = optimset ( "MaxIter" , 10 );
[x,fval,exitflag,output] = fminsearch ( banana , [-1.2 1] , opt );
fminsearch: Exiting: Maximum number of iterations has been exceeded
         - increase MaxIter option.
         Current function value: 4.1355598
assert_checkfalse(isempty(strstr(output.message,"iterations")));
// maximum number of funevals exceeded
opt = optimset ( "MaxFunEvals" , 10 );
[x,fval,exitflag,output] = fminsearch ( banana , [-1.2 1] , opt );
fminsearch: Exiting: Maximum number of function evaluations has been exceeded
          - increase MaxFunEvals option.
         Current function value: 4.3813601
assert_checkfalse(isempty(strstr(output.message,"function evaluations")));
// user stop (don't really know what that means)
//opt = optimset ( "MaxFunEvals" , 10 );
//[x,fval,exitflag,output] = fminsearch ( banana , [-1.2 1] , opt );
//test4 = isempty(strstr(output.message,"user stop"));
