// =============================================================================
// Scilab ( http://www.scilab.org/ ) - This file is part of Scilab
// Copyright (C) 2008 - INRIA - allan.cornet@inria.fr
//
//  This file is distributed under the same license as the Scilab package.
// =============================================================================
// <-- CLI SHELL MODE -->
// <-- Non-regression test for bug 2889 -->
//
// <-- GitLab URL -->
// https://gitlab.com/scilab/scilab/-/issues/2889
//
mprintf(' %s\n', "%exxxx");
 %exxxx
mprintf(' %s\n', "xx%exx");
 xx%exx
mprintf(' %s\n', "xxxx");
 xxxx
mprintf(' %s\n', "%nyyyy");
 %nyyyy
if sprintf(' %s\n', "%exxxx") <> " %exxxx" then bugmes();quit;end
if sprintf(' %s\n', "xx%exx") <> " xx%exx" then bugmes();quit;end
if sprintf(' %s\n', "xxxx") <> " xxxx" then bugmes();quit;end
if sprintf(' %s\n', "%nyyyy") <> " %nyyyy" then bugmes();quit;end
