// =============================================================================
// Scilab ( http://www.scilab.org/ ) - This file is part of Scilab
// Copyright (C) 2007-2008 - INRIA - Serge STEER <serge.steer@inria.fr>
//
//  This file is distributed under the same license as the Scilab package.
// =============================================================================
// <-- Non-regression test for bug 3006 -->
//
// <-- GitLab URL -->
// https://gitlab.com/scilab/scilab/-/issues/3006
//
// <-- Short Description -->
// submatrix assignment impossible when the matrix is indexed with a boolean array of falses  
//test with handle matrix
a=[gcf() gca();gca() gcf()];a_ref=a;
a(1,[%f %f])=[];
if or(a<>a_ref) then bugmes();quit;end
a([%f %f],1)=[];
if or(a<>a_ref) then bugmes();quit;end
a([%f %f],[%f %f])=[];
if or(a<>a_ref) then bugmes();quit;end
a(1,$:1)=[];
if or(a<>a_ref) then bugmes();quit;end
a($:1,1)=[];
if or(a<>a_ref) then bugmes();quit;end
a($:1,$:1)=[];
if or(a<>a_ref) then bugmes();quit;end
