// =============================================================================
// Scilab ( http://www.scilab.org/ ) - This file is part of Scilab
// Copyright (C) 2009 - DIGITEO - Allan CORNET
//
//  This file is distributed under the same license as the Scilab package.
// =============================================================================
// <-- CLI SHELL MODE -->
// <-- Non-regression test for bug 4768 -->
//
// <-- GitLab URL -->
// https://gitlab.com/scilab/scilab/-/issues/4768
//
// <-- Short Description -->
//strsplit does not work with localized characters
//======================================================================================== 
v = "世界您好";
ref_res1 = ["世";"界您好"];
ref_res3 = ["世界您";"好"];
r = strsplit(v,1)
 r  = 
  "世"  
  "界您好"
if r <> ref_res1 then bugmes();quit;end
r = strsplit(v,3)
 r  = 
  "世界您"
  "好"  
if r <> ref_res3 then bugmes();quit;end
//======================================================================================== 
v = "азеазея";
ref_res1 = ["а";"зеазея"]
 ref_res1  = 
  "а"     
  "зеазея"
ref_res3 = ["азе";"азея"];
r = strsplit(v,1)
 r  = 
  "а"     
  "зеазея"
if r <> ref_res1 then bugmes();quit;end
r = strsplit(v,3)
 r  = 
  "азе" 
  "азея"
if r <> ref_res3 then bugmes();quit;end
//======================================================================================== 
