// =============================================================================
// Scilab ( http://www.scilab.org/ ) - This file is part of Scilab
// Copyright (C) 2007-2008 - INRIA - Pierre MARECHAL <pierre .marechal@inria.fr>
//
//  This file is distributed under the same license as the Scilab package.
// =============================================================================
// <-- CLI SHELL MODE -->
// <-- Non-regression test for bug 2637 -->
//
// <-- GitLab URL -->
// https://gitlab.com/scilab/scilab/-/issues/2637
//
// <-- Short Description -->
// The isnum function had got some strange behaviour...
//
if isnum('e') then bugmes();quit;end
if isnum('d') then bugmes();quit;end
