// =============================================================================
// Scilab ( http://www.scilab.org/ ) - This file is part of Scilab
// Copyright (C) 2012 - DIGITEO - Allan CORNET
//
//  This file is distributed under the same license as the Scilab package.
// =============================================================================
// <-- CLI SHELL MODE -->
// <-- Non-regression test for bug 7490 -->
//
// <-- GitLab URL -->
// https://gitlab.com/scilab/scilab/-/issues/7490
//
// <-- Short Description -->
// %inf had not always same display
A = %inf;
A
 A  = 
   Inf
format('e', 8);
A
 A  = 
   Inf
format('e', 16);
A
 A  = 
   Inf
