// =============================================================================
// Scilab ( http://www.scilab.org/ ) - This file is part of Scilab
// Copyright (C) ????-2008 - INRIA - Vincent COUVERT <vincent.couvert@inria.fr>
//
//  This file is distributed under the same license as the Scilab package.
// =============================================================================
// <-- CLI SHELL MODE -->
// <-- ENGLISH IMPOSED -->
// <-- Non-regression test for bug 683 -->
//
// <-- GitLab URL -->
// https://gitlab.com/scilab/scilab/-/issues/683
//
// <-- Short Description -->
//    problem with makecell : when a makecell input is an input of
//    the main function, makecell doesn't give this input value to
//    the created cell. Strange behavior...
// Create 2 M-files
MFUN1TXT=["function [a,c] = test_cell1(b)";
"a = {1,b,''c''};";
"c = {1,2,''c''};"];
MFUN2TXT=["function a = test_cell2()";
"e = ''we'';";
"a = {1,2,e};"];
MFILE1=TMPDIR+"/test_cell1.m";
MFILE2=TMPDIR+"/test_cell2.m";
fd=mopen(MFILE1,"w");
mputl(MFUN1TXT,fd);
mclose(fd);
fd=mopen(MFILE2,"w");
mputl(MFUN2TXT,fd);
mclose(fd);
// Convert M-files to Scilab
mfile2sci(MFILE1,TMPDIR);
  ****** Beginning of mfile2sci() session ******
  File to convert: TMPDIR/test_cell1.m
  Result file path: TMPDIR/
  Recursive mode: OFF
  Only double values used in M-file: NO
  Verbose mode: 3
  Generate formatted code: NO
  M-file reading...
  M-file reading: Done
  Syntax modification...
  Syntax modification: Done
  Macro to tree conversion...
  Conversion of M-tree...
  Conversion of M-tree: Done
  Macro to tree conversion: Done
  ****** End of mfile2sci() session ******
mfile2sci(MFILE2,TMPDIR);
  ****** Beginning of mfile2sci() session ******
  File to convert: TMPDIR/test_cell2.m
  Result file path: TMPDIR/
  Recursive mode: OFF
  Only double values used in M-file: NO
  Verbose mode: 3
  Generate formatted code: NO
  M-file reading...
  M-file reading: Done
  Syntax modification...
  Syntax modification: Done
  Macro to tree conversion...
  Conversion of M-tree...
  Conversion of M-tree: Done
  Macro to tree conversion: Done
  ****** End of mfile2sci() session ******
// Load functions into Scilab
SCIFILE1=TMPDIR+"/test_cell1.sci";
SCIFILE2=TMPDIR+"/test_cell2.sci";
exec(SCIFILE1);
exec(SCIFILE2);
// Exec functions
[ce1,ce2] = test_cell1(23);
[ce3,ce4] = test_cell1([1 2]);
ce5=test_cell2();
// Verify results
assert_checkequal(size(ce1), [1 3]);
assert_checkequal(ce1, {1, 23, "c"});
assert_checkequal(size(ce2), [1 3]);
assert_checkequal(ce2, {1, 2, "c"});
assert_checkequal(size(ce3), [1 3]);
assert_checkequal(ce3, {1, [1 2], "c"});
assert_checkequal(size(ce4), [1 3]);
assert_checkequal(ce4, {1, 2, "c"});
assert_checkequal(size(ce5), [1 3]);
assert_checkequal(ce5, {1, 2, "we"});
