// =============================================================================
// Scilab ( http://www.scilab.org/ ) - This file is part of Scilab
// Copyright (C) 2013 - Scilab Enterprises - Alexandre HERISSE
//
//  This file is distributed under the same license as the Scilab package.
// =============================================================================
// <-- XCOS TEST -->
//
// <-- ENGLISH IMPOSED -->
//
// <-- Non-regression test for bug 11975 -->
//
// <-- GitLab URL -->
// https://gitlab.com/scilab/scilab/-/issues/12975
//
// <-- Short Description -->
// Some demos did not compile.
// 3 demonstration diagrams were not compiling :
// - Inverted_pendulum.zcos demonstration
// - IF_block.zcos demonstration
// - Hydraulics.zcos demonstration
ilib_verbose(0);
// Inverted_pendulum
if (~isdef("setw")) then
    exec("SCI/modules/xcos/demos/setw.sci",-1)
end
assert_checktrue(importXcosDiagram(SCI + "/modules/xcos/demos/Inverted_pendulum.zcos"));
[cpr, ok] = xcos_compile(scs_m);
assert_checktrue(ok);
// IF_block
assert_checktrue(importXcosDiagram("SCI/modules/xcos/demos/IF_block.zcos"));
[cpr, ok] = xcos_compile(scs_m);
assert_checktrue(ok);
// Hydraulics
assert_checktrue(importXcosDiagram("SCI/modules/xcos/demos/ModelicaBlocks/Hydraulics.zcos"));
[cpr, ok] = xcos_compile(scs_m);
--------------------------------------------\
 Main Modelica : TMPDIR/Hydraulics_im.mo
 Flat Modelica : TMPDIR/Hydraulics_imf.mo
 Simulation C code :TMPDIR/Hydraulics_im.c
  "messagebox: Modelica blocks are reduced to a block with:"           
  "messagebox: Number of differential states: 2"                       
  "messagebox: Number of algebraic states: 5"                          
  "messagebox: Number of discrete time states  : 0"                    
  "messagebox: Number of zero-crossing surfaces: 19"                   
  "messagebox: Number of modes  : 19"                                  
  "messagebox: Number of inputs : 1"                                   
  "messagebox: Number of outputs: 2"                                   
  "messagebox: Input/output dependency:[F]"                            
  "messagebox: Analytical Jacobian: enabled  (%Jacobian=%t)"           
  "messagebox: Parameter embedding mode: enabled (%Modelica_ParEmb=%t)"
  "messagebox: "                                                       
  "messagebox: Generated files path: TMPDIR/"     
  "messagebox: "                                                       
WARNING: Diagram contains implicit blocks, compiling for implicit Solver.
assert_checktrue(ok);
