// =============================================================================
// Scilab ( http://www.scilab.org/ ) - This file is part of Scilab
// Copyright (C) 2005-2008 - INRIA - Allan CORNET
//
//  This file is distributed under the same license as the Scilab package.
// =============================================================================
// <-- CLI SHELL MODE -->
// <-- ENGLISH IMPOSED -->
// <-- Non-regression test for bug 2812 -->
//
// <-- GitLab URL -->
// https://gitlab.com/scilab/scilab/-/issues/2812
//
// <-- Short Description -->
// I know the name of my function is too long but I should not have "ÿÿÿ" at the end.
//
// Processing file ilib_compile.sci
// There should be no warning
generatecompilationflags_unix = 1;
