//<-- CLI SHELL MODE -->
// =============================================================================
// Scilab ( http://www.scilab.org/ ) - This file is part of Scilab
// Copyright (C) 2006-2008 - INRIA -Pierre MARECHAL <pierre.marechal@inria.fr>
//
//  This file is distributed under the same license as the Scilab package.
// =============================================================================
// <-- Non-regression test for bug 2092 -->
//
// <-- GitLab URL -->
// https://gitlab.com/scilab/scilab/-/issues/2092
//
// <-- Short Description -->
//    Incorrect handling of second input argument to function mad()
A = mad([1:10;2:11],2);
B = mad([1:10;2:11],'c');
if or(A <> B) then bugmes();quit;end
