// =============================================================================
// Scilab ( http://www.scilab.org/ ) - This file is part of Scilab
// Copyright (C) 2009 - DIGITEO - Allan CORNET
//
//  This file is distributed under the same license as the Scilab package.
// =============================================================================
// <-- TEST WITH GRAPHIC -->
// <-- Non-regression test for bug 4273 -->
//
// <-- GitLab URL -->
// https://gitlab.com/scilab/scilab/-/issues/4273
//
// <-- Short Description -->
// xs2file crashs
// 
scf(10);
plot3d();
title('Title in bold-italic');
xs2svg(10,TMPDIR+'/bug_4273.svg');
if fileinfo(TMPDIR+'/bug_4273.svg') == [] then bugmes();quit;end
xs2png(10,TMPDIR+'/bug_4273.png');
if fileinfo(TMPDIR+'/bug_4273.png') == [] then bugmes();quit;end
xs2bmp(10,TMPDIR+'/bug_4273.bmp');
if fileinfo(TMPDIR+'/bug_4273.bmp') == [] then bugmes();quit;end
xs2gif(10,TMPDIR+'/bug_4273.gif');
if fileinfo(TMPDIR+'/bug_4273.gif') == [] then bugmes();quit;end
