// =============================================================================
// Scilab ( http://www.scilab.org/ ) - This file is part of Scilab
// Copyright (C) 2008 - INRIA - Sylvestre LEDRU
//
//  This file is distributed under the same license as the Scilab package.
// =============================================================================
// <-- CLI SHELL MODE -->
// <-- Non-regression test for bug 3070, 3089 and 3568 -->
//
// <-- GitLab URL -->
// https://gitlab.com/scilab/scilab/-/issues/3070
//
// <-- Short Description -->
//    When using the TAB key for completion in the console, after using once a Scilab
//    macro, its name appears twice in the completion list: as a macro and as a variable.
mprintf("°\n\n");
°
printf("µ m\n");
µ m
mprintf("Torbjørn Pettersen");
Torbjørn Pettersen
mprintf("清除控制台");
清除控制台
mprintf("모든 인간은 태어날 때부터 자유로우며 그 존엄과 권리에 있어 동등하다. 인간은 천부적으로 이성과 양심을 부여받았으며 서로 형제애의 정신으로 행동하여야 한다.");
모든 인간은 태어날 때부터 자유로우며 그 존엄과 권리에 있어 동등하다. 인간은 천부적으로 이성과 양심을 부여받았으며 서로 형제애의 정신으로 행동하여야 한다.
