// =============================================================================
// Scilab ( http://www.scilab.org/ ) - This file is part of Scilab
// Copyright (C) DIGITEO - 2009 - Allan CORNET
// Copyright (C) Scilab Enterprises - 2013 - Antoine ELIAS
//
//  This file is distributed under the same license as the Scilab package.
// =============================================================================
//
// <-- CLI SHELL MODE -->
//
// <-- WINDOWS ONLY -->
//
// <-- Non-regression test for bug 4467 -->
//
// <-- GitLab URL -->
// https://gitlab.com/scilab/scilab/-/issues/4467
//
// <-- Short Description -->
// getshortpathname , getlongpathname do not manage matrix of strings
function res = is8Dot3Disable()
//0 : NTFS creates short file names. This setting enables applications that cannot process long file names and computers that use differentcode pages to find the files.
//1 : NTFS does not create short file names. Although this setting increases file performance, applications that cannot process long file names, and computers that use different code pages, might not be able to find the files.
//2 : NTFS sets the 8.3 naming convention creation on a per volume basis.
//3 : NTFS disables 8dot3 name creation on all volumes except the system volume.
    if find(winqueryreg('name', 'HKEY_LOCAL_MACHINE', 'SYSTEM\CurrentControlSet\Control\FileSystem') == 'NtfsDisable8dot3NameCreation') then
        res = winqueryreg('HKEY_LOCAL_MACHINE', 'SYSTEM\CurrentControlSet\Control\FileSystem', 'NtfsDisable8dot3NameCreation');
    else
        res = 0;
    end
    if res <> 1 then
        res = 0;
    end
endfunction
[r1,b1] = getshortpathname([TMPDIR,getenv("PROGRAMFILES");getenv("PROGRAMFILES"),TMPDIR]);
if size(r1,'*') <> 4 then bugmes();quit;end
if ~and(b1 == %t) then bugmes();quit;end
[r2,b2] = getlongpathname(r1);
if size(r2,'*') <> 4 then bugmes();quit;end
if ~and(b2 == %t) then bugmes();quit;end
//depends of windows configuration
//http://technet.microsoft.com/en-us/library/cc778996(v=ws.10).aspx
if is8Dot3Disable() then
    if ~and(r1 == r2) then bugmes();quit;end
else
    if ~and(r1 <> r2) then bugmes();quit;end
end
if ~and(b1 == b2) then bugmes();quit;end
[r3,b3] = getshortpathname(["/My_tmp/file_1";"/My_tmp/file_2"]);
if size(r3,'*') <> 2 then bugmes();quit;end
if ~and(b3 == %f) then bugmes();quit;end
[r4,b4] =getlongpathname(["/My_tmp/file_1";"/My_tmp/file_2"]);
if size(r4,'*') <> 2 then bugmes();quit;end
if ~and(b4 == %f) then bugmes();quit;end
if ~and(r3 == r4) then bugmes();quit;end
if ~and(b3 == b4) then bugmes();quit;end
[r5,b5] =getshortpathname([SCI;"/My_tmp/file_2"]);
if size(r5,'*') <> 2 then bugmes();quit;end
if ~and(b5 == [%t;%f]) then bugmes();quit;end
[r6,b6] =getlongpathname([SCI;"/My_tmp/file_2"]);
if size(r6,'*') <> 2 then bugmes();quit;end
if ~and(b6 == [%t;%f]) then bugmes();quit;end
