// =============================================================================
// Scilab ( http://www.scilab.org/ ) - This file is part of Scilab
// Copyright (C) 2011 - DIGITEO - Vincent COUVERT
//
//  This file is distributed under the same license as the Scilab package.
// =============================================================================
//
// <-- CLI SHELL MODE -->
//
// <-- Non-regression test for bug 8828 -->
//
// <-- GitLab URL -->
// https://gitlab.com/scilab/scilab/-/issues/8828
//
// <-- Short Description -->
// "savematfile" could no more save a structure.
Astruct.str = "example";
Astruct.num = 123456789;
savematfile(TMPDIR + filesep() + "bug_8828.mat", "Astruct", "-v6");
