//<-- CLI SHELL MODE -->
// =============================================================================
// Scilab ( http://www.scilab.org/ ) - This file is part of Scilab
// Copyright (C) 2006-2008 - INRIA - Serge STEER <serge.steer@inria.fr>
//
//  This file is distributed under the same license as the Scilab package.
// =============================================================================
// <-- Non-regression test for bug 1991 -->
//
// <-- GitLab URL -->
// https://gitlab.com/scilab/scilab/-/issues/1991
//
// <-- Short Description -->
//    [a,b]=(3,int32(5))
//                      !--error 78
//    convert: wrong number of lhs arguments
[a,b]  = (3,int32(5));
if a<>3        then bugmes();quit;end
if b<>int32(5) then bugmes();quit;end
a=(3 + int32(5));
if a<>int32(8) then bugmes();quit;end
[a,b,c]=(3,(2),sin(5));
if a<>3        then bugmes();quit;end
if b<>2        then bugmes();quit;end
if c<>sin(5)   then bugmes();quit;end
