// =============================================================================
// Scilab ( http://www.scilab.org/ ) - This file is part of Scilab
// Copyright (C) 2008-2008 - INRIA - Jean-Baptiste Silvy
//
//  This file is distributed under the same license as the Scilab package.
// =============================================================================
// <-- TEST WITH GRAPHIC -->
// <-- Non-regression test for bug 2655 -->
//
// <-- GitLab URL -->
// https://gitlab.com/scilab/scilab/-/issues/2655
//
// <-- Short Description -->
// plot2d produces an error when called with some functions
function r=f(x); r=x; endfunction
function r=g(x2); r=x2 + 1; endfunction
x=linspace(0,1,100);
plot(x,f,x,g);
