//<-- CLI SHELL MODE -->
// =============================================================================
// Scilab ( http://www.scilab.org/ ) - This file is part of Scilab
// Copyright (C) 2008 - DIGITEO - Allan CORNET
//
//  This file is distributed under the same license as the Scilab package.
// =============================================================================
// <-- Non-regression test for bug 3687 -->
//
// <-- GitLab URL -->
// https://gitlab.com/scilab/scilab/-/issues/3687
//
// <-- Short Description -->
// "format" doesn't check input value 
current_format = format();
a = format();
if and(a <> [1 10]) then bugmes();quit;end
format(2);
b = format();
if and(b <> [1 2]) then bugmes();quit;end
ierr = execstr('format(300000000000000000000000000)','errcatch');
if ierr <> 999 then bugmes();quit;end
ierr = execstr('format(-1)','errcatch');
if ierr <> 999 then bugmes();quit;end
ierr = execstr('format(1)','errcatch');
if ierr <> 999 then bugmes();quit;end
format('v',12)
b = format();
if and(b <> [1 12]) then bugmes();quit;end
format(13,'v')
b = format();
if and(b <> [1 13]) then bugmes();quit;end
