Plantid_unitid := Data {
3_3
,3_4
,3_5
,8_10
,8_6
,8_7
,8_8
,8_9
,26_5
,47_1
,47_2
,47_3
,47_4
,47_5
,50_1
,50_2
,50_3
,50_4
,50_5
,50_6
,50_7
,50_8
,51_1
,56_1
,56_2
,56_3
,59_1
,60_1
,60_2
,87_1
,108_1
,113_1
,113_2
,113_3
,113_4
,127_1
,130_1
,130_2
,130_3
,130_4
,136_1
,136_2
,160_ST3
,165_2
,207_1
,207_2
,298_1
,298_2
,462_1
,462_2
,465_3
,465_4
,468_1
,468_2
,469_1
,469_2
,469_3
,470_1
,470_2
,470_3
,477_5
,492_5
,508_4
,508_6
,511_1
,525_1
,525_2
,527_1
,527_2
,527_3
,527_ST4
,564_1
,564_2
,568_3
,594_1
,594_2
,594_3
,594_4
,602_1
,602_2
,628_1
,628_2
,628_5
,628_ST4
,642_1
,642_2
,643_1
,643_2
,645_ST2
,645_ST4
,667_1
,667_2
,676_3
,703_1
,703_2
,703_3
,703_4
,708_1
,708_2
,708_3
,708_4
,709_1
,709_2
,709_3
,709_4
,710_1
,710_2
,727_3
,728_1
,728_2
,728_3
,728_4
,728_5
,733_2
,733_3
,733_ST1
,856_1
,856_2
,856_3
,861_1
,861_2
,863_3
,863_4
,864_1
,864_2
,864_3
,867_7
,867_8
,876_1
,876_2
,879_5
,879_6
,883_7
,883_8
,884_1
,884_2
,884_3
,884_4
,886_19
,887_1
,887_2
,887_3
,887_4
,887_5
,887_6
,889_1
,889_2
,889_3
,891_6
,892_1
,892_2
,897_2
,897_ST1
,898_4
,898_5
,963_1
,963_2
,963_3
,963_4
,964_6
,964_7
,976_1
,976_2
,976_3
,976_4
,981_3
,981_4
,983_1
,983_2
,983_3
,983_4
,983_5
,983_6
,988_1
,988_2
,988_3
,988_4
,991_3
,991_4
,991_5
,991_6
,994_4
,994_ST1
,994_ST2
,994_ST3
,995_7
,995_8
,996_11
,996_5
,996_6
,997_12
,1001_1
,1001_2
,1004_7
,1004_8
,1004_CT1
,1004_CT2
,1004_ST
,1008_1
,1008_2
,1008_3
,1008_4
,1010_2
,1010_3
,1010_4
,1010_5
,1010_6
,1012_2
,1012_3
,1024_4
,1024_5
,1032_4
,1032_5
,1037_2
,1037_3
,1040_1
,1040_2
,1043_1
,1043_2
,1046_ST2
,1047_2
,1047_3
,1047_4
,1058_1
,1058_2
,1058_4
,1058_6
,1058_7
,1058_8
,1073_1
,1073_2
,1073_3
,1077_2
,1081_3HS
,1082_1
,1082_2
,1082_3
,1082_4
,1091_1
,1091_2
,1091_3
,1104_1
,1167_7
,1167_8
,1167_8A
,1167_9
,1218_1
,1218_2
,1241_1
,1241_2
,1250_3
,1250_4
,1250_5
,1252_7
,1252_8
,1353_2
,1355_1
,1355_2
,1355_3
,1356_1
,1356_2
,1356_3
,1356_4
,1357_3
,1357_4
,1361_3
,1363_4
,1363_5
,1363_6
,1364_1
,1364_2
,1364_3
,1364_4
,1374_1
,1374_2
,1378_1
,1378_2
,1378_3
,1379_1
,1379_10
,1379_2
,1379_3
,1379_4
,1379_5
,1379_6
,1379_7
,1379_8
,1379_9
,1381_1
,1381_2
,1381_3
,1382_1
,1382_2
,1383_1
,1384_1
,1384_2
,1385_1
,1385_2
,1385_3
,1385_4
,1393_6
,1552_1
,1552_2
,1554_2
,1554_3
,1570_11
,1570_9
,1573_ST1
,1573_ST2
,1606_1
,1613_6
,1619_1
,1619_2
,1619_3
,1626_1
,1626_2
,1626_3
,1695_4
,1695_5
,1702_1A
,1702_1B
,1702_2A
,1702_2B
,1710_1
,1710_2
,1710_3
,1720_7
,1720_8
,1723_1
,1723_2
,1723_3
,1731_1
,1732_7
,1732_8
,1733_1
,1733_2
,1733_3
,1733_4
,1740_2
,1740_3
,1743_1
,1743_2
,1743_3
,1743_4
,1743_6
,1743_7
,1745_7
,1745_8
,1745_9
,1769_3
,1769_4
,1769_5
,1769_6
,1769_7
,1769_8
,1769_9
,1771_1
,1771_2
,1825_3
,1830_3
,1830_4
,1830_5
,1831_1
,1831_2
,1831_3
,1831_4
,1831_5
,1831_6
,1832_1
,1843_1
,1843_2
,1843_3
,1893_1
,1893_2
,1893_3
,1893_4
,1904_3
,1904_4
,1915_1
,1927_8
,1943_2
,1943_3
,1979_3
,1979_5
,1979_6
,2008_1
,2008_2
,2008_3
,2008_4
,2076_1
,2076_2
,2079_5
,2080_1
,2080_2
,2080_3
,2094_1
,2094_2
,2094_3
,2103_1
,2103_2
,2103_3
,2103_4
,2104_3
,2104_4
,2107_1
,2107_2
,2123_5
,2123_7
,2144_4
,2144_5
,2161_1
,2161_2
,2161_3
,2167_1
,2167_2
,2168_1
,2168_2
,2168_3
,2169_1
,2169_2
,2171_1
,2171_2
,2187_1
,2240_6
,2240_7
,2240_8
,2277_1
,2277_2
,2291_4
,2291_5
,2324_1
,2324_2
,2324_3
,2324_4
,2341_1
,2341_2
,2364_1
,2364_2
,2367_4
,2367_6
,2378_1
,2378_2
,2408_1
,2408_2
,2442_1
,2442_2
,2442_3
,2442_4
,2442_5
,2451_1
,2451_2
,2451_3
,2451_4
,2468_5
,2526_7
,2526_8
,2527_3
,2535_1
,2535_2
,2549_67
,2549_S68
,2554_1
,2554_2
,2554_3
,2554_ST4
,2706_1
,2706_2
,2708_5
,2708_6
,2709_1
,2709_2
,2709_3
,2712_1
,2712_2
,2712_3
,2712_4
,2713_1
,2713_2
,2713_3
,2716_1
,2716_2
,2716_3
,2718_1
,2718_2
,2718_3
,2718_4
,2718_5
,2720_3
,2720_4
,2720_5
,2720_6
,2721_1
,2721_2
,2721_3
,2721_4
,2721_5
,2721_6
,2723_1
,2723_2
,2723_3
,2727_1
,2727_2
,2727_3
,2727_4
,2732_4
,2732_5
,2732_6
,2732_7
,2790_1
,2790_2
,2817_1
,2817_2
,2823_1
,2823_2
,2824_1
,2828_1
,2828_2
,2828_3
,2830_1
,2830_2
,2830_3
,2830_4
,2830_5
,2830_6
,2832_6
,2832_7
,2832_8
,2835_5
,2836_7
,2836_9
,2837_1
,2837_2
,2837_3
,2837_4
,2837_5
,2838_18
,2840_3
,2840_4
,2840_5
,2840_6
,2843_5
,2848_1
,2848_2
,2848_3
,2848_4
,2848_5
,2848_6
,2850_1
,2850_2
,2850_3
,2850_4
,2861_1
,2861_2
,2864_3
,2864_4
,2864_5
,2866_1
,2866_2
,2866_3
,2866_4
,2866_5
,2866_6
,2866_7
,2872_1
,2872_2
,2872_3
,2872_4
,2872_5
,2876_1
,2876_2
,2876_3
,2876_4
,2876_5
,2878_2
,2878_3
,2878_4
,2914_3
,2914_4
,2935_10
,2935_7
,2935_8
,2935_9
,2936_3
,2936_5
,2936_7
,2936_ST2
,2943_1
,2943_2
,2943_3
,2943_4
,2952_6
,2963_3
,2963_4
,3098_1
,3098_2
,3098_3
,3098_4
,3113_2
,3115_1
,3115_2
,3115_3
,3118_1
,3118_2
,3122_1
,3122_2
,3122_3
,3130_FB1
,3136_1
,3136_2
,3140_1
,3140_2
,3140_3
,3149_1
,3149_11
,3149_2
,3152_1
,3152_2
,3152_3
,3152_4
,3159_1
,3161_1
,3161_2
,3178_1
,3178_2
,3179_1
,3179_2
,3179_3
,3181_3
,3251_1
,3264_1
,3264_2
,3280_1
,3280_2
,3280_3
,3297_1
,3297_2
,3298_ST1
,3317_1
,3317_2
,3319_3
,3319_4
,3325_ST1
,3393_1
,3393_2
,3393_3
,3396_1
,3399_1
,3399_2
,3403_1
,3403_2
,3403_3
,3403_4
,3405_1
,3405_2
,3405_3
,3405_4
,3406_1
,3406_10
,3406_2
,3406_3
,3406_4
,3406_5
,3406_6
,3406_7
,3406_8
,3406_9
,3407_1
,3407_2
,3407_3
,3407_4
,3407_5
,3407_6
,3407_7
,3407_8
,3407_9
,3419_ST1
,3419_ST2
,3419_ST3
,3419_ST4
,3470_5
,3470_6
,3470_7
,3470_8
,3497_1
,3497_2
,3644_1
,3644_2
,3775_3
,3776_5
,3776_6
,3788_1
,3788_2
,3788_3
,3788_4
,3788_5
,3797_3
,3797_4
,3797_5
,3797_6
,3803_3
,3803_ST1
,3803_ST2
,3803_ST4
,3809_1
,3809_2
,3845_1
,3845_2
,3935_1
,3935_2
,3935_3
,3936_1
,3936_2
,3938_1
,3938_2
,3938_3
,3938_4
,3938_5
,3942_1
,3942_2
,3942_3
,3943_1
,3943_2
,3944_1
,3944_2
,3944_3
,3945_5
,3945_6
,3946_1
,3946_2
,3947_1
,3947_2
,3947_3
,3948_1
,3948_2
,3954_1
,3954_2
,3954_3
,3992_3
,3992_4
,3992_5
,4041_5
,4041_6
,4041_7
,4041_8
,4050_3
,4050_4
,4050_5
,4054_1
,4054_2
,4072_5
,4072_6
,4072_7
,4072_8
,4078_1
,4078_3
,4078_4
,4127_3
,4127_4
,4127_5
,4140_1
,4140_2
,4140_3
,4140_4
,4140_5
,4143_ST3
,4150_5
,4151_1
,4151_2
,4151_3
,4158_1
,4158_2
,4158_3
,4158_4
,4162_1
,4162_2
,4259_1
,4271_1
,4941_NAV1
,4941_NAV2
,4941_NAV3
,6002_1
,6002_2
,6002_3
,6002_4
,6004_1
,6004_2
,6009_1
,6009_2
,6016_1
,6017_1
,6017_2
,6018_2
,6019_ST1
,6021_1
,6021_2
,6021_3
,6030_1
,6030_2
,6031_2
,6034_ST1
,6034_ST2
,6041_1
,6041_2
,6041_3
,6041_4
,6052_1
,6052_2
,6055_1
,6061_1
,6061_2
,6064_1
,6065_1
,6065_2
,6068_1
,6068_2
,6068_3
,6071_1
,6071_2
,6073_1
,6073_2
,6076_1
,6076_2
,6076_3
,6076_4
,6077_1
,6077_2
,6082_1
,6085_14
,6085_15
,6085_17
,6085_18
,6089_1
,6090_1
,6090_2
,6090_3
,6094_1
,6094_2
,6094_3
,6095_1
,6095_2
,6096_1
,6096_2
,6098_1
,6101_1
,6106_1
,6113_1
,6113_2
,6113_3
,6113_4
,6113_5
,6124_1
,6136_1
,6137_1
,6137_2
,6138_1
,6139_1
,6139_2
,6139_3
,6146_1
,6146_2
,6146_3
,6147_1
,6147_2
,6147_3
,6155_1
,6155_2
,6165_1
,6165_2
,6165_3
,6166_1
,6166_2
,6170_1
,6170_2
,6177_CO1
,6177_CO2
,6178_1
,6179_1
,6179_2
,6179_3
,6180_OG1
,6180_OG2
,6181_1
,6181_2
,6183_1
,6190_2
,6193_1
,6193_2
,6193_3
,6194_1
,6194_2
,6195_ST1
,6195_ST2
,6204_1
,6204_2
,6204_3
,6213_1
,6213_2
,6225_1
,6238_1
,6248_1
,6249_1
,6249_2
,6249_3
,6249_4
,6250_1
,6254_1
,6257_1
,6257_2
,6257_3
,6257_4
,6264_1
,6469_1
,6469_2
,6481_1
,6481_2
,6639_1
,6639_2
,6641_1
,6641_2
,6648_4
,6664_1
,6705_1
,6705_2
,6705_3
,6705_4
,6761_1
,6768_1
,6772_1
,6823_1
,7030_1
,7030_2
,7097_1
,7097_2
,7213_1
,7213_2
,7242_1CA
,7242_1CT
,7286_1
,7286_2
,7286_3
,7286_4
,7343_4
,7504_2
,7537_1
,7549_1
,7652_HP-1
,7652_HP-2
,7652_HP-3
,7652_LP-1
,7652_LP-2
,7652_LP-3
,7652_LP-4
,7790_1
,7902_1
,8023_1
,8023_2
,8042_1
,8042_2
,8066_1
,8066_2
,8066_3
,8066_4
,8069_1
,8069_2
,8102_1
,8102_2
,8219_1
,8222_1
,8223_1
,8223_2
,8223_3
,8223_4
,8224_1
,8224_2
,8226_1
,10002_GEN1
,10043_GEN1
,10071_GEN1
,10071_GEN2
,10075_GEN1
,10075_GEN2
,10075_GEN3
,10111_GEN1
,10113_GEN1
,10143_COLV
,10151_GEN1
,10343_TG1
,10377_GEN1
,10377_GEN2
,10380_GEN1
,10384_GEN1
,10384_GEN2
,10566_GEN1
,10603_GEN1
,10640_GEN1
,10641_GEN1
,10671_GEN1
,10671_GEN2
,10672_GEN1
,10675_GEN1
,10676_GEN2
,10676_GEN3
,10678_GEN1
,10743_GEN1
,10768_UP9
,10769_UP8
,10784_GEN1
,50039_GEN1
,50611_GEN1
,50636_VPLS
,50651_GEN1
,50651_GEN2
,50776_GEN1
,50835_GEN1
,50879_GEN1
,50888_GEN1
,50951_GEN1
,50974_GEN1
,50976_GEN1
,52007_GEN1
,52007_GEN2
,52071_5
,54035_GEN1
,54081_GEN1
,54081_GEN2
,54144_GEN1
,54304_1
,54634_SNCP
,54755_GEN2
,55076_RHGF
,55479_0001
,55749_UNT1
,55856_PC1
,55856_PC2
,56068_1
,56068_2
,56224_001
,56319_0001
,56456_STG1
,56564_1
,56596_5
,56609_01
,56611_S01
,56671_MKA0
,56786_1
,56808_1
,57842_1
,57842_1A
,57918_1
,57918_2
,57918_3
,58923_500K
,65284_2
,65284_3
,65284_ST1
,65285_ST1
,65285_ST2
} ;

COALEMM_EMM_CL_UNITS := Data {
1:"3_3"
,   2:"3_4"
,   3:"3_5"
,   4:"8_10"
,   5:"8_6"
,   6:"8_7"
,   7:"8_8"
,   8:"8_9"
,   9:"26_5"
,  10:"47_1"
,  11:"47_2"
,  12:"47_3"
,  13:"47_4"
,  14:"47_5"
,  15:"50_1"
,  16:"50_2"
,  17:"50_3"
,  18:"50_4"
,  19:"50_5"
,  20:"50_6"
,  21:"50_7"
,  22:"50_8"
,  23:"51_1"
,  24:"56_1"
,  25:"56_2"
,  26:"56_3"
,  27:"59_1"
,  28:"60_1"
,  29:"60_2"
,  30:"87_1"
,  31:"108_1"
,  32:"113_1"
,  33:"113_2"
,  34:"113_3"
,  35:"113_4"
,  36:"127_1"
,  37:"130_1"
,  38:"130_2"
,  39:"130_3"
,  40:"130_4"
,  41:"136_1"
,  42:"136_2"
,  43:"160_ST3"
,  44:"165_2"
,  45:"207_1"
,  46:"207_2"
,  47:"298_1"
,  48:"298_2"
,  49:"462_1"
,  50:"462_2"
,  51:"465_3"
,  52:"465_4"
,  53:"468_1"
,  54:"468_2"
,  55:"469_1"
,  56:"469_2"
,  57:"469_3"
,  58:"470_1"
,  59:"470_2"
,  60:"470_3"
,  61:"477_5"
,  62:"492_5"
,  63:"508_4"
,  64:"508_6"
,  65:"511_1"
,  66:"525_1"
,  67:"525_2"
,  68:"527_1"
,  69:"527_2"
,  70:"527_3"
,  71:"527_ST4"
,  72:"564_1"
,  73:"564_2"
,  74:"568_3"
,  75:"594_1"
,  76:"594_2"
,  77:"594_3"
,  78:"594_4"
,  79:"602_1"
,  80:"602_2"
,  81:"628_1"
,  82:"628_2"
,  83:"628_5"
,  84:"628_ST4"
,  85:"642_1"
,  86:"642_2"
,  87:"643_1"
,  88:"643_2"
,  89:"645_ST2"
,  90:"645_ST4"
,  91:"667_1"
,  92:"667_2"
,  93:"676_3"
,  94:"703_1"
,  95:"703_2"
,  96:"703_3"
,  97:"703_4"
,  98:"708_1"
,  99:"708_2"
, 100:"708_3"
, 101:"708_4"
, 102:"709_1"
, 103:"709_2"
, 104:"709_3"
, 105:"709_4"
, 106:"710_1"
, 107:"710_2"
, 108:"727_3"
, 109:"728_1"
, 110:"728_2"
, 111:"728_3"
, 112:"728_4"
, 113:"728_5"
, 114:"733_2"
, 115:"733_3"
, 116:"733_ST1"
, 117:"856_1"
, 118:"856_2"
, 119:"856_3"
, 120:"861_1"
, 121:"861_2"
, 122:"863_3"
, 123:"863_4"
, 124:"864_1"
, 125:"864_2"
, 126:"864_3"
, 127:"867_7"
, 128:"867_8"
, 129:"876_1"
, 130:"876_2"
, 131:"879_5"
, 132:"879_6"
, 133:"883_7"
, 134:"883_8"
, 135:"884_1"
, 136:"884_2"
, 137:"884_3"
, 138:"884_4"
, 139:"886_19"
, 140:"887_1"
, 141:"887_2"
, 142:"887_3"
, 143:"887_4"
, 144:"887_5"
, 145:"887_6"
, 146:"889_1"
, 147:"889_2"
, 148:"889_3"
, 149:"891_6"
, 150:"892_1"
, 151:"892_2"
, 152:"897_2"
, 153:"897_ST1"
, 154:"898_4"
, 155:"898_5"
, 156:"963_1"
, 157:"963_2"
, 158:"963_3"
, 159:"963_4"
, 160:"964_6"
, 161:"964_7"
, 162:"976_1"
, 163:"976_2"
, 164:"976_3"
, 165:"976_4"
, 166:"981_3"
, 167:"981_4"
, 168:"983_1"
, 169:"983_2"
, 170:"983_3"
, 171:"983_4"
, 172:"983_5"
, 173:"983_6"
, 174:"988_1"
, 175:"988_2"
, 176:"988_3"
, 177:"988_4"
, 178:"991_3"
, 179:"991_4"
, 180:"991_5"
, 181:"991_6"
, 182:"994_4"
, 183:"994_ST1"
, 184:"994_ST2"
, 185:"994_ST3"
, 186:"995_7"
, 187:"995_8"
, 188:"996_11"
, 189:"996_5"
, 190:"996_6"
, 191:"997_12"
, 192:"1001_1"
, 193:"1001_2"
, 194:"1004_7"
, 195:"1004_8"
, 196:"1004_CT1"
, 197:"1004_CT2"
, 198:"1004_ST"
, 199:"1008_1"
, 200:"1008_2"
, 201:"1008_3"
, 202:"1008_4"
, 203:"1010_2"
, 204:"1010_3"
, 205:"1010_4"
, 206:"1010_5"
, 207:"1010_6"
, 208:"1012_2"
, 209:"1012_3"
, 210:"1024_4"
, 211:"1024_5"
, 212:"1032_4"
, 213:"1032_5"
, 214:"1037_2"
, 215:"1037_3"
, 216:"1040_1"
, 217:"1040_2"
, 218:"1043_1"
, 219:"1043_2"
, 220:"1046_ST2"
, 221:"1047_2"
, 222:"1047_3"
, 223:"1047_4"
, 224:"1058_1"
, 225:"1058_2"
, 226:"1058_4"
, 227:"1058_6"
, 228:"1058_7"
, 229:"1058_8"
, 230:"1073_1"
, 231:"1073_2"
, 232:"1073_3"
, 233:"1077_2"
, 234:"1081_3HS"
, 235:"1082_1"
, 236:"1082_2"
, 237:"1082_3"
, 238:"1082_4"
, 239:"1091_1"
, 240:"1091_2"
, 241:"1091_3"
, 242:"1104_1"
, 243:"1167_7"
, 244:"1167_8"
, 245:"1167_8A"
, 246:"1167_9"
, 247:"1218_1"
, 248:"1218_2"
, 249:"1241_1"
, 250:"1241_2"
, 251:"1250_3"
, 252:"1250_4"
, 253:"1250_5"
, 254:"1252_7"
, 255:"1252_8"
, 256:"1353_2"
, 257:"1355_1"
, 258:"1355_2"
, 259:"1355_3"
, 260:"1356_1"
, 261:"1356_2"
, 262:"1356_3"
, 263:"1356_4"
, 264:"1357_3"
, 265:"1357_4"
, 266:"1361_3"
, 267:"1363_4"
, 268:"1363_5"
, 269:"1363_6"
, 270:"1364_1"
, 271:"1364_2"
, 272:"1364_3"
, 273:"1364_4"
, 274:"1374_1"
, 275:"1374_2"
, 276:"1378_1"
, 277:"1378_2"
, 278:"1378_3"
, 279:"1379_1"
, 280:"1379_10"
, 281:"1379_2"
, 282:"1379_3"
, 283:"1379_4"
, 284:"1379_5"
, 285:"1379_6"
, 286:"1379_7"
, 287:"1379_8"
, 288:"1379_9"
, 289:"1381_1"
, 290:"1381_2"
, 291:"1381_3"
, 292:"1382_1"
, 293:"1382_2"
, 294:"1383_1"
, 295:"1384_1"
, 296:"1384_2"
, 297:"1385_1"
, 298:"1385_2"
, 299:"1385_3"
, 300:"1385_4"
, 301:"1393_6"
, 302:"1552_1"
, 303:"1552_2"
, 304:"1554_2"
, 305:"1554_3"
, 306:"1570_11"
, 307:"1570_9"
, 308:"1573_ST1"
, 309:"1573_ST2"
, 310:"1606_1"
, 311:"1613_6"
, 312:"1619_1"
, 313:"1619_2"
, 314:"1619_3"
, 315:"1626_1"
, 316:"1626_2"
, 317:"1626_3"
, 318:"1695_4"
, 319:"1695_5"
, 320:"1702_1A"
, 321:"1702_1B"
, 322:"1702_2A"
, 323:"1702_2B"
, 324:"1710_1"
, 325:"1710_2"
, 326:"1710_3"
, 327:"1720_7"
, 328:"1720_8"
, 329:"1723_1"
, 330:"1723_2"
, 331:"1723_3"
, 332:"1731_1"
, 333:"1732_7"
, 334:"1732_8"
, 335:"1733_1"
, 336:"1733_2"
, 337:"1733_3"
, 338:"1733_4"
, 339:"1740_2"
, 340:"1740_3"
, 341:"1743_1"
, 342:"1743_2"
, 343:"1743_3"
, 344:"1743_4"
, 345:"1743_6"
, 346:"1743_7"
, 347:"1745_7"
, 348:"1745_8"
, 349:"1745_9"
, 350:"1769_3"
, 351:"1769_4"
, 352:"1769_5"
, 353:"1769_6"
, 354:"1769_7"
, 355:"1769_8"
, 356:"1769_9"
, 357:"1771_1"
, 358:"1771_2"
, 359:"1825_3"
, 360:"1830_3"
, 361:"1830_4"
, 362:"1830_5"
, 363:"1831_1"
, 364:"1831_2"
, 365:"1831_3"
, 366:"1831_4"
, 367:"1831_5"
, 368:"1831_6"
, 369:"1832_1"
, 370:"1843_1"
, 371:"1843_2"
, 372:"1843_3"
, 373:"1893_1"
, 374:"1893_2"
, 375:"1893_3"
, 376:"1893_4"
, 377:"1904_3"
, 378:"1904_4"
, 379:"1915_1"
, 380:"1927_8"
, 381:"1943_2"
, 382:"1943_3"
, 383:"1979_3"
, 384:"1979_5"
, 385:"1979_6"
, 386:"2008_1"
, 387:"2008_2"
, 388:"2008_3"
, 389:"2008_4"
, 390:"2076_1"
, 391:"2076_2"
, 392:"2079_5"
, 393:"2080_1"
, 394:"2080_2"
, 395:"2080_3"
, 396:"2094_1"
, 397:"2094_2"
, 398:"2094_3"
, 399:"2103_1"
, 400:"2103_2"
, 401:"2103_3"
, 402:"2103_4"
, 403:"2104_3"
, 404:"2104_4"
, 405:"2107_1"
, 406:"2107_2"
, 407:"2123_5"
, 408:"2123_7"
, 409:"2144_4"
, 410:"2144_5"
, 411:"2161_1"
, 412:"2161_2"
, 413:"2161_3"
, 414:"2167_1"
, 415:"2167_2"
, 416:"2168_1"
, 417:"2168_2"
, 418:"2168_3"
, 419:"2169_1"
, 420:"2169_2"
, 421:"2171_1"
, 422:"2171_2"
, 423:"2187_1"
, 424:"2240_6"
, 425:"2240_7"
, 426:"2240_8"
, 427:"2277_1"
, 428:"2277_2"
, 429:"2291_4"
, 430:"2291_5"
, 431:"2324_1"
, 432:"2324_2"
, 433:"2324_3"
, 434:"2324_4"
, 435:"2341_1"
, 436:"2341_2"
, 437:"2364_1"
, 438:"2364_2"
, 439:"2367_4"
, 440:"2367_6"
, 441:"2378_1"
, 442:"2378_2"
, 443:"2408_1"
, 444:"2408_2"
, 445:"2442_1"
, 446:"2442_2"
, 447:"2442_3"
, 448:"2442_4"
, 449:"2442_5"
, 450:"2451_1"
, 451:"2451_2"
, 452:"2451_3"
, 453:"2451_4"
, 454:"2468_5"
, 455:"2526_7"
, 456:"2526_8"
, 457:"2527_3"
, 458:"2535_1"
, 459:"2535_2"
, 460:"2549_67"
, 461:"2549_S68"
, 462:"2554_1"
, 463:"2554_2"
, 464:"2554_3"
, 465:"2554_ST4"
, 466:"2706_1"
, 467:"2706_2"
, 468:"2708_5"
, 469:"2708_6"
, 470:"2709_1"
, 471:"2709_2"
, 472:"2709_3"
, 473:"2712_1"
, 474:"2712_2"
, 475:"2712_3"
, 476:"2712_4"
, 477:"2713_1"
, 478:"2713_2"
, 479:"2713_3"
, 480:"2716_1"
, 481:"2716_2"
, 482:"2716_3"
, 483:"2718_1"
, 484:"2718_2"
, 485:"2718_3"
, 486:"2718_4"
, 487:"2718_5"
, 488:"2720_3"
, 489:"2720_4"
, 490:"2720_5"
, 491:"2720_6"
, 492:"2721_1"
, 493:"2721_2"
, 494:"2721_3"
, 495:"2721_4"
, 496:"2721_5"
, 497:"2721_6"
, 498:"2723_1"
, 499:"2723_2"
, 500:"2723_3"
, 501:"2727_1"
, 502:"2727_2"
, 503:"2727_3"
, 504:"2727_4"
, 505:"2732_4"
, 506:"2732_5"
, 507:"2732_6"
, 508:"2732_7"
, 509:"2790_1"
, 510:"2790_2"
, 511:"2817_1"
, 512:"2817_2"
, 513:"2823_1"
, 514:"2823_2"
, 515:"2824_1"
, 516:"2828_1"
, 517:"2828_2"
, 518:"2828_3"
, 519:"2830_1"
, 520:"2830_2"
, 521:"2830_3"
, 522:"2830_4"
, 523:"2830_5"
, 524:"2830_6"
, 525:"2832_6"
, 526:"2832_7"
, 527:"2832_8"
, 528:"2835_5"
, 529:"2836_7"
, 530:"2836_9"
, 531:"2837_1"
, 532:"2837_2"
, 533:"2837_3"
, 534:"2837_4"
, 535:"2837_5"
, 536:"2838_18"
, 537:"2840_3"
, 538:"2840_4"
, 539:"2840_5"
, 540:"2840_6"
, 541:"2843_5"
, 542:"2848_1"
, 543:"2848_2"
, 544:"2848_3"
, 545:"2848_4"
, 546:"2848_5"
, 547:"2848_6"
, 548:"2850_1"
, 549:"2850_2"
, 550:"2850_3"
, 551:"2850_4"
, 552:"2861_1"
, 553:"2861_2"
, 554:"2864_3"
, 555:"2864_4"
, 556:"2864_5"
, 557:"2866_1"
, 558:"2866_2"
, 559:"2866_3"
, 560:"2866_4"
, 561:"2866_5"
, 562:"2866_6"
, 563:"2866_7"
, 564:"2872_1"
, 565:"2872_2"
, 566:"2872_3"
, 567:"2872_4"
, 568:"2872_5"
, 569:"2876_1"
, 570:"2876_2"
, 571:"2876_3"
, 572:"2876_4"
, 573:"2876_5"
, 574:"2878_2"
, 575:"2878_3"
, 576:"2878_4"
, 577:"2914_3"
, 578:"2914_4"
, 579:"2935_10"
, 580:"2935_7"
, 581:"2935_8"
, 582:"2935_9"
, 583:"2936_3"
, 584:"2936_5"
, 585:"2936_7"
, 586:"2936_ST2"
, 587:"2943_1"
, 588:"2943_2"
, 589:"2943_3"
, 590:"2943_4"
, 591:"2952_6"
, 592:"2963_3"
, 593:"2963_4"
, 594:"3098_1"
, 595:"3098_2"
, 596:"3098_3"
, 597:"3098_4"
, 598:"3113_2"
, 599:"3115_1"
, 600:"3115_2"
, 601:"3115_3"
, 602:"3118_1"
, 603:"3118_2"
, 604:"3122_1"
, 605:"3122_2"
, 606:"3122_3"
, 607:"3130_FB1"
, 608:"3136_1"
, 609:"3136_2"
, 610:"3140_1"
, 611:"3140_2"
, 612:"3140_3"
, 613:"3149_1"
, 614:"3149_11"
, 615:"3149_2"
, 616:"3152_1"
, 617:"3152_2"
, 618:"3152_3"
, 619:"3152_4"
, 620:"3159_1"
, 621:"3161_1"
, 622:"3161_2"
, 623:"3178_1"
, 624:"3178_2"
, 625:"3179_1"
, 626:"3179_2"
, 627:"3179_3"
, 628:"3181_3"
, 629:"3251_1"
, 630:"3264_1"
, 631:"3264_2"
, 632:"3280_1"
, 633:"3280_2"
, 634:"3280_3"
, 635:"3297_1"
, 636:"3297_2"
, 637:"3298_ST1"
, 638:"3317_1"
, 639:"3317_2"
, 640:"3319_3"
, 641:"3319_4"
, 642:"3325_ST1"
, 643:"3393_1"
, 644:"3393_2"
, 645:"3393_3"
, 646:"3396_1"
, 647:"3399_1"
, 648:"3399_2"
, 649:"3403_1"
, 650:"3403_2"
, 651:"3403_3"
, 652:"3403_4"
, 653:"3405_1"
, 654:"3405_2"
, 655:"3405_3"
, 656:"3405_4"
, 657:"3406_1"
, 658:"3406_10"
, 659:"3406_2"
, 660:"3406_3"
, 661:"3406_4"
, 662:"3406_5"
, 663:"3406_6"
, 664:"3406_7"
, 665:"3406_8"
, 666:"3406_9"
, 667:"3407_1"
, 668:"3407_2"
, 669:"3407_3"
, 670:"3407_4"
, 671:"3407_5"
, 672:"3407_6"
, 673:"3407_7"
, 674:"3407_8"
, 675:"3407_9"
, 676:"3419_ST1"
, 677:"3419_ST2"
, 678:"3419_ST3"
, 679:"3419_ST4"
, 680:"3470_5"
, 681:"3470_6"
, 682:"3470_7"
, 683:"3470_8"
, 684:"3497_1"
, 685:"3497_2"
, 686:"3644_1"
, 687:"3644_2"
, 688:"3775_3"
, 689:"3776_5"
, 690:"3776_6"
, 691:"3788_1"
, 692:"3788_2"
, 693:"3788_3"
, 694:"3788_4"
, 695:"3788_5"
, 696:"3797_3"
, 697:"3797_4"
, 698:"3797_5"
, 699:"3797_6"
, 700:"3803_3"
, 701:"3803_ST1"
, 702:"3803_ST2"
, 703:"3803_ST4"
, 704:"3809_1"
, 705:"3809_2"
, 706:"3845_1"
, 707:"3845_2"
, 708:"3935_1"
, 709:"3935_2"
, 710:"3935_3"
, 711:"3936_1"
, 712:"3936_2"
, 713:"3938_1"
, 714:"3938_2"
, 715:"3938_3"
, 716:"3938_4"
, 717:"3938_5"
, 718:"3942_1"
, 719:"3942_2"
, 720:"3942_3"
, 721:"3943_1"
, 722:"3943_2"
, 723:"3944_1"
, 724:"3944_2"
, 725:"3944_3"
, 726:"3945_5"
, 727:"3945_6"
, 728:"3946_1"
, 729:"3946_2"
, 730:"3947_1"
, 731:"3947_2"
, 732:"3947_3"
, 733:"3948_1"
, 734:"3948_2"
, 735:"3954_1"
, 736:"3954_2"
, 737:"3954_3"
, 738:"3992_3"
, 739:"3992_4"
, 740:"3992_5"
, 741:"4041_5"
, 742:"4041_6"
, 743:"4041_7"
, 744:"4041_8"
, 745:"4050_3"
, 746:"4050_4"
, 747:"4050_5"
, 748:"4054_1"
, 749:"4054_2"
, 750:"4072_5"
, 751:"4072_6"
, 752:"4072_7"
, 753:"4072_8"
, 754:"4078_1"
, 755:"4078_3"
, 756:"4078_4"
, 757:"4127_3"
, 758:"4127_4"
, 759:"4127_5"
, 760:"4140_1"
, 761:"4140_2"
, 762:"4140_3"
, 763:"4140_4"
, 764:"4140_5"
, 765:"4143_ST3"
, 766:"4150_5"
, 767:"4151_1"
, 768:"4151_2"
, 769:"4151_3"
, 770:"4158_1"
, 771:"4158_2"
, 772:"4158_3"
, 773:"4158_4"
, 774:"4162_1"
, 775:"4162_2"
, 776:"4259_1"
, 777:"4271_1"
, 778:"4941_NAV1"
, 779:"4941_NAV2"
, 780:"4941_NAV3"
, 781:"6002_1"
, 782:"6002_2"
, 783:"6002_3"
, 784:"6002_4"
, 785:"6004_1"
, 786:"6004_2"
, 787:"6009_1"
, 788:"6009_2"
, 789:"6016_1"
, 790:"6017_1"
, 791:"6017_2"
, 792:"6018_2"
, 793:"6019_ST1"
, 794:"6021_1"
, 795:"6021_2"
, 796:"6021_3"
, 797:"6030_1"
, 798:"6030_2"
, 799:"6031_2"
, 800:"6034_ST1"
, 801:"6034_ST2"
, 802:"6041_1"
, 803:"6041_2"
, 804:"6041_3"
, 805:"6041_4"
, 806:"6052_1"
, 807:"6052_2"
, 808:"6055_1"
, 809:"6061_1"
, 810:"6061_2"
, 811:"6064_1"
, 812:"6065_1"
, 813:"6065_2"
, 814:"6068_1"
, 815:"6068_2"
, 816:"6068_3"
, 817:"6071_1"
, 818:"6071_2"
, 819:"6073_1"
, 820:"6073_2"
, 821:"6076_1"
, 822:"6076_2"
, 823:"6076_3"
, 824:"6076_4"
, 825:"6077_1"
, 826:"6077_2"
, 827:"6082_1"
, 828:"6085_14"
, 829:"6085_15"
, 830:"6085_17"
, 831:"6085_18"
, 832:"6089_1"
, 833:"6090_1"
, 834:"6090_2"
, 835:"6090_3"
, 836:"6094_1"
, 837:"6094_2"
, 838:"6094_3"
, 839:"6095_1"
, 840:"6095_2"
, 841:"6096_1"
, 842:"6096_2"
, 843:"6098_1"
, 844:"6101_1"
, 845:"6106_1"
, 846:"6113_1"
, 847:"6113_2"
, 848:"6113_3"
, 849:"6113_4"
, 850:"6113_5"
, 851:"6124_1"
, 852:"6136_1"
, 853:"6137_1"
, 854:"6137_2"
, 855:"6138_1"
, 856:"6139_1"
, 857:"6139_2"
, 858:"6139_3"
, 859:"6146_1"
, 860:"6146_2"
, 861:"6146_3"
, 862:"6147_1"
, 863:"6147_2"
, 864:"6147_3"
, 865:"6155_1"
, 866:"6155_2"
, 867:"6165_1"
, 868:"6165_2"
, 869:"6165_3"
, 870:"6166_1"
, 871:"6166_2"
, 872:"6170_1"
, 873:"6170_2"
, 874:"6177_CO1"
, 875:"6177_CO2"
, 876:"6178_1"
, 877:"6179_1"
, 878:"6179_2"
, 879:"6179_3"
, 880:"6180_OG1"
, 881:"6180_OG2"
, 882:"6181_1"
, 883:"6181_2"
, 884:"6183_1"
, 885:"6190_2"
, 886:"6193_1"
, 887:"6193_2"
, 888:"6193_3"
, 889:"6194_1"
, 890:"6194_2"
, 891:"6195_ST1"
, 892:"6195_ST2"
, 893:"6204_1"
, 894:"6204_2"
, 895:"6204_3"
, 896:"6213_1"
, 897:"6213_2"
, 898:"6225_1"
, 899:"6238_1"
, 900:"6248_1"
, 901:"6249_1"
, 902:"6249_2"
, 903:"6249_3"
, 904:"6249_4"
, 905:"6250_1"
, 906:"6254_1"
, 907:"6257_1"
, 908:"6257_2"
, 909:"6257_3"
, 910:"6257_4"
, 911:"6264_1"
, 912:"6469_1"
, 913:"6469_2"
, 914:"6481_1"
, 915:"6481_2"
, 916:"6639_1"
, 917:"6639_2"
, 918:"6641_1"
, 919:"6641_2"
, 920:"6648_4"
, 921:"6664_1"
, 922:"6705_1"
, 923:"6705_2"
, 924:"6705_3"
, 925:"6705_4"
, 926:"6761_1"
, 927:"6768_1"
, 928:"6772_1"
, 929:"6823_1"
, 930:"7030_1"
, 931:"7030_2"
, 932:"7097_1"
, 933:"7097_2"
, 934:"7213_1"
, 935:"7213_2"
, 936:"7242_1CA"
, 937:"7242_1CT"
, 938:"7286_1"
, 939:"7286_2"
, 940:"7286_3"
, 941:"7286_4"
, 942:"7343_4"
, 943:"7504_2"
, 944:"7537_1"
, 945:"7549_1"
, 946:"7652_HP-1"
, 947:"7652_HP-2"
, 948:"7652_HP-3"
, 949:"7652_LP-1"
, 950:"7652_LP-2"
, 951:"7652_LP-3"
, 952:"7652_LP-4"
, 953:"7790_1"
, 954:"7902_1"
, 955:"8023_1"
, 956:"8023_2"
, 957:"8042_1"
, 958:"8042_2"
, 959:"8066_1"
, 960:"8066_2"
, 961:"8066_3"
, 962:"8066_4"
, 963:"8069_1"
, 964:"8069_2"
, 965:"8102_1"
, 966:"8102_2"
, 967:"8219_1"
, 968:"8222_1"
, 969:"8223_1"
, 970:"8223_2"
, 971:"8223_3"
, 972:"8223_4"
, 973:"8224_1"
, 974:"8224_2"
, 975:"8226_1"
, 976:"10002_GEN1"
, 977:"10043_GEN1"
, 978:"10071_GEN1"
, 979:"10071_GEN2"
, 980:"10075_GEN1"
, 981:"10075_GEN2"
, 982:"10075_GEN3"
, 983:"10111_GEN1"
, 984:"10113_GEN1"
, 985:"10143_COLV"
, 986:"10151_GEN1"
, 987:"10343_TG1"
, 988:"10377_GEN1"
, 989:"10377_GEN2"
, 990:"10380_GEN1"
, 991:"10384_GEN1"
, 992:"10384_GEN2"
, 993:"10566_GEN1"
, 994:"10603_GEN1"
, 995:"10640_GEN1"
, 996:"10641_GEN1"
, 997:"10671_GEN1"
, 998:"10671_GEN2"
, 999:"10672_GEN1"
,1000:"10675_GEN1"
,1001:"10676_GEN2"
,1002:"10676_GEN3"
,1003:"10678_GEN1"
,1004:"10743_GEN1"
,1005:"10768_UP9"
,1006:"10769_UP8"
,1007:"10784_GEN1"
,1008:"50039_GEN1"
,1009:"50611_GEN1"
,1010:"50636_VPLS"
,1011:"50651_GEN1"
,1012:"50651_GEN2"
,1013:"50776_GEN1"
,1014:"50835_GEN1"
,1015:"50879_GEN1"
,1016:"50888_GEN1"
,1017:"50951_GEN1"
,1018:"50974_GEN1"
,1019:"50976_GEN1"
,1020:"52007_GEN1"
,1021:"52007_GEN2"
,1022:"52071_5"
,1023:"54035_GEN1"
,1024:"54081_GEN1"
,1025:"54081_GEN2"
,1026:"54144_GEN1"
,1027:"54304_1"
,1028:"54634_SNCP"
,1029:"54755_GEN2"
,1030:"55076_RHGF"
,1031:"55479_0001"
,1032:"55749_UNT1"
,1033:"55856_PC1"
,1034:"55856_PC2"
,1035:"56068_1"
,1036:"56068_2"
,1037:"56224_001"
,1038:"56319_0001"
,1039:"56456_STG1"
,1040:"56564_1"
,1041:"56596_5"
,1042:"56609_01"
,1043:"56611_S01"
,1044:"56671_MKA0"
,1045:"56786_1"
,1046:"56808_1"
,1047:"57842_1"
,1048:"57842_1A"
,1049:"57918_1"
,1050:"57918_2"
,1051:"57918_3"
,1052:"58923_500K"
,1053:"65284_2"
,1054:"65284_3"
,1055:"65284_ST1"
,1056:"65285_ST1"
,1057:"65285_ST2"
} ;

