COMPOSITE TABLE:
yr                       ImportsMinimumElectricity     ImportsMaximumElectricity     ImportsMinimumIndustrial      ImportsMaximumIndustrial      ImportsMinimumCoking          ImportsMaximumCoking
1990                     1.85                                                        0.00                                                        0.85
1991                     3.12                                                        0.00                                                        0.28
1992                     3.47                                                        0.00                                                        0.33
1993                     7.84                                                        0.00                                                        0.36
1994                     8.16                                                        0.00                                                        0.74
1995                     8.65                                                        0.00                                                        0.85
1996                     7.46                                                        0.00                                                        0.64
1997                     6.52                                                        0.00                                                        0.78
1998                     7.91                                                        0.00                                                        0.49
1999                     8.13                                                        0.00                                                        0.57
2000                     10.81                                                       0.00                                                        1.71
2001                     17.53                                                       0.00                                                        2.34
2002                     14.91                                                       0.00                                                        2.37
2003                     23.05                                                       0.00                                                        1.71
2004                     24.87                                                       0.00                                                        2.19
2005                     28.18                                                       0.00                                                        1.80
2006                     34.35                                                       0.00                                                        1.69
2007                     34.56                                                       0.00                                                        1.67
2008                     32.33                                                       0.00                                                        1.74
2009                     21.45                                                       0.00                                                        1.04
2010                     17.49                                                       0.00                                                        1.53
2011                     11.38                                                       0.00                                                        1.59
2012                     7.89                                                        0.00                                                        1.12
2013                     7.80                                                        0.00                                                        0.97
2014                     9.21                          10.60                         0.29                          1.00                          1.70                          1.71
2015                     9.12                          10.60                         0.29                          1.00                          1.72                          2.06
2016                     8.44                          9.78                          0.27                          1.00                          0.96                          1.15
2017                     6.31                          7.76                          0.21                          1.00                          0.70                          0.86
2018                     4.23                          8.00                          0.17                          1.00                          0.68                          0.80
2019                     3.45                          8.00                          0.12                          1.00                          0.65                          0.80
2020                     2.08                          9.00                          0.04                          1.00                          0.30                          1.00
2021                     1.91                          9.00                          0.03                          1.00                          0.76                          1.21
2022                     0.00                          9.00                          0.00                          1.00                          0.60                          1.21
2023                     0.00                                                        0.00                                                        0.60                          1.20
2024                     0.00                                                        0.00                                                        0.60                          1.19
2025                     0.00                                                        0.00                                                        0.60                          1.19
2026                     0.00                                                        0.00                                                        0.60                          1.18
2027                     0.00                                                        0.00                                                        0.60                          1.18
2028                     0.00                                                        0.00                                                        0.60                          1.17
2029                     0.00                                                        0.00                                                        0.60                          1.16
2030                     0.00                                                        0.00                                                        0.60                          1.16
2031                     0.00                                                        0.00                                                        0.60                          1.15
2032                     0.00                                                        0.00                                                        0.60                          1.15
2033                     0.00                                                        0.00                                                        0.60                          1.14
2034                     0.00                                                        0.00                                                        0.60                          1.14
2035                     0.00                                                        0.00                                                        0.60                          1.13
2036                     0.00                                                        0.00                                                        0.60                          1.12
2037                     0.00                                                        0.00                                                        0.60                          1.12
2038                     0.00                                                        0.00                                                        0.60                          1.11
2039                     0.00                                                        0.00                                                        0.60                          1.11
2040                     0.00                                                        0.00                                                        0.60                          1.10
2041                     0.00                                                        0.00                                                        0.60                          1.10
2042                     0.00                                                        0.00                                                        0.60                          1.09
2043                     0.00                                                        0.00                                                        0.60                          1.09
2044                     0.00                                                        0.00                                                        0.60                          1.08
2045                     0.00                                                        0.00                                                        0.60                          1.08
2046                     0.00                                                        0.00                                                        0.60                          1.07
2047                     0.00                                                        0.00                                                        0.60                          1.06
2048                     0.00                                                        0.00                                                        0.60                          1.06
2049                     0.00                                                        0.00                                                        0.60                          1.05
2050                     0.00                                                        0.00                                                        0.60                          1.05
;
