01AGCROP        1 .HEADER         1       2      3000.7       78.07     0.4                                                                                                                                                      
01AGCROP        1 BSCBYP          1      42        1.35           0                                                                                                                                    
01AGCROP        1 STEPBYP  N/A            1          42       0.133       0   0.133       0                                                                                                         
01AGCROP        2 .HEADER         1       2     24276.5      631.61     3.3                                                                                                                                                      
01AGCROP        2 BSCBYP          1      42        1.35           0                                                                                                                                    
01AGCROP        2 STEPBYP  N/A            1          42       0.133       0   0.133       0                                                                                                         
01AGCROP        3 .HEADER         1       2     20144.6      524.11     2.7                                                                                                                                                      
01AGCROP        3 BSCBYP          1      42        1.35           0                                                                                                                                    
01AGCROP        3 STEPBYP  N/A            1          42       0.133       0   0.133       0                                                                                                         
01AGCROP        4 .HEADER         1       2     19802.8      515.21     2.7                                                                                                                                                      
01AGCROP        4 BSCBYP          1      42        1.35           0                                                                                                                                    
01AGCROP        4 STEPBYP  N/A            1          42       0.133       0   0.133       0                                                                                                         
02AGOTHR        1 .HEADER         2       2      7386.1      181.32     0.3                                                                                                                                                      
02AGOTHR        1 BSCBYP          1      42        1.35           0                                                                                                                                    
02AGOTHR        1 STEPBYP  N/A            1          42       0.041       0   0.041       0                                                                                                         
02AGOTHR        2 .HEADER         2       2     48140.3     1181.82     1.9                                                                                                                                                      
02AGOTHR        2 BSCBYP          1      42        1.35           0                                                                                                                                    
02AGOTHR        2 STEPBYP  N/A            1          42       0.041       0   0.041       0                                                                                                         
02AGOTHR        3 .HEADER         2       2     36233.7      889.52     1.4                                                                                                                                                      
02AGOTHR        3 BSCBYP          1      42        1.35           0                                                                                                                                    
02AGOTHR        3 STEPBYP  N/A            1          42       0.041       0   0.041       0                                                                                                         
02AGOTHR        4 .HEADER         2       2     19810.3      486.33     0.8                                                                                                                                                      
02AGOTHR        4 BSCBYP          1      42        1.35           0                                                                                                                                    
02AGOTHR        4 STEPBYP  N/A            1          42       0.041       0   0.041       0                                                                                                         
03COALMN        1 .HEADER         3       2      3423.9       73.62       0                                                                                                                                                      
03COALMN        2 .HEADER         3       2      5115.4      109.98       0                                                                                                                                                      
03COALMN        3 .HEADER         3       2     16766.8      360.49       0                                                                                                                                                      
03COALMN        4 .HEADER         3       2      3944.6       84.81       0                                                                                                                                                      
04OILGAS        1 .HEADER         4       2       531.6       19.08     0.4                                                                                                                                                      
04OILGAS        2 .HEADER         4       2        5020      180.22     3.9                                                                                                                                                      
04OILGAS        3 .HEADER         4       2     54536.7     1957.93      42                                                                                                                                                      
04OILGAS        4 .HEADER         4       2     20037.5      719.37    15.4                                                                                                                                                      
05METLMN        1 .HEADER         5       2      1635.8       43.76     0.4                                                                                                                                                      
05METLMN        2 .HEADER         5       2      4260.2      113.96     1.1                                                                                                                                                      
05METLMN        3 .HEADER         5       2      6032.1      161.36     1.5                                                                                                                                                      
05METLMN        4 .HEADER         5       2      9541.1      255.22     2.4                                                                                                                                                      
06CONSTR        1 .HEADER         6       2    127799.9     3334.49       0                                                                                                                                                      
06CONSTR        2 .HEADER         6       2    117647.1     3069.59       0                                                                                                                                                      
06CONSTR        3 .HEADER         6       2    188956.3     4930.15       0                                                                                                                                                      
06CONSTR        4 .HEADER         6       2    134640.7     3512.97       0                                                                                                                                                      
07FOOD          1 .HEADER         7       2        48.6           0   24.82                                                                                                                                                      
07FOOD          1 BSCBYP          1      42        1.35           0                                                                                                                                    
07FOOD          1 BSCBYP          2      42        1.35           0                                                                                                                                    
07FOOD          1 BSCBYP          3      42        1.35           0                                                                                                                                    
07FOOD          1 BSCBYP          4      42        1.35           0                                                                                                                                    
07FOOD          1 STEPBYP  M/HEAT         1          42       0.010       0   0.010       0                                                                                                         
07FOOD          1 STEPBYP  D/HEAT         1          42         0.0       0     0.0       0                                                                                                         
07FOOD          1 STEPBYP  S/HEAT         1          42         0.0       0 	0.0       0                                                                                                         
07FOOD          1 STEPBYP  A/HEAT         1          42       0.059       0   0.059       0                                                                                                         
07FOOD          2 .HEADER         7       2         144           0  112.50                                                                                                                                                      
07FOOD          2 BSCBYP          1      42        1.35           0                                                                                                                                    
07FOOD          2 BSCBYP          2      42        1.35           0                                                                                                                                    
07FOOD          2 BSCBYP          3      42        1.35           0                                                                                                                                    
07FOOD          2 BSCBYP          4      42        1.35           0                                                                                                                                    
07FOOD          2 STEPBYP  M/HEAT         1          42       0.017       0   0.017       0                                                                                                         
07FOOD          2 STEPBYP  D/HEAT         1          42         0.0       0     0.0       0                                                                                                         
07FOOD          2 STEPBYP  S/HEAT         1          42         0.0       0     0.0       0                                                                                                         
07FOOD          2 STEPBYP  A/HEAT         1          42       0.059       0   0.059       0                                                                                                         
07FOOD          3 .HEADER         7       2       114.8           0  225.15                                                                                                                                                      
07FOOD          3 BSCBYP          1      42        1.35           0                                                                                                                                    
07FOOD          3 BSCBYP          2      42        1.35           0                                                                                                                                    
07FOOD          3 BSCBYP          3      42        1.35           0                                                                                                                                    
07FOOD          3 BSCBYP          4      42        1.35           0                                                                                                                                    
07FOOD          3 STEPBYP  M/HEAT         1          42       0.313       0   0.313       0                                                                                                         
07FOOD          3 STEPBYP  D/HEAT         1          42         0.0       0     0.0       0                                                                                                         
07FOOD          3 STEPBYP  S/HEAT         1          42         0.0       0     0.0       0                                                                                                         
07FOOD          3 STEPBYP  A/HEAT         1          42       0.417       0   0.417       0                                                                                                         
07FOOD          4 .HEADER         7       2        71.6           0   55.93                                                                                                                                                      
07FOOD          4 BSCBYP          1      42        1.35           0                                                                                                                                    
07FOOD          4 BSCBYP          2      42        1.35           0                                                                                                                                    
07FOOD          4 BSCBYP          3      42        1.35           0                                                                                                                                    
07FOOD          4 BSCBYP          4      42        1.35           0                                                                                                                                    
07FOOD          4 STEPBYP  M/HEAT         1          42       0.073       0   0.073       0                                                                                                         
07FOOD          4 STEPBYP  D/HEAT         1          42         0.0       0     0.0       0                                                                                                         
07FOOD          4 STEPBYP  S/HEAT         1          42         0.0       0     0.0       0                                                                                                         
07FOOD          4 STEPBYP  A/HEAT         1          42       0.040       0   0.040       0                                                                                                         
08PAPER         1 .HEADER         8       1    14043409           0   79.26                                                                                                                                                      
08PAPER         1 BSCBYP          1      42        1.35           0                                                                                                                                    
08PAPER         1 BSCBYP          2      43        1.35           0                                                                                                                                    
08PAPER         1 STEPBYP  KRAFT_P        1          43    18.11307       0 18.11307      0                                                                                                         
08PAPER         1 STEPBYP  WOOD           1          42     4.64918       0  4.64918      0                                                                                                         
08PAPER         2 .HEADER         8       1    19673121           0  359.22                                                                                                                                                     
08PAPER         2 BSCBYP          1      42        1.35           0                                                                                                                                    
08PAPER         2 BSCBYP          2      43        1.35           0                                                                                                                                    
08PAPER         2 STEPBYP  KRAFT_P        1          43    17.66767       0 17.66767      0                                                                                                         
08PAPER         2 STEPBYP  WOOD           1          42     5.24907       0  5.24907      0                                                                                                         
08PAPER         3 .HEADER         8       1    29959127           0  718.92                                                                                                                                                      
08PAPER         3 BSCBYP          1      42        1.35           0                                                                                                                                    
08PAPER         3 BSCBYP          2      43        1.35           0                                                                                                                                    
08PAPER         3 STEPBYP  KRAFT_P        1          43    18.73503       0 18.73503      0                                                                                                         
08PAPER         3 STEPBYP  WOOD           1          42     4.00065       0  4.00065      0                                                                                                         
08PAPER         4 .HEADER         8       1    10331962           0  178.59                                                                                                                                                      
08PAPER         4 BSCBYP          1      42        1.35           0                                                                                                                                    
08PAPER         4 BSCBYP          2      43        1.35           0                                                                                                                                    
08PAPER         4 STEPBYP  KRAFT_P        1          43    12.79107       0 12.79107      0                                                                                                         
08PAPER         4 STEPBYP  WOOD           1          42     1.93812       0  1.93812      0                                                                                                         
09B_CHEM        1 .HEADER         9       2          14           0   94.64                                                                                                                                                     
09B_CHEM        1 BSCBYP          1      35        1.35           0                                                                                                                                    
09B_CHEM        2 .HEADER         9       2        22.8           0  428.91                                                                                                                                                      
09B_CHEM        2 BSCBYP          1      35        1.35           0                                                                                                                                    
09B_CHEM        3 .HEADER         9       2       101.8           0  858.40                                                                                                                                                      
09B_CHEM        3 BSCBYP          1      35        1.35           0                                                                                                                                    
09B_CHEM        4 .HEADER         9       2           7           0  213.24                                                                                                                                                    
09B_CHEM        4 BSCBYP          1      35        1.35           0                                                                                                                                    
10GLASS         1 .HEADER        10       1    19663458           0    0.14                                                                                                                                                      
10GLASS         2 .HEADER        10       1    32324243           0    0.65                                                                                                                                                     
10GLASS         3 .HEADER        10       1    33701652           0    1.29                                                                                                                                                      
10GLASS         4 .HEADER        10       1    23045846           0    0.32                                                                                                                                                      
11CEMENT        1 .HEADER        11       1    7967542            0    0.07                                                                                                                                                      
11CEMENT        2 .HEADER        11       1    19162766           0    0.09                                                                                                                                                      
11CEMENT        3 .HEADER        11       1    40184123           0    0.58                                                                                                                                                     
11CEMENT        4 .HEADER        11       1    19053570           0    0.07                                                                                                                                                      
12STEEL         1 .HEADER        12       1    14240826           0   27.67                                                                                                                                                      
12STEEL         1 BSCBYP          1      32        1.35           0                                                                                                                                    
12STEEL         1 BSCBYP          2      33        1.35           0                                                                                                                                    
12STEEL         1 STEPBYP  BF/BOF         1          33         2.1       0     2.1       0                                                                                                         
12STEEL         1 STEPBYP  COKE           1          32        1.35       0    1.35       0                                                                                                         
12STEEL         2 .HEADER        12       1    34680750           0  125.40                                                                                                                                                      
12STEEL         2 BSCBYP          1      32        1.35           0                                                                                                                                    
12STEEL         2 BSCBYP          2      33        1.35           0                                                                                                                                    
12STEEL         2 STEPBYP  BF/BOF         1          33         2.1       0     2.1       0                                                                                                         
12STEEL         2 STEPBYP  COKE           1          32         1.35      0    1.35       0                                                                                                         
12STEEL         3 .HEADER        12       1    33087414           0  250.98                                                                                                                                                   
12STEEL         3 BSCBYP          1      32        1.35           0                                                                                                                                    
12STEEL         3 BSCBYP          2      33        1.35           0                                                                                                                                    
12STEEL         3 STEPBYP  BF/BOF         1          33         2.1       0     2.1       0                                                                                                         
12STEEL         3 STEPBYP  COKE           1          32         1.35      0    1.35       0                                                                                                         
12STEEL         4 .HEADER        12       1     6835804           0   62.35                                                                                                                                                      
12STEEL         4 BSCBYP          1      32        1.35           0                                                                                                                                    
12STEEL         4 BSCBYP          2      33        1.35           0                                                                                                                                    
12STEEL         4 STEPBYP  BF/BOF         1          33         2.1       0     2.1       0                                                                                                         
12STEEL         4 STEPBYP  COKE           1          32        1.35       0    1.35       0                                                                                                         
13ALUMNM        1 .HEADER        13       1      607444           0    0.66                                                                                                                                                      
13ALUMNM        2 .HEADER        13       1     1320067           0    3.01                                                                                                                                                      
13ALUMNM        3 .HEADER        13       1     1837445           0    6.03                                                                                                                                                      
13ALUMNM        4 .HEADER        13       1      836044           0    1.50                                                                                                                                                      
14FABMET        1 .HEADER        14       2       183.1    407.9615    0.71                                                                                                                                                      
14FABMET        2 .HEADER        14       2         443    168.2006    3.23                                                                                                                                                      
14FABMET        3 .HEADER        14       2       306.8     200.341    6.46                                                                                                                                                      
14FABMET        4 .HEADER        14       2       16041    286.5959    1.60                                                                                                                                                      
15MACHIN        1 .HEADER        15       2       183.1    407.9615    0.38                                                                                                                                                      
15MACHIN        2 .HEADER        15       2         443    168.2006    1.72                                                                                                                                                      
15MACHIN        3 .HEADER        15       2       306.8     200.341    3.44                                                                                                                                                      
15MACHIN        4 .HEADER        15       2       16041    286.5959    0.86                                                                                                                                                      
16COMPUT        1 .HEADER        16       2       183.1    407.9615    0.52                                                                                                                                                      
16COMPUT        2 .HEADER        16       2         443    168.2006    2.37                                                                                                                                                      
16COMPUT        3 .HEADER        16       2       306.8     200.341    4.74                                                                                                                                                      
16COMPUT        4 .HEADER        16       2       16041    286.5959    1.18                                                                                                                                                      
17TRANEQ        1 .HEADER        17       2       183.1    407.9615    1.61                                                                                                                                                      
17TRANEQ        2 .HEADER        17       2         443    168.2006    7.31                                                                                                                                                      
17TRANEQ        3 .HEADER        17       2       306.8     200.341   14.64                                                                                                                                                      
17TRANEQ        4 .HEADER        17       2       16041    286.5959    3.64                                                                                                                                                      
18ELECEQ        1 .HEADER        18       2       183.1    407.9615    0.28                                                                                                                                                      
18ELECEQ        2 .HEADER        18       2         443    168.2006    1.29                                                                                                                                                      
18ELECEQ        3 .HEADER        18       2       306.8     200.341    2.58                                                                                                                                                      
18ELECEQ        4 .HEADER        18       2       16041    286.5959    0.64                                                                                                                                                      
19WOODPR        1 .HEADER        19       2     13051.6    325.3287   11.96                                                                                                                                                      
19WOODPR        1 BSCBYP          1      42        1.35           0                                                                                                                                    
19WOODPR        1 STEPBYP  N/A            1          42        3.61       0    3.61       0                                                                                                         
19WOODPR        2 .HEADER        19       2      7209.7    179.7105   54.21                                                                                                                                                      
19WOODPR        2 BSCBYP          1      42        1.35           0                                                                                                                                    
19WOODPR        2 STEPBYP  N/A            1          42        2.44       0    2.44       0                                                                                                         
19WOODPR        3 .HEADER        19       2      6542.7    163.0846  108.48                                                                                                                                                      
19WOODPR        3 BSCBYP          1      42        1.35           0                                                                                                                                    
19WOODPR        3 STEPBYP  N/A            1          42        7.56       0    7.56       0                                                                                                         
19WOODPR        4 .HEADER        19       2      4953.6    123.4761   26.95                                                                                                                                                      
19WOODPR        4 BSCBYP          1      42        1.35           0                                                                                                                                    
19WOODPR        4 STEPBYP  N/A            1          42        1.66       0    1.66       0                                                                                                         
20PLASTI        1 .HEADER        20       2     13051.6    325.3287    1.47                                                                                                                                                      
20PLASTI        2 .HEADER        20       2      7209.7    179.7105    6.67                                                                                                                                                      
20PLASTI        3 .HEADER        20       2      6542.7    163.0846   13.35                                                                                                                                                      
20PLASTI        4 .HEADER        20       2      4953.6    123.4761    3.32                                                                                                                                                      
21BOMOTH        1 .HEADER        21       2     13051.6    325.3287   15.28                                                                                                                                                      
21BOMOTH        1 BSCBYP          1      42        1.35           0                                                                                                                                    
21BOMOTH        1 STEPBYP  N/A            1          42       0.009       0   0.009       0                                                                                                         
21BOMOTH        2 .HEADER        21       2      7209.7    179.7105   69.26                                                                                                                                                     
21BOMOTH        2 BSCBYP          1      42        1.35           0                                                                                                                                    
21BOMOTH        2 STEPBYP  N/A            1          42       0.009       0   0.009       0                                                                                                         
21BOMOTH        3 .HEADER        21       2      6542.7    163.0846  138.62                                                                                                                                                      
21BOMOTH        3 BSCBYP          1      42        1.35           0                                                                                                                                    
21BOMOTH        3 STEPBYP  N/A            1          42       0.040       0   0.040       0                                                                                                         
21BOMOTH        4 .HEADER        21       2      4953.6    123.4761   34.44                                                                                                                                                      
21BOMOTH        4 BSCBYP          1      42        1.35           0                                                                                                                                    
21BOMOTH        4 STEPBYP  N/A            1          42       0.008       0   0.008       0                                                                                                         