  COMPOSITE TABLE:
  steoyr  AppalachiaLimit   InteriorLimit   WestLimit  ElecPriceSTEO   ElecTonsSTEO  WasteCoalSTEO  CokeTonsSTEO  IndustrialTonsSTEO CokingExpSTEO SteamExpSTEO ImportsSTEO EOYStocksEPEast EOYStocksEPMidW EOYStocksEPSouth EOYStocksEPWest EOYStocksPrim EOYStocksSecd
!------------------------------------------------------------------------------------------------------------------------------------------------------------------------------------------------------------------
  1990         488.993         205.671       334.411       1.4541         782.567         3.34          38.877          76.330            63.459       42.344       2.699           0.000           0.000            0.000           0.000        33.418       168.210
  1991         457.808         195.418       342.758       1.4460         783.874         3.95          33.854          75.405            64.645       44.322       3.390           0.000           0.000            0.000           0.000        32.971       167.711
  1992         456.565         195.659       345.321       1.4115         795.094         6.29          32.366          74.042            59.426       43.092       3.803           0.000           0.000            0.000           0.000        33.993       163.692
  1993         409.718         167.174       368.532       1.3849         831.645         8.14          31.323          74.892            49.652       24.868       8.181           0.000           0.000            0.000           0.000        25.284       120.458
  1994         445.370         179.858       408.276       1.3554         838.354         8.23          31.740          75.179            47.334       24.024       8.870           0.000           0.000            0.000           0.000        33.219       136.139
  1995         434.861         168.526       429.587       1.3171         850.230         8.56          33.011          73.055            52.089       36.458       9.473           0.000           0.000            0.000           0.000        34.444       134.639
  1996         451.868         172.848       439.140       1.2882         896.921         8.78          31.706          71.689            52.950       37.521       8.115           0.000           0.000            0.000           0.000        28.648       122.979
  1997         467.778         170.863       451.291       1.2721         921.364         8.10          30.203          71.515            52.154       31.392       7.487           0.000           0.000            0.000           0.000        33.973       106.401
  1998         460.400         168.374       488.762       1.2518         936.619         8.69          28.189          67.439            47.094       30.953       8.724           0.000           0.000            0.000           0.000        36.530       128.072
  1999         425.573         162.530       512.328       1.2159         940.922         8.68          28.108          64.738            32.129       26.347       9.089           0.000           0.000            0.000           0.000        39.475       149.115
  2000         419.419         143.531       510.661       1.1997         985.821         9.09          28.939          65.208            32.826       25.662      12.513           0.000           0.000            0.000           0.000        31.905       108.377
  2001         432.782         147.028       547.879       1.2315         964.433        10.09          26.075          65.268            25.412       23.254      19.787           9.558          56.430           58.567          13.588        35.900       146.012
  2002         396.969         146.868       550.446       1.2538         977.507         9.05          23.656          60.747            21.535       18.066      16.875           8.514          60.820           58.078          14.302        43.257       148.870
  2003         376.775         146.276       548.701       1.2811        1005.116        10.02          24.248          61.261            22.090       20.924      25.044           6.083          53.544           49.795          12.146        38.277       127.191
  2004         390.663         146.250       575.186       1.3630        1016.268        11.30          23.670          62.195            26.841       21.157      27.280           6.516          48.151           40.219          11.783        41.151       112.855
  2005         397.347         149.181       584.970       1.5426        1037.485        13.35          23.434          60.340            28.661       21.281      30.460           7.176          43.380           38.936          11.644        34.971       109.333
  2006         391.882         151.419       619.449       1.6938        1026.636        14.41          22.957          59.472            27.498       22.149      36.246           8.173          60.007           57.727          15.057        36.548       150.398
  2007         378.489         147.134       621.012       1.7692        1045.141        14.08          22.715          56.615            32.185       26.978      36.347           6.111          66.209           63.950          14.951        33.977       158.781
  2008         391.217         146.995       633.597       2.0667        1040.580        14.15          22.070          54.393            42.549       38.971      34.208           8.201          68.190           67.644          17.553        34.688       170.424
  2009         343.330         146.612       584.981       2.2057         933.627        13.67          15.326          45.314            37.262       21.835      22.639           8.137          69.248           89.037          23.046        47.718       197.062
  2010         336.418         156.340       591.611       2.2676         975.052        13.65          21.092          49.289            56.114       25.602      19.353           7.706          69.103           79.426          18.682        49.820       181.920
  2011         337.232         170.763       587.633       2.3912         932.484        13.21          21.434          46.238            69.532       37.647      13.088           9.189          65.806           77.015          20.376        51.897       180.054
  2012         292.976         180.238       543.244       2.3827         823.552        11.20          20.751          42.838            69.876       55.870       9.159           8.582          66.693           87.323          22.517        46.157       192.696
  2013         271.529         183.102       530.210       2.3432         857.962        11.28          21.474          43.055            65.679       51.980       8.906           7.102          51.209           72.589          16.984        45.652       154.676
  2014         268.546         188.660       542.842       2.3638         851.602        12.09          21.297          42.946            60.071       37.186      11.350           9.690          54.488           69.570          17.801        38.894       158.833
  2015         221.988         167.556       507.397       2.2263         738.444         9.97          19.708          38.459            46.007       27.951      11.318           9.671          75.602           88.236          22.039        35.871       202.560
  2016         180.306         144.083       403.975       2.1124         678.555        10.14          16.485          34.849            40.930       19.341       9.846           6.164          66.727           67.486          21.633        25.309       167.681
  2017         198.446         145.294       430.870       2.0583         664.993         9.95          17.538          33.264            54.349       42.596       7.803           4.808          57.099           55.879          19.900        23.999       142.957
  2018         200.878         136.960       418.329       2.0577         637.217        10.43          18.337          31.580            62.150       54.094       5.954           4.116          42.415           39.592          16.670        21.692       108.104
  2019         193.654         127.653       385.003       2.0192         538.606         8.00          17.967          29.095            52.916       40.849       6.697           5.077          51.112           54.270          17.643        31.320       134.014
  2020         138.822          90.729       305.883       1.9187         435.827         7.57          14.414          25.660            42.010       27.057       5.137           4.225          56.397           51.837          18.971        23.640       138.078
  2021         155.756          93.477       328.829       1.9803         501.427         7.88          17.589          25.845            45.336       39.873       5.390           3.190          40.737           36.061          14.666        25.295        99.108
  2022         158.168          91.226       350.705       2.2632         485.061         7.55          16.155          26.244            46.913       39.327       5.889           1.834          30.563           29.771          15.418        34.602        82.960
  2023         152.382          84.873       353.156       2.2637         442.723         7.19          17.121          23.892            50.560       46.034       5.334           2.761          24.639           39.651          28.267        38.889       100.226
  2024         141.604          96.149       330.755       2.2333         424.381         7.23          18.123          22.871            69.776       56.495       8.671           2.757           2.521           37.248          39.976        43.770        87.111
