Oscillation Penalty,2
Action Penalty,0.1
Deviation from Optimal Penalty,4
PsetPmax Penalty,0.5
load file timestep,1
power factor,0.9
load scaling factor,1
solar scaling factor,0.05
measurement filter time constant mean,1.2
measurement filter time constant std,0.2
output filter time constant mean,0.115
output filter time constant std,0.025
bp1 default,0.98
bp2 default,1.01
bp3 default,1.01
bp4 default,1.04
bp5 default,1.07
max tap change default,16
forward band default,2
tap number default,0
tap delay default,2
delay default,30
p ramp rate,1
q ramp rate,0.03
