{
  "single_sweeps": [
    {
      "f": 100000,
      "winding1": {
        "turn_losses": [
          0.0145286363635498,
          0.01400934520045811,
          0.01206363662271089,
          0.01046818697652722,
          0.0097888160638828,
          0.01001965784011447,
          0.01113601431565826,
          0.01320921279729466,
          0.01680146336300302
        ],
        "flux": [
          9.691634059625143e-05,
          -5.184479320867313e-07
        ],
        "self_inductance": [
          2.153696457694483e-05,
          -1.152106515748295e-07
        ],
        "mag_field_energy": [
          0.0001090307004125021,
          -5.960153511062038e-07
        ],
        "V": [
          0.3257504602817726,
          60.89433272599818
        ],
        "number_turns": 9,
        "I": [
          4.5,
          0.0
        ],
        "winding_losses": 0.1120249695431991,
        "P": 0.7329385356339884,
        "Q": 137.01224863349591,
        "S": 137.01420902411516
      },
      "core_eddy_losses": 0.01603820722248874,
      "core_hyst_losses": 0.6844944235746491,
      "all_winding_losses": 0.1120249695431991
    }
  ],
  "total_losses": {
    "winding1": {
      "total": 0.11202496954319922,
      "turns": [
        0.0145286363635498,
        0.01400934520045811,
        0.01206363662271089,
        0.01046818697652722,
        0.0097888160638828,
        0.01001965784011447,
        0.01113601431565826,
        0.01320921279729466,
        0.01680146336300302
      ]
    },
    "all_windings": 0.1120249695431991,
    "eddy_core": 0.01603820722248874,
    "hyst_core_fundamental_freq": 0.6844944235746491,
    "core": 0.7005326307971378
  },
  "simulation_settings": {
    "date": "2022-10-28 09:12:32",
    "component_type": "Inductor",
    "working_directory": "/home/nikolasf/Dokumente/01_git/30_Python/FEMMT/femmt/examples/example_results/integration",
    "core": {
      "core_inner_diameter": 0.0149,
      "window_w": 0.01105,
      "window_h": 0.0295,
      "material": "custom",
      "loss_approach": "LossAngle",
      "mu_rel": 3000,
      "phi_mu_deg": 10,
      "sigma": 0.5,
      "non_linear": false,
      "correct_outer_leg": false,
      "temperature": null,
      "datasource": null
    },
    "virtual_winding_windows": [
      {
        "bot_bound": -0.013749999999999998,
        "top_bound": 0.013749999999999998,
        "left_bound": 0.01145,
        "right_bound": 0.0175,
        "winding_type": "Single",
        "winding_scheme": null,
        "wrap_para": null,
        "windings": [
          {
            "winding_number": 0,
            "conductivity": "Copper",
            "conductor_type": "RoundLitz",
            "thickness": null,
            "conductor_radius": 0.0009899494936611666,
            "conductor_arrangement": "Square",
            "number_strands": 100,
            "strand_radius": 7e-05,
            "fill_factor": 0.5
          }
        ],
        "turns": [
          9
        ]
      }
    ],
    "air_gaps": {
      "method": "Percent",
      "air_gap_number": 2,
      "air_gaps": [
        {
          "leg_position": "CenterLeg",
          "position_value": 10,
          "height": 0.0005
        },
        {
          "leg_position": "CenterLeg",
          "position_value": 90,
          "height": 0.0005
        }
      ]
    },
    "insulation": {
      "inner_winding_insulations": [
        0.0005
      ],
      "core_insulations": [
        0.001,
        0.001,
        0.004,
        0.001
      ],
      "vww_insulation": 0.0001
    }
  },
  "misc": {
    "core_2daxi_volume": 1.9422585955845275e-05,
    "core_2daxi_total_volume": 4.61718454654407e-05,
    "core_2daxi_weight": 0.0,
    "wire_lengths": [
      0.7034625709256517
    ],
    "wire_volumes": [
      2.165792987997508e-06
    ],
    "wire_weight": [
      0.01931887345293777
    ],
    "core_cost": 0.0,
    "winding_cost": [
      3.757894253850563
    ],
    "total_cost_incl_margin": 5.0105256718007505
  }
}
