[
  { "States": {
    "Flood state" : {
      "IRI":  1,
      "value":false
    },
   "Flood depth":{
    "value": 0.9
  }
  }
} ,
    { "States": {
    "Flood state" : {
      "IRI":  2,
      "value":false
    },
   "Flood depth":{
    "value": -0.5
  }
  }
},   { "States": {
    "Flood state" : {
      "IRI":  3,
      "value":false
    },
   "Flood depth":{
    "value": 0.25
  }
  }
}
]
