<?xml version="1.0" encoding="UTF-8" standalone="no"?>
<svg
   xmlns:dc="http://purl.org/dc/elements/1.1/"
   xmlns:cc="http://creativecommons.org/ns#"
   xmlns:rdf="http://www.w3.org/1999/02/22-rdf-syntax-ns#"
   xmlns:svg="http://www.w3.org/2000/svg"
   xmlns="http://www.w3.org/2000/svg"
   xmlns:sodipodi="http://sodipodi.sourceforge.net/DTD/sodipodi-0.dtd"
   xmlns:inkscape="http://www.inkscape.org/namespaces/inkscape"
   width="135.25827mm"
   height="293.48483mm"
   viewBox="0 0 135.25827 293.48482"
   version="1.1"
   id="svg5"
   inkscape:version="1.0.1 (3bc2e813f5, 2020-09-07)"
   sodipodi:docname="CReDo_Workflow_2.svg">
  <metadata
     id="metadata197">
    <rdf:RDF>
      <cc:Work
         rdf:about="">
        <dc:format>image/svg+xml</dc:format>
        <dc:type
           rdf:resource="http://purl.org/dc/dcmitype/StillImage" />
        <dc:title></dc:title>
      </cc:Work>
    </rdf:RDF>
  </metadata>
  <sodipodi:namedview
     id="namedview7"
     pagecolor="#ffffff"
     bordercolor="#666666"
     borderopacity="1.0"
     inkscape:pageshadow="2"
     inkscape:pageopacity="0.0"
     inkscape:pagecheckerboard="0"
     inkscape:document-units="mm"
     showgrid="false"
     inkscape:zoom="1.4142136"
     inkscape:cx="197.99686"
     inkscape:cy="180.54807"
     inkscape:window-width="1920"
     inkscape:window-height="1017"
     inkscape:window-x="-8"
     inkscape:window-y="-8"
     inkscape:window-maximized="1"
     inkscape:current-layer="layer1"
     inkscape:document-rotation="0"
     fit-margin-top="0"
     fit-margin-left="0"
     fit-margin-right="0"
     fit-margin-bottom="0" />
  <defs
     id="defs2">
    <marker
       inkscape:isstock="true"
       style="overflow:visible"
       id="marker36000"
       refX="0"
       refY="0"
       orient="auto"
       inkscape:stockid="TriangleOutM">
      <path
         transform="scale(0.4)"
         style="fill:#000000;fill-opacity:1;fill-rule:evenodd;stroke:#000000;stroke-width:1pt;stroke-opacity:1"
         d="M 5.77,0 -2.88,5 V -5 Z"
         id="path35998"
         inkscape:connector-curvature="0" />
    </marker>
    <marker
       inkscape:isstock="true"
       style="overflow:visible"
       id="marker15504"
       refX="0"
       refY="0"
       orient="auto"
       inkscape:stockid="TriangleOutM">
      <path
         transform="scale(0.4)"
         style="fill:#000000;fill-opacity:1;fill-rule:evenodd;stroke:#000000;stroke-width:1pt;stroke-opacity:1"
         d="M 5.77,0 -2.88,5 V -5 Z"
         id="path15502"
         inkscape:connector-curvature="0" />
    </marker>
    <marker
       inkscape:isstock="true"
       style="overflow:visible"
       id="marker29763"
       refX="0"
       refY="0"
       orient="auto"
       inkscape:stockid="TriangleOutM">
      <path
         transform="scale(0.4)"
         style="fill:#000000;fill-opacity:1;fill-rule:evenodd;stroke:#000000;stroke-width:1pt;stroke-opacity:1"
         d="M 5.77,0 -2.88,5 V -5 Z"
         id="path29761"
         inkscape:connector-curvature="0" />
    </marker>
    <marker
       inkscape:isstock="true"
       style="overflow:visible"
       id="marker30103"
       refX="0"
       refY="0"
       orient="auto"
       inkscape:stockid="TriangleOutM">
      <path
         transform="scale(0.4)"
         style="fill:#000000;fill-opacity:1;fill-rule:evenodd;stroke:#000000;stroke-width:1pt;stroke-opacity:1"
         d="M 5.77,0 -2.88,5 V -5 Z"
         id="path30101"
         inkscape:connector-curvature="0" />
    </marker>
    <marker
       inkscape:isstock="true"
       style="overflow:visible"
       id="marker30449"
       refX="0"
       refY="0"
       orient="auto"
       inkscape:stockid="TriangleOutM">
      <path
         transform="scale(0.4)"
         style="fill:#000000;fill-opacity:1;fill-rule:evenodd;stroke:#000000;stroke-width:1pt;stroke-opacity:1"
         d="M 5.77,0 -2.88,5 V -5 Z"
         id="path30447"
         inkscape:connector-curvature="0" />
    </marker>
    <marker
       inkscape:isstock="true"
       style="overflow:visible"
       id="marker30801"
       refX="0"
       refY="0"
       orient="auto"
       inkscape:stockid="TriangleOutM">
      <path
         transform="scale(0.4)"
         style="fill:#000000;fill-opacity:1;fill-rule:evenodd;stroke:#000000;stroke-width:1pt;stroke-opacity:1"
         d="M 5.77,0 -2.88,5 V -5 Z"
         id="path30799"
         inkscape:connector-curvature="0" />
    </marker>
    <marker
       inkscape:isstock="true"
       style="overflow:visible"
       id="marker31159"
       refX="0"
       refY="0"
       orient="auto"
       inkscape:stockid="TriangleOutM">
      <path
         transform="scale(0.4)"
         style="fill:#000000;fill-opacity:1;fill-rule:evenodd;stroke:#000000;stroke-width:1pt;stroke-opacity:1"
         d="M 5.77,0 -2.88,5 V -5 Z"
         id="path31157"
         inkscape:connector-curvature="0" />
    </marker>
    <marker
       inkscape:isstock="true"
       style="overflow:visible"
       id="marker31893"
       refX="0"
       refY="0"
       orient="auto"
       inkscape:stockid="TriangleOutM">
      <path
         transform="scale(0.4)"
         style="fill:#000000;fill-opacity:1;fill-rule:evenodd;stroke:#000000;stroke-width:1pt;stroke-opacity:1"
         d="M 5.77,0 -2.88,5 V -5 Z"
         id="path31891"
         inkscape:connector-curvature="0" />
    </marker>
    <marker
       inkscape:isstock="true"
       style="overflow:visible"
       id="marker29091"
       refX="0"
       refY="0"
       orient="auto"
       inkscape:stockid="TriangleOutM">
      <path
         transform="scale(0.4)"
         style="fill:#000000;fill-opacity:1;fill-rule:evenodd;stroke:#000000;stroke-width:1pt;stroke-opacity:1"
         d="M 5.77,0 -2.88,5 V -5 Z"
         id="path29089"
         inkscape:connector-curvature="0" />
    </marker>
    <marker
       inkscape:stockid="TriangleOutM"
       orient="auto"
       refY="0"
       refX="0"
       id="marker32669"
       style="overflow:visible"
       inkscape:isstock="true">
      <path
         id="path32667"
         d="M 5.77,0 -2.88,5 V -5 Z"
         style="fill:#000000;fill-opacity:1;fill-rule:evenodd;stroke:#000000;stroke-width:1pt;stroke-opacity:1"
         transform="scale(0.4)"
         inkscape:connector-curvature="0" />
    </marker>
    <marker
       inkscape:isstock="true"
       style="overflow:visible"
       id="marker29429"
       refX="0"
       refY="0"
       orient="auto"
       inkscape:stockid="TriangleOutM">
      <path
         transform="scale(0.4)"
         style="fill:#000000;fill-opacity:1;fill-rule:evenodd;stroke:#000000;stroke-width:1pt;stroke-opacity:1"
         d="M 5.77,0 -2.88,5 V -5 Z"
         id="path29427"
         inkscape:connector-curvature="0" />
    </marker>
    <marker
       inkscape:isstock="true"
       style="overflow:visible"
       id="marker29101"
       refX="0"
       refY="0"
       orient="auto"
       inkscape:stockid="TriangleOutM">
      <path
         transform="scale(0.4)"
         style="fill:#000000;fill-opacity:1;fill-rule:evenodd;stroke:#000000;stroke-width:1pt;stroke-opacity:1"
         d="M 5.77,0 -2.88,5 V -5 Z"
         id="path29099"
         inkscape:connector-curvature="0" />
    </marker>
    <marker
       inkscape:isstock="true"
       style="overflow:visible"
       id="marker31159-2-8-9-2"
       refX="0"
       refY="0"
       orient="auto"
       inkscape:stockid="TriangleOutM">
      <path
         transform="scale(0.4)"
         style="fill:#000000;fill-opacity:1;fill-rule:evenodd;stroke:#000000;stroke-width:1pt;stroke-opacity:1"
         d="M 5.77,0 -2.88,5 V -5 Z"
         id="path31157-7-0-8-8"
         inkscape:connector-curvature="0" />
    </marker>
    <marker
       inkscape:isstock="true"
       style="overflow:visible"
       id="marker31159-2-8"
       refX="0"
       refY="0"
       orient="auto"
       inkscape:stockid="TriangleOutM">
      <path
         transform="scale(0.4)"
         style="fill:#000000;fill-opacity:1;fill-rule:evenodd;stroke:#000000;stroke-width:1pt;stroke-opacity:1"
         d="M 5.77,0 -2.88,5 V -5 Z"
         id="path31157-7-0"
         inkscape:connector-curvature="0" />
    </marker>
    <marker
       inkscape:isstock="true"
       style="overflow:visible"
       id="marker31159-2-4"
       refX="0"
       refY="0"
       orient="auto"
       inkscape:stockid="TriangleOutM">
      <path
         transform="scale(0.4)"
         style="fill:#000000;fill-opacity:1;fill-rule:evenodd;stroke:#000000;stroke-width:1pt;stroke-opacity:1"
         d="M 5.77,0 -2.88,5 V -5 Z"
         id="path31157-7-5"
         inkscape:connector-curvature="0" />
    </marker>
    <marker
       inkscape:isstock="true"
       style="overflow:visible"
       id="marker30103-4"
       refX="0"
       refY="0"
       orient="auto"
       inkscape:stockid="TriangleOutM">
      <path
         transform="scale(0.4)"
         style="fill:#000000;fill-opacity:1;fill-rule:evenodd;stroke:#000000;stroke-width:1pt;stroke-opacity:1"
         d="M 5.77,0 -2.88,5 V -5 Z"
         id="path30101-2"
         inkscape:connector-curvature="0" />
    </marker>
    <marker
       inkscape:isstock="true"
       style="overflow:visible"
       id="marker31159-2"
       refX="0"
       refY="0"
       orient="auto"
       inkscape:stockid="TriangleOutM">
      <path
         transform="scale(0.4)"
         style="fill:#000000;fill-opacity:1;fill-rule:evenodd;stroke:#000000;stroke-width:1pt;stroke-opacity:1"
         d="M 5.77,0 -2.88,5 V -5 Z"
         id="path31157-7"
         inkscape:connector-curvature="0" />
    </marker>
    <marker
       inkscape:stockid="TriangleOutM"
       orient="auto"
       refY="0"
       refX="0"
       id="marker48257"
       style="overflow:visible"
       inkscape:isstock="true">
      <path
         inkscape:connector-curvature="0"
         id="path48255"
         d="M 5.77,0 -2.88,5 V -5 Z"
         style="fill:#000000;fill-opacity:1;fill-rule:evenodd;stroke:#000000;stroke-width:1pt;stroke-opacity:1"
         transform="scale(0.4)" />
    </marker>
    <marker
       inkscape:stockid="TriangleOutM"
       orient="auto"
       refY="0"
       refX="0"
       id="marker42266"
       style="overflow:visible"
       inkscape:isstock="true">
      <path
         inkscape:connector-curvature="0"
         id="path42264"
         d="M 5.77,0 -2.88,5 V -5 Z"
         style="fill:#000000;fill-opacity:1;fill-rule:evenodd;stroke:#000000;stroke-width:1pt;stroke-opacity:1"
         transform="scale(0.4)" />
    </marker>
    <marker
       inkscape:isstock="true"
       style="overflow:visible"
       id="marker31159-2-7"
       refX="0"
       refY="0"
       orient="auto"
       inkscape:stockid="TriangleOutM">
      <path
         transform="scale(0.4)"
         style="fill:#000000;fill-opacity:1;fill-rule:evenodd;stroke:#000000;stroke-width:1pt;stroke-opacity:1"
         d="M 5.77,0 -2.88,5 V -5 Z"
         id="path31157-7-2"
         inkscape:connector-curvature="0" />
    </marker>
    <marker
       inkscape:isstock="true"
       style="overflow:visible"
       id="marker31159-2-8-9-2-8"
       refX="0"
       refY="0"
       orient="auto"
       inkscape:stockid="TriangleOutM">
      <path
         transform="scale(0.4)"
         style="fill:#000000;fill-opacity:1;fill-rule:evenodd;stroke:#000000;stroke-width:1pt;stroke-opacity:1"
         d="M 5.77,0 -2.88,5 V -5 Z"
         id="path31157-7-0-8-8-8"
         inkscape:connector-curvature="0" />
    </marker>
    <marker
       inkscape:isstock="true"
       style="overflow:visible"
       id="marker31159-2-8-1"
       refX="0"
       refY="0"
       orient="auto"
       inkscape:stockid="TriangleOutM">
      <path
         transform="scale(0.4)"
         style="fill:#000000;fill-opacity:1;fill-rule:evenodd;stroke:#000000;stroke-width:1pt;stroke-opacity:1"
         d="M 5.77,0 -2.88,5 V -5 Z"
         id="path31157-7-0-7"
         inkscape:connector-curvature="0" />
    </marker>
    <marker
       inkscape:isstock="true"
       style="overflow:visible"
       id="marker31159-2-4-7"
       refX="0"
       refY="0"
       orient="auto"
       inkscape:stockid="TriangleOutM">
      <path
         transform="scale(0.4)"
         style="fill:#000000;fill-opacity:1;fill-rule:evenodd;stroke:#000000;stroke-width:1pt;stroke-opacity:1"
         d="M 5.77,0 -2.88,5 V -5 Z"
         id="path31157-7-5-6"
         inkscape:connector-curvature="0" />
    </marker>
    <marker
       inkscape:isstock="true"
       style="overflow:visible"
       id="marker30103-4-2"
       refX="0"
       refY="0"
       orient="auto"
       inkscape:stockid="TriangleOutM">
      <path
         transform="scale(0.4)"
         style="fill:#000000;fill-opacity:1;fill-rule:evenodd;stroke:#000000;stroke-width:1pt;stroke-opacity:1"
         d="M 5.77,0 -2.88,5 V -5 Z"
         id="path30101-2-3"
         inkscape:connector-curvature="0" />
    </marker>
    <marker
       inkscape:isstock="true"
       style="overflow:visible"
       id="marker31159-2-0"
       refX="0"
       refY="0"
       orient="auto"
       inkscape:stockid="TriangleOutM">
      <path
         transform="scale(0.4)"
         style="fill:#000000;fill-opacity:1;fill-rule:evenodd;stroke:#000000;stroke-width:1pt;stroke-opacity:1"
         d="M 5.77,0 -2.88,5 V -5 Z"
         id="path31157-7-4"
         inkscape:connector-curvature="0" />
    </marker>
    <marker
       inkscape:stockid="TriangleOutM"
       orient="auto"
       refY="0"
       refX="0"
       id="marker48257-0"
       style="overflow:visible"
       inkscape:isstock="true">
      <path
         inkscape:connector-curvature="0"
         id="path48255-2"
         d="M 5.77,0 -2.88,5 V -5 Z"
         style="fill:#000000;fill-opacity:1;fill-rule:evenodd;stroke:#000000;stroke-width:1pt;stroke-opacity:1"
         transform="scale(0.4)" />
    </marker>
    <marker
       inkscape:stockid="TriangleOutM"
       orient="auto"
       refY="0"
       refX="0"
       id="marker42266-8"
       style="overflow:visible"
       inkscape:isstock="true">
      <path
         inkscape:connector-curvature="0"
         id="path42264-0"
         d="M 5.77,0 -2.88,5 V -5 Z"
         style="fill:#000000;fill-opacity:1;fill-rule:evenodd;stroke:#000000;stroke-width:1pt;stroke-opacity:1"
         transform="scale(0.4)" />
    </marker>
    <marker
       inkscape:isstock="true"
       style="overflow:visible"
       id="marker31159-2-7-6"
       refX="0"
       refY="0"
       orient="auto"
       inkscape:stockid="TriangleOutM">
      <path
         transform="scale(0.4)"
         style="fill:#000000;fill-opacity:1;fill-rule:evenodd;stroke:#000000;stroke-width:1pt;stroke-opacity:1"
         d="M 5.77,0 -2.88,5 V -5 Z"
         id="path31157-7-2-3"
         inkscape:connector-curvature="0" />
    </marker>
    <marker
       inkscape:isstock="true"
       style="overflow:visible"
       id="marker84625"
       refX="0"
       refY="0"
       orient="auto"
       inkscape:stockid="TriangleOutM">
      <path
         transform="scale(0.4)"
         style="fill:#000000;fill-opacity:1;fill-rule:evenodd;stroke:#000000;stroke-width:1pt;stroke-opacity:1"
         d="M 5.77,0 -2.88,5 V -5 Z"
         id="path84623"
         inkscape:connector-curvature="0" />
    </marker>
    <marker
       inkscape:isstock="true"
       style="overflow:visible"
       id="marker31159-2-7-5"
       refX="0"
       refY="0"
       orient="auto"
       inkscape:stockid="TriangleOutM">
      <path
         transform="scale(0.4)"
         style="fill:#000000;fill-opacity:1;fill-rule:evenodd;stroke:#000000;stroke-width:1pt;stroke-opacity:1"
         d="M 5.77,0 -2.88,5 V -5 Z"
         id="path31157-7-2-9"
         inkscape:connector-curvature="0" />
    </marker>
    <marker
       markerWidth="11.811918"
       markerHeight="19.000338"
       refX="5.9059591"
       refY="9.5001688"
       orient="auto"
       id="marker35743">
      <g
         id="g35741"
         style="stroke-width:0.264583"
         transform="matrix(3.7795276,0,0,3.7795276,-262.31236,-99.953177)">
        <g
           id="g30395"
           style="stroke-width:0.264583">
          <path
             style="fill:none;stroke:#000000;stroke-width:0.264583;stroke-linecap:butt;stroke-linejoin:miter;stroke-miterlimit:4;stroke-dasharray:none;stroke-opacity:1"
             d="M 71.917069,28.959533 H 70.871942"
             id="path5077" />
          <path
             style="fill:none;stroke:#000000;stroke-width:0.228865;stroke-linecap:butt;stroke-linejoin:miter;stroke-miterlimit:4;stroke-dasharray:none;stroke-opacity:1"
             d="m 69.709308,26.751768 2.20776,2.207765 -2.207766,2.20776"
             id="path12358"
             sodipodi:nodetypes="ccc" />
        </g>
      </g>
    </marker>
    <marker
       style="overflow:visible"
       id="marker35103-4"
       refX="0"
       refY="0"
       orient="auto"
       inkscape:stockid="Arrow2Mend"
       inkscape:isstock="true">
      <path
         transform="scale(-0.6)"
         d="M 8.7185878,4.0337352 -2.2072895,0.01601326 8.7185884,-4.0017078 c -1.7454984,2.3720609 -1.7354408,5.6174519 -6e-7,8.035443 z"
         style="fill:#000000;fill-opacity:1;fill-rule:evenodd;stroke:#000000;stroke-width:0.625;stroke-linejoin:round;stroke-opacity:1"
         id="path35101-0"
         inkscape:connector-curvature="0" />
    </marker>
    <marker
       style="overflow:visible"
       id="marker40155-4"
       refX="0"
       refY="0"
       orient="auto"
       inkscape:stockid="Arrow2Mend"
       inkscape:isstock="true">
      <path
         transform="scale(-0.6)"
         d="M 8.7185878,4.0337352 -2.2072895,0.01601326 8.7185884,-4.0017078 c -1.7454984,2.3720609 -1.7354408,5.6174519 -6e-7,8.035443 z"
         style="fill:#000000;fill-opacity:1;fill-rule:evenodd;stroke:#000000;stroke-width:0.625;stroke-linejoin:round;stroke-opacity:1"
         id="path40153-3"
         inkscape:connector-curvature="0" />
    </marker>
    <marker
       style="overflow:visible"
       id="marker41776"
       refX="0"
       refY="0"
       orient="auto"
       inkscape:stockid="Arrow2Mend"
       inkscape:isstock="true">
      <path
         transform="scale(-0.6)"
         d="M 8.7185878,4.0337352 -2.2072895,0.01601326 8.7185884,-4.0017078 c -1.7454984,2.3720609 -1.7354408,5.6174519 -6e-7,8.035443 z"
         style="fill:#000000;fill-opacity:1;fill-rule:evenodd;stroke:#000000;stroke-width:0.625;stroke-linejoin:round;stroke-opacity:1"
         id="path41774"
         inkscape:connector-curvature="0" />
    </marker>
    <marker
       style="overflow:visible"
       id="marker35103-4-5"
       refX="0"
       refY="0"
       orient="auto"
       inkscape:stockid="Arrow2Mend"
       inkscape:isstock="true">
      <path
         transform="scale(-0.6)"
         d="M 8.7185878,4.0337352 -2.2072895,0.01601326 8.7185884,-4.0017078 c -1.7454984,2.3720609 -1.7354408,5.6174519 -6e-7,8.035443 z"
         style="fill:#000000;fill-opacity:1;fill-rule:evenodd;stroke:#000000;stroke-width:0.625;stroke-linejoin:round;stroke-opacity:1"
         id="path35101-0-6"
         inkscape:connector-curvature="0" />
    </marker>
    <marker
       inkscape:isstock="true"
       style="overflow:visible"
       id="marker29101-38"
       refX="0"
       refY="0"
       orient="auto"
       inkscape:stockid="TriangleOutM">
      <path
         transform="scale(0.4)"
         style="fill:#000000;fill-opacity:1;fill-rule:evenodd;stroke:#000000;stroke-width:1pt;stroke-opacity:1"
         d="M 5.77,0 -2.88,5 V -5 Z"
         id="path29099-97"
         inkscape:connector-curvature="0" />
    </marker>
    <marker
       inkscape:isstock="true"
       style="overflow:visible"
       id="marker29429-18"
       refX="0"
       refY="0"
       orient="auto"
       inkscape:stockid="TriangleOutM">
      <path
         transform="scale(0.4)"
         style="fill:#000000;fill-opacity:1;fill-rule:evenodd;stroke:#000000;stroke-width:1pt;stroke-opacity:1"
         d="M 5.77,0 -2.88,5 V -5 Z"
         id="path29427-20"
         inkscape:connector-curvature="0" />
    </marker>
    <marker
       inkscape:stockid="TriangleOutM"
       orient="auto"
       refY="0"
       refX="0"
       id="marker32669-7"
       style="overflow:visible"
       inkscape:isstock="true">
      <path
         id="path32667-51"
         d="M 5.77,0 -2.88,5 V -5 Z"
         style="fill:#000000;fill-opacity:1;fill-rule:evenodd;stroke:#000000;stroke-width:1pt;stroke-opacity:1"
         transform="scale(0.4)"
         inkscape:connector-curvature="0" />
    </marker>
    <marker
       inkscape:isstock="true"
       style="overflow:visible"
       id="marker29091-64"
       refX="0"
       refY="0"
       orient="auto"
       inkscape:stockid="TriangleOutM">
      <path
         transform="scale(0.4)"
         style="fill:#000000;fill-opacity:1;fill-rule:evenodd;stroke:#000000;stroke-width:1pt;stroke-opacity:1"
         d="M 5.77,0 -2.88,5 V -5 Z"
         id="path29089-07"
         inkscape:connector-curvature="0" />
    </marker>
    <marker
       inkscape:isstock="true"
       style="overflow:visible"
       id="marker31893-30"
       refX="0"
       refY="0"
       orient="auto"
       inkscape:stockid="TriangleOutM">
      <path
         transform="scale(0.4)"
         style="fill:#000000;fill-opacity:1;fill-rule:evenodd;stroke:#000000;stroke-width:1pt;stroke-opacity:1"
         d="M 5.77,0 -2.88,5 V -5 Z"
         id="path31891-90"
         inkscape:connector-curvature="0" />
    </marker>
    <marker
       inkscape:isstock="true"
       style="overflow:visible"
       id="marker31159-02"
       refX="0"
       refY="0"
       orient="auto"
       inkscape:stockid="TriangleOutM">
      <path
         transform="scale(0.4)"
         style="fill:#000000;fill-opacity:1;fill-rule:evenodd;stroke:#000000;stroke-width:1pt;stroke-opacity:1"
         d="M 5.77,0 -2.88,5 V -5 Z"
         id="path31157-2"
         inkscape:connector-curvature="0" />
    </marker>
    <marker
       inkscape:isstock="true"
       style="overflow:visible"
       id="marker30801-03"
       refX="0"
       refY="0"
       orient="auto"
       inkscape:stockid="TriangleOutM">
      <path
         transform="scale(0.4)"
         style="fill:#000000;fill-opacity:1;fill-rule:evenodd;stroke:#000000;stroke-width:1pt;stroke-opacity:1"
         d="M 5.77,0 -2.88,5 V -5 Z"
         id="path30799-9"
         inkscape:connector-curvature="0" />
    </marker>
    <marker
       inkscape:isstock="true"
       style="overflow:visible"
       id="marker30449-57"
       refX="0"
       refY="0"
       orient="auto"
       inkscape:stockid="TriangleOutM">
      <path
         transform="scale(0.4)"
         style="fill:#000000;fill-opacity:1;fill-rule:evenodd;stroke:#000000;stroke-width:1pt;stroke-opacity:1"
         d="M 5.77,0 -2.88,5 V -5 Z"
         id="path30447-10"
         inkscape:connector-curvature="0" />
    </marker>
    <marker
       inkscape:isstock="true"
       style="overflow:visible"
       id="marker30103-86"
       refX="0"
       refY="0"
       orient="auto"
       inkscape:stockid="TriangleOutM">
      <path
         transform="scale(0.4)"
         style="fill:#000000;fill-opacity:1;fill-rule:evenodd;stroke:#000000;stroke-width:1pt;stroke-opacity:1"
         d="M 5.77,0 -2.88,5 V -5 Z"
         id="path30101-72"
         inkscape:connector-curvature="0" />
    </marker>
    <marker
       inkscape:isstock="true"
       style="overflow:visible"
       id="marker29763-21"
       refX="0"
       refY="0"
       orient="auto"
       inkscape:stockid="TriangleOutM">
      <path
         transform="scale(0.4)"
         style="fill:#000000;fill-opacity:1;fill-rule:evenodd;stroke:#000000;stroke-width:1pt;stroke-opacity:1"
         d="M 5.77,0 -2.88,5 V -5 Z"
         id="path29761-72"
         inkscape:connector-curvature="0" />
    </marker>
    <marker
       inkscape:isstock="true"
       style="overflow:visible"
       id="marker15504-5"
       refX="0"
       refY="0"
       orient="auto"
       inkscape:stockid="TriangleOutM">
      <path
         transform="scale(0.4)"
         style="fill:#000000;fill-opacity:1;fill-rule:evenodd;stroke:#000000;stroke-width:1pt;stroke-opacity:1"
         d="M 5.77,0 -2.88,5 V -5 Z"
         id="path15502-24"
         inkscape:connector-curvature="0" />
    </marker>
    <marker
       inkscape:isstock="true"
       style="overflow:visible"
       id="marker15504-6-2"
       refX="0"
       refY="0"
       orient="auto"
       inkscape:stockid="TriangleOutM">
      <path
         transform="scale(0.4)"
         style="fill:#000000;fill-opacity:1;fill-rule:evenodd;stroke:#000000;stroke-width:1pt;stroke-opacity:1"
         d="M 5.77,0 -2.88,5 V -5 Z"
         id="path15502-8-5"
         inkscape:connector-curvature="0" />
    </marker>
    <marker
       inkscape:isstock="true"
       style="overflow:visible"
       id="marker31159-2-7-66"
       refX="0"
       refY="0"
       orient="auto"
       inkscape:stockid="TriangleOutM">
      <path
         transform="scale(0.4)"
         style="fill:#000000;fill-opacity:1;fill-rule:evenodd;stroke:#000000;stroke-width:1pt;stroke-opacity:1"
         d="M 5.77,0 -2.88,5 V -5 Z"
         id="path31157-7-2-4"
         inkscape:connector-curvature="0" />
    </marker>
    <marker
       inkscape:stockid="TriangleOutM"
       orient="auto"
       refY="0"
       refX="0"
       id="marker42266-3"
       style="overflow:visible"
       inkscape:isstock="true">
      <path
         inkscape:connector-curvature="0"
         id="path42264-2"
         d="M 5.77,0 -2.88,5 V -5 Z"
         style="fill:#000000;fill-opacity:1;fill-rule:evenodd;stroke:#000000;stroke-width:1pt;stroke-opacity:1"
         transform="scale(0.4)" />
    </marker>
    <marker
       inkscape:stockid="TriangleOutM"
       orient="auto"
       refY="0"
       refX="0"
       id="marker48257-6"
       style="overflow:visible"
       inkscape:isstock="true">
      <path
         inkscape:connector-curvature="0"
         id="path48255-0"
         d="M 5.77,0 -2.88,5 V -5 Z"
         style="fill:#000000;fill-opacity:1;fill-rule:evenodd;stroke:#000000;stroke-width:1pt;stroke-opacity:1"
         transform="scale(0.4)" />
    </marker>
    <marker
       style="overflow:visible"
       id="Arrow2Mend"
       refX="0"
       refY="0"
       orient="auto"
       inkscape:stockid="Arrow2Mend"
       inkscape:isstock="true">
      <path
         transform="scale(-0.6)"
         d="M 8.7185878,4.0337352 -2.2072895,0.01601326 8.7185884,-4.0017078 c -1.7454984,2.3720609 -1.7354408,5.6174519 -6e-7,8.035443 z"
         style="fill:#000000;fill-opacity:1;fill-rule:evenodd;stroke:#000000;stroke-width:0.625;stroke-linejoin:round;stroke-opacity:1"
         id="path1129"
         inkscape:connector-curvature="0" />
    </marker>
    <marker
       style="overflow:visible"
       id="marker1678"
       refX="0"
       refY="0"
       orient="auto"
       inkscape:stockid="Arrow2Mend"
       inkscape:isstock="true">
      <path
         transform="scale(-0.6)"
         d="M 8.7185878,4.0337352 -2.2072895,0.01601326 8.7185884,-4.0017078 c -1.7454984,2.3720609 -1.7354408,5.6174519 -6e-7,8.035443 z"
         style="fill:#000000;fill-opacity:1;fill-rule:evenodd;stroke:#000000;stroke-width:0.625;stroke-linejoin:round;stroke-opacity:1"
         id="path1676"
         inkscape:connector-curvature="0" />
    </marker>
    <marker
       style="overflow:visible"
       id="Arrow2Mend-3"
       refX="0"
       refY="0"
       orient="auto"
       inkscape:stockid="Arrow2Mend"
       inkscape:isstock="true">
      <path
         transform="scale(-0.6)"
         d="M 8.7185878,4.0337352 -2.2072895,0.01601326 8.7185884,-4.0017078 c -1.7454984,2.3720609 -1.7354408,5.6174519 -6e-7,8.035443 z"
         style="fill:#000000;fill-opacity:1;fill-rule:evenodd;stroke:#000000;stroke-width:0.625;stroke-linejoin:round;stroke-opacity:1"
         id="path1129-6"
         inkscape:connector-curvature="0" />
    </marker>
    <marker
       style="overflow:visible"
       id="marker7916-7"
       refX="0"
       refY="0"
       orient="auto"
       inkscape:stockid="Arrow2Mend"
       inkscape:isstock="true">
      <path
         transform="scale(-0.6)"
         d="M 8.7185878,4.0337352 -2.2072895,0.01601326 8.7185884,-4.0017078 c -1.7454984,2.3720609 -1.7354408,5.6174519 -6e-7,8.035443 z"
         style="fill:#000000;fill-opacity:1;fill-rule:evenodd;stroke:#000000;stroke-width:0.625;stroke-linejoin:round;stroke-opacity:1"
         id="path7914-5"
         inkscape:connector-curvature="0" />
    </marker>
    <marker
       style="overflow:visible"
       id="marker7916-7-6"
       refX="0"
       refY="0"
       orient="auto"
       inkscape:stockid="Arrow2Mend"
       inkscape:isstock="true">
      <path
         transform="scale(-0.6)"
         d="M 8.7185878,4.0337352 -2.2072895,0.01601326 8.7185884,-4.0017078 c -1.7454984,2.3720609 -1.7354408,5.6174519 -6e-7,8.035443 z"
         style="fill:#000000;fill-opacity:1;fill-rule:evenodd;stroke:#000000;stroke-width:0.625;stroke-linejoin:round;stroke-opacity:1"
         id="path7914-5-1"
         inkscape:connector-curvature="0" />
    </marker>
    <marker
       style="overflow:visible"
       id="marker3782"
       refX="0"
       refY="0"
       orient="auto"
       inkscape:stockid="Arrow2Mend"
       inkscape:isstock="true">
      <path
         transform="scale(-0.6)"
         d="M 8.7185878,4.0337352 -2.2072895,0.01601326 8.7185884,-4.0017078 c -1.7454984,2.3720609 -1.7354408,5.6174519 -6e-7,8.035443 z"
         style="fill:#000000;fill-opacity:1;fill-rule:evenodd;stroke:#000000;stroke-width:0.625;stroke-linejoin:round;stroke-opacity:1"
         id="path3780"
         inkscape:connector-curvature="0" />
    </marker>
    <marker
       style="overflow:visible"
       id="marker1748"
       refX="0"
       refY="0"
       orient="auto"
       inkscape:stockid="Arrow2Mend"
       inkscape:isstock="true">
      <path
         transform="scale(-0.6)"
         d="M 8.7185878,4.0337352 -2.2072895,0.01601326 8.7185884,-4.0017078 c -1.7454984,2.3720609 -1.7354408,5.6174519 -6e-7,8.035443 z"
         style="fill:#000000;fill-opacity:1;fill-rule:evenodd;stroke:#000000;stroke-width:0.625;stroke-linejoin:round;stroke-opacity:1"
         id="path1746"
         inkscape:connector-curvature="0" />
    </marker>
    <marker
       style="overflow:visible"
       id="Arrow2Mend-0"
       refX="0"
       refY="0"
       orient="auto"
       inkscape:stockid="Arrow2Mend"
       inkscape:isstock="true">
      <path
         transform="scale(-0.6)"
         d="M 8.7185878,4.0337352 -2.2072895,0.01601326 8.7185884,-4.0017078 c -1.7454984,2.3720609 -1.7354408,5.6174519 -6e-7,8.035443 z"
         style="fill:#000000;fill-opacity:1;fill-rule:evenodd;stroke:#000000;stroke-width:0.625;stroke-linejoin:round;stroke-opacity:1"
         id="path1129-5"
         inkscape:connector-curvature="0" />
    </marker>
    <marker
       style="overflow:visible"
       id="marker41776-0"
       refX="0"
       refY="0"
       orient="auto"
       inkscape:stockid="Arrow2Mend"
       inkscape:isstock="true">
      <path
         transform="scale(-0.6)"
         d="M 8.7185878,4.0337352 -2.2072895,0.01601326 8.7185884,-4.0017078 c -1.7454984,2.3720609 -1.7354408,5.6174519 -6e-7,8.035443 z"
         style="fill:#000000;fill-opacity:1;fill-rule:evenodd;stroke:#000000;stroke-width:0.625;stroke-linejoin:round;stroke-opacity:1"
         id="path41774-7"
         inkscape:connector-curvature="0" />
    </marker>
    <marker
       style="overflow:visible"
       id="Arrow2Mend-0-2"
       refX="0"
       refY="0"
       orient="auto"
       inkscape:stockid="Arrow2Mend"
       inkscape:isstock="true">
      <path
         transform="scale(-0.6)"
         d="M 8.7185878,4.0337352 -2.2072895,0.01601326 8.7185884,-4.0017078 c -1.7454984,2.3720609 -1.7354408,5.6174519 -6e-7,8.035443 z"
         style="fill:#000000;fill-opacity:1;fill-rule:evenodd;stroke:#000000;stroke-width:0.625;stroke-linejoin:round;stroke-opacity:1"
         id="path1129-5-3"
         inkscape:connector-curvature="0" />
    </marker>
  </defs>
  <g
     inkscape:label="Layer 1"
     inkscape:groupmode="layer"
     id="layer1"
     transform="translate(266.8218,96.619961)">
    <g
       id="g9036"
       transform="matrix(0.91122267,0,0,0.91122267,-232.31605,-17.061612)">
      <rect
         style="fill:#6e368c;fill-opacity:0.5;stroke:#000000;stroke-width:0.290818;stroke-linejoin:bevel;stroke-miterlimit:4;stroke-dasharray:none;stroke-opacity:1"
         id="rect847"
         width="37.859425"
         height="16.269053"
         x="25.853716"
         y="-87.16404"
         ry="3.3495104" />
      <text
         xml:space="preserve"
         style="font-style:normal;font-weight:normal;font-size:3.72698px;line-height:1.25;font-family:sans-serif;fill:#000000;fill-opacity:1;stroke:none;stroke-width:0.726461;stroke-miterlimit:4;stroke-dasharray:none"
         x="44.686977"
         y="-82.681877"
         id="text896"><tspan
           sodipodi:role="line"
           x="44.686977"
           y="-82.681877"
           style="font-weight:bold;font-size:3.72698px;text-align:center;text-anchor:middle;stroke-width:0.726461;stroke-miterlimit:4;stroke-dasharray:none"
           id="tspan898">Create</tspan><tspan
           sodipodi:role="line"
           x="44.686977"
           y="-78.023155"
           style="font-weight:bold;font-size:3.72698px;text-align:center;text-anchor:middle;stroke-width:0.726461;stroke-miterlimit:4;stroke-dasharray:none"
           id="tspan3780">Knowledge</tspan><tspan
           sodipodi:role="line"
           x="44.686977"
           y="-73.364426"
           style="font-weight:bold;font-size:3.72698px;text-align:center;text-anchor:middle;stroke-width:0.726461;stroke-miterlimit:4;stroke-dasharray:none"
           id="tspan3782">Graph</tspan></text>
      <rect
         style="fill:#6e368c;fill-opacity:0.5;stroke:#000000;stroke-width:0.290818;stroke-linejoin:bevel;stroke-miterlimit:4;stroke-dasharray:none;stroke-opacity:1"
         id="rect847-5"
         width="37.859425"
         height="16.269053"
         x="25.853716"
         y="181.92162"
         ry="3.3495104" />
      <text
         xml:space="preserve"
         style="font-style:normal;font-weight:normal;font-size:3.72698px;line-height:1.25;font-family:sans-serif;fill:#000000;fill-opacity:1;stroke:none;stroke-width:0.726461;stroke-miterlimit:4;stroke-dasharray:none"
         x="44.890797"
         y="189.11075"
         id="text896-9"><tspan
           sodipodi:role="line"
           x="44.890797"
           y="189.11075"
           style="font-weight:bold;font-size:3.72698px;text-align:center;text-anchor:middle;stroke-width:0.726461;stroke-miterlimit:4;stroke-dasharray:none"
           id="tspan944">Data Processing</tspan><tspan
           sodipodi:role="line"
           x="44.890797"
           y="193.76947"
           style="font-weight:bold;font-size:3.72698px;text-align:center;text-anchor:middle;stroke-width:0.726461;stroke-miterlimit:4;stroke-dasharray:none"
           id="tspan946">for Visualisation</tspan></text>
      <rect
         style="fill:#6e368c;fill-opacity:0.5;stroke:#000000;stroke-width:0.290818;stroke-linejoin:bevel;stroke-miterlimit:4;stroke-dasharray:none;stroke-opacity:1"
         id="rect847-3"
         width="37.858765"
         height="16.269053"
         x="25.854046"
         y="32.321121"
         ry="3.3495104" />
      <text
         xml:space="preserve"
         style="font-style:normal;font-weight:normal;font-size:3.72697px;line-height:1.25;font-family:sans-serif;fill:#000000;fill-opacity:1;stroke:none;stroke-width:0.726461;stroke-miterlimit:4;stroke-dasharray:none"
         x="44.757042"
         y="36.837868"
         id="text896-4"><tspan
           sodipodi:role="line"
           x="44.757042"
           y="36.837868"
           style="font-weight:bold;font-size:3.72697px;text-align:center;text-anchor:middle;stroke-width:0.726461;stroke-miterlimit:4;stroke-dasharray:none"
           id="tspan1132">Calculate </tspan><tspan
           sodipodi:role="line"
           x="44.757042"
           y="41.496582"
           style="font-weight:bold;font-size:3.72697px;text-align:center;text-anchor:middle;stroke-width:0.726461;stroke-miterlimit:4;stroke-dasharray:none"
           id="tspan1138">Flood Depth</tspan><tspan
           sodipodi:role="line"
           x="44.757042"
           y="46.155293"
           style="font-weight:bold;font-size:3.72697px;text-align:center;text-anchor:middle;stroke-width:0.726461;stroke-miterlimit:4;stroke-dasharray:none"
           id="tspan6798">for Assets</tspan></text>
      <rect
         style="fill:#6e368c;fill-opacity:0.5;stroke:#000000;stroke-width:0.290818;stroke-linejoin:bevel;stroke-miterlimit:4;stroke-dasharray:none;stroke-opacity:1"
         id="rect847-6"
         width="37.859425"
         height="16.269053"
         x="25.853716"
         y="61.893463"
         ry="3.3495104" />
      <text
         xml:space="preserve"
         style="font-style:normal;font-weight:normal;font-size:3.72697px;line-height:1.25;font-family:sans-serif;fill:#000000;fill-opacity:1;stroke:none;stroke-width:0.726461;stroke-miterlimit:4;stroke-dasharray:none"
         x="44.765228"
         y="71.058914"
         id="text896-4-3"><tspan
           sodipodi:role="line"
           x="44.765228"
           y="71.058914"
           style="font-weight:bold;font-size:3.72697px;text-align:center;text-anchor:middle;stroke-width:0.726461;stroke-miterlimit:4;stroke-dasharray:none"
           id="tspan6211">Data Processing</tspan></text>
      <rect
         style="fill:#6e368c;fill-opacity:0.5;stroke:#000000;stroke-width:0.290818;stroke-linejoin:bevel;stroke-miterlimit:4;stroke-dasharray:none;stroke-opacity:1"
         id="rect847-2"
         width="37.859425"
         height="16.269053"
         x="25.853716"
         y="91.745789"
         ry="3.3495104" />
      <text
         xml:space="preserve"
         style="font-style:normal;font-weight:normal;font-size:3.72697px;line-height:1.25;font-family:sans-serif;fill:#000000;fill-opacity:1;stroke:none;stroke-width:0.726461;stroke-miterlimit:4;stroke-dasharray:none"
         x="45.308441"
         y="96.609207"
         id="text896-4-3-3"><tspan
           sodipodi:role="line"
           x="45.308441"
           y="96.609207"
           style="font-weight:bold;font-size:3.72697px;text-align:center;text-anchor:middle;stroke-width:0.726461;stroke-miterlimit:4;stroke-dasharray:none"
           id="tspan898-20-2-1">Resolve</tspan><tspan
           sodipodi:role="line"
           x="45.308441"
           y="101.26792"
           style="font-weight:bold;font-size:3.72697px;text-align:center;text-anchor:middle;stroke-width:0.726461;stroke-miterlimit:4;stroke-dasharray:none"
           id="tspan1024">Information </tspan><tspan
           sodipodi:role="line"
           x="45.308441"
           y="105.92664"
           style="font-weight:bold;font-size:3.72697px;text-align:center;text-anchor:middle;stroke-width:0.726461;stroke-miterlimit:4;stroke-dasharray:none"
           id="tspan10446">Cascade</tspan></text>
      <rect
         style="fill:#6e368c;fill-opacity:0.5;stroke:#000000;stroke-width:0.290818;stroke-linejoin:bevel;stroke-miterlimit:4;stroke-dasharray:none;stroke-opacity:1"
         id="rect847-9"
         width="37.859425"
         height="16.269053"
         x="25.853716"
         y="122.15056"
         ry="3.3495104" />
      <text
         xml:space="preserve"
         style="font-style:normal;font-weight:normal;font-size:3.72697px;line-height:1.25;font-family:sans-serif;fill:#000000;fill-opacity:1;stroke:none;stroke-width:0.726461;stroke-miterlimit:4;stroke-dasharray:none"
         x="44.765228"
         y="131.31602"
         id="text896-4-3-32"><tspan
           sodipodi:role="line"
           x="44.765228"
           y="131.31602"
           style="font-weight:bold;font-size:3.72697px;text-align:center;text-anchor:middle;stroke-width:0.726461;stroke-miterlimit:4;stroke-dasharray:none"
           id="tspan22171">Data Processing</tspan></text>
      <rect
         style="fill:#6e368c;fill-opacity:0.5;stroke:#000000;stroke-width:0.290818;stroke-linejoin:bevel;stroke-miterlimit:4;stroke-dasharray:none;stroke-opacity:1"
         id="rect847-36"
         width="37.859425"
         height="16.269053"
         x="25.853716"
         y="151.96806"
         ry="3.3495104" />
      <text
         xml:space="preserve"
         style="font-style:normal;font-weight:normal;font-size:3.72697px;line-height:1.25;font-family:sans-serif;fill:#000000;fill-opacity:1;stroke:none;stroke-width:0.726461;stroke-miterlimit:4;stroke-dasharray:none"
         x="45.308441"
         y="156.83148"
         id="text896-4-3-3-0"><tspan
           sodipodi:role="line"
           x="45.308441"
           y="156.83148"
           style="font-weight:bold;font-size:3.72697px;text-align:center;text-anchor:middle;stroke-width:0.726461;stroke-miterlimit:4;stroke-dasharray:none"
           id="tspan898-20-2-1-1">Resolve</tspan><tspan
           sodipodi:role="line"
           x="45.308441"
           y="161.49019"
           style="font-weight:bold;font-size:3.72697px;text-align:center;text-anchor:middle;stroke-width:0.726461;stroke-miterlimit:4;stroke-dasharray:none"
           id="tspan1024-6">Information </tspan><tspan
           sodipodi:role="line"
           x="45.308441"
           y="166.14891"
           style="font-weight:bold;font-size:3.72697px;text-align:center;text-anchor:middle;stroke-width:0.726461;stroke-miterlimit:4;stroke-dasharray:none"
           id="tspan8218">Cascade</tspan></text>
      <path
         style="fill:none;stroke:#000000;stroke-width:0.290817;stroke-linecap:butt;stroke-linejoin:miter;stroke-miterlimit:4;stroke-dasharray:none;stroke-opacity:1;marker-end:url(#marker35743)"
         d="m 44.776447,-70.969315 v 12.267953"
         id="path1100"
         inkscape:connector-curvature="0" />
      <path
         style="fill:none;stroke:#000000;stroke-width:0.290818;stroke-linecap:butt;stroke-linejoin:miter;stroke-miterlimit:4;stroke-dasharray:none;stroke-opacity:1;marker-end:url(#marker35743)"
         d="M 44.776448,48.487293 V 60.542122"
         id="path1100-2"
         inkscape:connector-curvature="0" />
      <path
         style="fill:none;stroke:#000000;stroke-width:0.290819;stroke-linecap:butt;stroke-linejoin:miter;stroke-miterlimit:4;stroke-dasharray:none;stroke-opacity:1;marker-end:url(#marker35743)"
         d="M 44.776446,108.10769 V 120.7838"
         id="path3733"
         inkscape:connector-curvature="0" />
      <path
         style="fill:none;stroke:#000000;stroke-width:0.290818;stroke-linecap:butt;stroke-linejoin:miter;stroke-miterlimit:4;stroke-dasharray:none;stroke-opacity:1;marker-end:url(#marker35743)"
         d="m 44.776447,168.17028 v 12.38918"
         id="path4813"
         inkscape:connector-curvature="0" />
      <rect
         style="fill:none;fill-opacity:1;stroke:#000000;stroke-width:0.290818;stroke-linejoin:bevel;stroke-miterlimit:4;stroke-dasharray:none;stroke-opacity:1"
         id="rect847-5-4"
         width="37.859425"
         height="16.269053"
         x="25.853716"
         y="218.35416"
         ry="3.3495104" />
      <text
         xml:space="preserve"
         style="font-style:normal;font-weight:normal;font-size:3.72698px;line-height:1.25;font-family:sans-serif;fill:#000000;fill-opacity:1;stroke:none;stroke-width:0.726461;stroke-miterlimit:4;stroke-dasharray:none"
         x="44.908085"
         y="227.87265"
         id="text896-9-0"><tspan
           sodipodi:role="line"
           x="44.908085"
           y="227.87265"
           style="font-weight:bold;font-size:3.72698px;text-align:center;text-anchor:middle;stroke-width:0.726461;stroke-miterlimit:4;stroke-dasharray:none"
           id="tspan946-8">Visualisation</tspan></text>
      <path
         style="fill:none;stroke:#000000;stroke-width:0.290819;stroke-linecap:butt;stroke-linejoin:miter;stroke-miterlimit:4;stroke-dasharray:0.581636, 0.290819;stroke-dashoffset:0;stroke-opacity:1;marker-end:url(#marker35743)"
         d="m 44.776446,198.22376 v 18.7642"
         id="path4813-8"
         inkscape:connector-curvature="0"
         sodipodi:nodetypes="cc" />
      <path
         style="fill:none;stroke:#000000;stroke-width:0.290818;stroke-linecap:butt;stroke-linejoin:miter;stroke-miterlimit:4;stroke-dasharray:none;stroke-opacity:1;marker-end:url(#marker35743)"
         d="M 63.795732,-78.953986 H 110.42309 V 190.50858 H 65.053555"
         id="path5479"
         inkscape:connector-curvature="0"
         sodipodi:nodetypes="cccc" />
      <path
         style="fill:none;stroke:#000000;stroke-width:0.290818;stroke-linecap:butt;stroke-linejoin:miter;stroke-miterlimit:4;stroke-dasharray:none;stroke-dashoffset:0;stroke-opacity:1;marker-end:url(#marker35743)"
         d="M 44.833284,173.83426 H -37.722114 V 25.515946 h 81.143749"
         id="path5479-5"
         inkscape:connector-curvature="0"
         sodipodi:nodetypes="cccc" />
      <rect
         style="fill:#009ee3;fill-opacity:0.25;stroke:#000000;stroke-width:0.290818;stroke-linejoin:bevel;stroke-miterlimit:4;stroke-dasharray:none;stroke-opacity:1"
         id="rect847-8-4"
         width="37.859425"
         height="16.269053"
         x="-30.129482"
         y="61.893188"
         ry="3.3495104" />
      <text
         xml:space="preserve"
         style="font-style:normal;font-weight:normal;font-size:3.72698px;line-height:1.25;font-family:sans-serif;fill:#000000;fill-opacity:1;stroke:none;stroke-width:0.726461;stroke-miterlimit:4;stroke-dasharray:none"
         x="-10.674756"
         y="66.752953"
         id="text896-8-0"><tspan
           sodipodi:role="line"
           x="-10.674757"
           y="66.752953"
           style="font-weight:bold;font-size:3.72698px;text-align:center;text-anchor:middle;stroke-width:0.726461;stroke-miterlimit:4;stroke-dasharray:none"
           id="tspan898-9-3">Individual Asset </tspan><tspan
           sodipodi:role="line"
           x="-10.674756"
           y="71.411674"
           style="font-weight:bold;font-size:3.72698px;text-align:center;text-anchor:middle;stroke-width:0.726461;stroke-miterlimit:4;stroke-dasharray:none"
           id="tspan6553-4">Failure Models</tspan><tspan
           sodipodi:role="line"
           x="-10.674756"
           y="76.070404"
           style="font-weight:bold;font-size:3.72698px;text-align:center;text-anchor:middle;stroke-width:0.726461;stroke-miterlimit:4;stroke-dasharray:none"
           id="tspan11531">on DAFNI</tspan></text>
      <rect
         style="fill:#009ee3;fill-opacity:0.25;stroke:#000000;stroke-width:0.290818;stroke-linejoin:bevel;stroke-miterlimit:4;stroke-dasharray:none;stroke-opacity:1"
         id="rect847-8-4-4"
         width="37.859486"
         height="16.269054"
         x="-30.129513"
         y="122.1503"
         ry="3.3495104" />
      <text
         xml:space="preserve"
         style="font-style:normal;font-weight:normal;font-size:3.72697px;line-height:1.25;font-family:sans-serif;fill:#000000;fill-opacity:1;stroke:none;stroke-width:0.726461;stroke-miterlimit:4;stroke-dasharray:none"
         x="-11.248906"
         y="127.01007"
         id="text896-8-0-4"><tspan
           sodipodi:role="line"
           x="-11.248907"
           y="127.01007"
           style="font-weight:bold;font-size:3.72697px;text-align:center;text-anchor:middle;stroke-width:0.726461;stroke-miterlimit:4;stroke-dasharray:none"
           id="tspan898-9-3-5">System-Wide</tspan><tspan
           sodipodi:role="line"
           x="-11.248906"
           y="131.66878"
           style="font-weight:bold;font-size:3.72697px;text-align:center;text-anchor:middle;stroke-width:0.726461;stroke-miterlimit:4;stroke-dasharray:none"
           id="tspan6553-4-7">Impact Models</tspan><tspan
           sodipodi:role="line"
           x="-11.248905"
           y="136.3275"
           style="font-weight:bold;font-size:3.72697px;text-align:center;text-anchor:middle;stroke-width:0.726461;stroke-miterlimit:4;stroke-dasharray:none"
           id="tspan14891">on DAFNI</tspan></text>
      <rect
         style="fill:#009ee3;fill-opacity:0.25;stroke:#000000;stroke-width:0.290818;stroke-linejoin:bevel;stroke-miterlimit:4;stroke-dasharray:none;stroke-opacity:1"
         id="rect847-8-6"
         width="37.859425"
         height="16.269053"
         x="-30.129482"
         y="-57.317356"
         ry="3.3495104" />
      <text
         xml:space="preserve"
         style="font-style:normal;font-weight:normal;font-size:3.72698px;line-height:1.25;font-family:sans-serif;fill:#000000;fill-opacity:1;stroke:none;stroke-width:0.726461;stroke-miterlimit:4;stroke-dasharray:none"
         x="-11.075116"
         y="-50.18919"
         id="text896-8-4"><tspan
           sodipodi:role="line"
           x="-11.075116"
           y="-50.18919"
           style="font-weight:bold;font-size:3.72698px;text-align:center;text-anchor:middle;stroke-width:0.726461;stroke-miterlimit:4;stroke-dasharray:none"
           id="tspan898-9-8">Asset Data</tspan><tspan
           sodipodi:role="line"
           x="-11.075116"
           y="-45.530464"
           style="font-weight:bold;font-size:3.72698px;text-align:center;text-anchor:middle;stroke-width:0.726461;stroke-miterlimit:4;stroke-dasharray:none"
           id="tspan6553-8">on DAFNI</tspan></text>
      <path
         style="fill:none;stroke:#000000;stroke-width:0.290818;stroke-linecap:butt;stroke-linejoin:miter;stroke-miterlimit:4;stroke-dasharray:none;stroke-opacity:1;marker-end:url(#marker35743)"
         d="M 7.7857165,-49.175928 H 24.501466"
         id="path1100-0"
         inkscape:connector-curvature="0" />
      <rect
         style="fill:#6e368c;fill-opacity:0.5;stroke:#000000;stroke-width:0.290818;stroke-linejoin:bevel;stroke-miterlimit:4;stroke-dasharray:none;stroke-opacity:1"
         id="rect847-3-9"
         width="37.859425"
         height="16.269053"
         x="25.853716"
         y="-27.592451"
         ry="3.3495104" />
      <text
         xml:space="preserve"
         style="font-style:normal;font-weight:normal;font-size:3.72697px;line-height:1.25;font-family:sans-serif;fill:#000000;fill-opacity:1;stroke:none;stroke-width:0.726461;stroke-miterlimit:4;stroke-dasharray:none"
         x="44.765232"
         y="-20.398758"
         id="text896-4-1"><tspan
           sodipodi:role="line"
           id="tspan894-2-5"
           x="44.765232"
           y="-20.398758"
           style="font-weight:bold;font-size:3.72697px;text-align:center;text-anchor:middle;stroke-width:0.726461;stroke-miterlimit:4;stroke-dasharray:none">Load Flood</tspan><tspan
           sodipodi:role="line"
           x="44.765232"
           y="-15.740046"
           style="font-weight:bold;font-size:3.72697px;text-align:center;text-anchor:middle;stroke-width:0.726461;stroke-miterlimit:4;stroke-dasharray:none"
           id="tspan898-20-0">Data</tspan></text>
      <path
         style="fill:none;stroke:#000000;stroke-width:0.290818;stroke-linecap:butt;stroke-linejoin:miter;stroke-miterlimit:4;stroke-dasharray:none;stroke-opacity:1;marker-end:url(#marker35743)"
         d="M 44.776445,18.676583 V 30.957146"
         id="path1100-2-8"
         inkscape:connector-curvature="0" />
      <rect
         style="fill:#009ee3;fill-opacity:0.25;stroke:#000000;stroke-width:0.290818;stroke-linejoin:bevel;stroke-miterlimit:4;stroke-dasharray:none;stroke-opacity:1"
         id="rect847-8-5"
         width="37.859425"
         height="16.269053"
         x="-30.129482"
         y="-27.592451"
         ry="3.3495104" />
      <text
         xml:space="preserve"
         style="font-style:normal;font-weight:normal;font-size:3.72698px;line-height:1.25;font-family:sans-serif;fill:#000000;fill-opacity:1;stroke:none;stroke-width:0.726461;stroke-miterlimit:4;stroke-dasharray:none"
         x="-11.226163"
         y="-20.403313"
         id="text896-8-8"><tspan
           sodipodi:role="line"
           x="-11.226163"
           y="-20.403313"
           style="font-weight:bold;font-size:3.72698px;text-align:center;text-anchor:middle;stroke-width:0.726461;stroke-miterlimit:4;stroke-dasharray:none"
           id="tspan898-9-6">Flood Data</tspan><tspan
           sodipodi:role="line"
           x="-11.226163"
           y="-15.744588"
           style="font-weight:bold;font-size:3.72698px;text-align:center;text-anchor:middle;stroke-width:0.726461;stroke-miterlimit:4;stroke-dasharray:none"
           id="tspan6553-1">on DAFNI</tspan></text>
      <path
         style="fill:none;stroke:#000000;stroke-width:0.290818;stroke-linecap:butt;stroke-linejoin:miter;stroke-miterlimit:4;stroke-dasharray:none;stroke-opacity:1;marker-end:url(#marker35743)"
         d="M 7.59592,-19.451025 H 24.517219"
         id="path1100-0-0-2"
         inkscape:connector-curvature="0" />
      <path
         style="fill:none;stroke:#000000;stroke-width:0.290818;stroke-linecap:butt;stroke-linejoin:miter;stroke-miterlimit:4;stroke-dasharray:none;stroke-opacity:1;marker-end:url(#marker35743)"
         d="M 25.89576,70.021009 H 9.0861211"
         id="path7912-0"
         inkscape:connector-curvature="0" />
      <path
         style="fill:none;stroke:#000000;stroke-width:0.290818;stroke-linecap:butt;stroke-linejoin:miter;stroke-miterlimit:4;stroke-dasharray:none;stroke-opacity:1;marker-end:url(#marker35743)"
         d="M 25.919512,130.27812 H 9.0972243"
         id="path7912-0-6"
         inkscape:connector-curvature="0" />
      <path
         style="fill:none;stroke:#000000;stroke-width:0.290818;stroke-linecap:butt;stroke-linejoin:miter;stroke-miterlimit:4;stroke-dasharray:1.16327, 1.16327;stroke-dashoffset:0;stroke-opacity:1;marker-end:url(#marker35743)"
         d="M 63.783851,40.462389 H 109.05985"
         id="path7912-42"
         inkscape:connector-curvature="0"
         sodipodi:nodetypes="cc" />
      <path
         style="fill:none;stroke:#000000;stroke-width:0.290818;stroke-linecap:butt;stroke-linejoin:miter;stroke-miterlimit:4;stroke-dasharray:1.16327, 1.16327;stroke-dashoffset:0;stroke-opacity:1;marker-end:url(#marker35743)"
         d="M 63.738482,99.887289 H 109.06827"
         id="path11671"
         inkscape:connector-curvature="0"
         sodipodi:nodetypes="cc" />
      <path
         style="fill:none;stroke:#000000;stroke-width:0.290818;stroke-linecap:butt;stroke-linejoin:miter;stroke-miterlimit:4;stroke-dasharray:1.16327, 1.16327;stroke-dashoffset:0;stroke-opacity:1;marker-end:url(#marker35743)"
         d="M 110.34647,70.021009 H 65.076916"
         id="path11673"
         inkscape:connector-curvature="0"
         sodipodi:nodetypes="cc" />
      <path
         style="fill:none;stroke:#000000;stroke-width:0.290818;stroke-linecap:butt;stroke-linejoin:miter;stroke-miterlimit:4;stroke-dasharray:1.16327, 1.16327;stroke-dashoffset:0;stroke-opacity:1;marker-end:url(#marker35743)"
         d="M 110.42755,130.27812 H 65.0619"
         id="path13089"
         inkscape:connector-curvature="0"
         sodipodi:nodetypes="cc" />
      <path
         style="fill:none;stroke:#000000;stroke-width:0.290818;stroke-linecap:butt;stroke-linejoin:miter;stroke-miterlimit:4;stroke-dasharray:1.16327, 1.16327;stroke-dashoffset:0;stroke-opacity:1;marker-end:url(#marker35743)"
         d="M 63.769996,160.10957 H 109.05984"
         id="path13819"
         inkscape:connector-curvature="0"
         sodipodi:nodetypes="cc" />
      <text
         xml:space="preserve"
         style="font-style:normal;font-weight:normal;font-size:3.72697px;line-height:1.25;font-family:sans-serif;fill:#000000;fill-opacity:1;stroke:none;stroke-width:0.726461;stroke-miterlimit:4;stroke-dasharray:none"
         x="-11.162469"
         y="170.72757"
         id="text896-8-0-1"><tspan
           sodipodi:role="line"
           x="-11.162469"
           y="170.72757"
           style="font-weight:bold;font-size:3.72697px;text-align:center;text-anchor:middle;stroke-width:0.726461;stroke-miterlimit:4;stroke-dasharray:none"
           id="tspan6553-4-8">TIME LOOP</tspan></text>
      <text
         xml:space="preserve"
         style="font-style:normal;font-weight:normal;font-size:3.72697px;line-height:1.25;font-family:sans-serif;fill:#000000;fill-opacity:1;stroke:none;stroke-width:0.726461;stroke-miterlimit:4;stroke-dasharray:none"
         x="87.502357"
         y="27.765335"
         id="text896-8-0-1-7"><tspan
           sodipodi:role="line"
           x="87.502357"
           y="27.765335"
           style="font-weight:bold;font-size:3.72697px;text-align:center;text-anchor:middle;stroke-width:0.726461;stroke-miterlimit:4;stroke-dasharray:none"
           id="tspan6553-4-8-8">KNOWLEDGE</tspan><tspan
           sodipodi:role="line"
           x="87.502357"
           y="32.424049"
           style="font-weight:bold;font-size:3.72697px;text-align:center;text-anchor:middle;stroke-width:0.726461;stroke-miterlimit:4;stroke-dasharray:none"
           id="tspan3798">GRAPH</tspan><tspan
           sodipodi:role="line"
           x="87.502357"
           y="37.08276"
           style="font-weight:bold;font-size:3.72697px;text-align:center;text-anchor:middle;stroke-width:0.726461;stroke-miterlimit:4;stroke-dasharray:none"
           id="tspan3796">INTERACTIONS</tspan></text>
      <rect
         style="fill:#6e368c;fill-opacity:0.5;stroke:#000000;stroke-width:0.290818;stroke-linejoin:bevel;stroke-miterlimit:4;stroke-dasharray:none;stroke-opacity:1"
         id="rect847-28"
         width="37.859425"
         height="16.269053"
         x="25.853716"
         y="-57.317356"
         ry="3.3495104" />
      <text
         xml:space="preserve"
         style="font-style:normal;font-weight:normal;font-size:3.72698px;line-height:1.25;font-family:sans-serif;fill:#000000;fill-opacity:1;stroke:none;stroke-width:0.726461;stroke-miterlimit:4;stroke-dasharray:none"
         x="44.651493"
         y="-50.123672"
         id="text896-3"><tspan
           sodipodi:role="line"
           id="tspan894-0"
           x="44.651493"
           y="-50.123672"
           style="font-weight:bold;font-size:3.72698px;text-align:center;text-anchor:middle;stroke-width:0.726461;stroke-miterlimit:4;stroke-dasharray:none">Load Asset</tspan><tspan
           sodipodi:role="line"
           x="44.651493"
           y="-45.464947"
           style="font-weight:bold;font-size:3.72698px;text-align:center;text-anchor:middle;stroke-width:0.726461;stroke-miterlimit:4;stroke-dasharray:none"
           id="tspan898-7">Data</tspan></text>
      <path
         style="fill:none;stroke:#000000;stroke-width:0.290818;stroke-linecap:butt;stroke-linejoin:miter;stroke-miterlimit:4;stroke-dasharray:none;stroke-opacity:1;marker-end:url(#marker35743)"
         d="m 44.776449,-41.103262 v 12.142916"
         id="path1100-4"
         inkscape:connector-curvature="0" />
      <path
         style="fill:none;stroke:#000000;stroke-width:0.290818;stroke-linecap:butt;stroke-linejoin:miter;stroke-miterlimit:4;stroke-dasharray:none;stroke-opacity:1;marker-end:url(#marker35743)"
         d="m -10.897876,78.023039 v 21.82576 l 35.400827,0.242501"
         id="path10422"
         sodipodi:nodetypes="ccc" />
      <path
         style="fill:none;stroke:#000000;stroke-width:0.290818;stroke-linecap:butt;stroke-linejoin:miter;stroke-miterlimit:4;stroke-dasharray:none;stroke-opacity:1;marker-end:url(#marker35743)"
         d="m -10.897876,138.37364 v 21.52634 l 35.405152,0.24249"
         id="path10422-9"
         sodipodi:nodetypes="ccc" />
      <rect
         style="fill:#6e368c;fill-opacity:0.5;stroke:#000000;stroke-width:0.290818;stroke-linejoin:bevel;stroke-miterlimit:4;stroke-dasharray:none;stroke-opacity:1"
         id="rect847-3-9-3"
         width="37.859425"
         height="16.269053"
         x="25.853716"
         y="2.474896"
         ry="3.3495104" />
      <text
         xml:space="preserve"
         style="font-style:normal;font-weight:normal;font-size:3.72697px;line-height:1.25;font-family:sans-serif;fill:#000000;fill-opacity:1;stroke:none;stroke-width:0.726461;stroke-miterlimit:4;stroke-dasharray:none"
         x="44.818005"
         y="11.993385"
         id="text896-4-1-0"><tspan
           sodipodi:role="line"
           x="44.818005"
           y="11.993385"
           style="font-weight:bold;font-size:3.72697px;text-align:center;text-anchor:middle;stroke-width:0.726461;stroke-miterlimit:4;stroke-dasharray:none"
           id="tspan898-20-0-4">Initialisation</tspan></text>
      <path
         style="fill:none;stroke:#000000;stroke-width:0.290818;stroke-linecap:butt;stroke-linejoin:miter;stroke-miterlimit:4;stroke-dasharray:none;stroke-opacity:1;marker-end:url(#marker35743)"
         d="M 44.776444,-11.25609 V 1.1114901"
         id="path1100-4-7"
         inkscape:connector-curvature="0" />
    </g>
  </g>
</svg>
