code,ID,final timestep,step size,description,title,Link
hipims_case_1000RP1h,52d33e87-0208-4411-82f1-8b092b753b20,93600,3600,"1 in 1000 years, 1-hour storm","1:1000 yr, 1 hr",https://facility.secure.dafni.rl.ac.uk/data/details?dataset_id=f7f1e108-d9fc-42b8-b168-17da54f4c560&version_id=52d33e87-0208-4411-82f1-8b092b753b20&metadata_id=5f8ab438-e255-4d59-a006-11e5d71adf23
hipims_case_100RP8h20u,192ee03a-98c1-410d-ac9b-e97556f44539,108000,3600,"1 in 100 years, 8-hour storm with 20% uplift","1:100 yr, 8 hr, 20% uplift",https://facility.secure.dafni.rl.ac.uk/data/details?dataset_id=f4fdc617-08fe-4a8d-be09-315c590cbb22&version_id=192ee03a-98c1-410d-ac9b-e97556f44539&metadata_id=433b2bfc-18f6-4caf-82b2-5d2bf35987eb
hipims_case_1000RP3h,881b46ab-fdf3-4e6f-8017-37104f66eb08,97200,3600,"1 in 1000 years, 3-hour storm","1:1000 yr, 3 hr",https://facility.secure.dafni.rl.ac.uk/data/details?dataset_id=e3653917-19ab-442d-8b8d-ca131a10a36d&version_id=881b46ab-fdf3-4e6f-8017-37104f66eb08&metadata_id=faf648e7-9f40-4e2a-a567-49b42da6e633
hipims_case_100RP8h,13df57f4-f815-459e-9ee3-63212c4d299d,108000,3600,"1 in 100 years, 8-hour storm","1:100 yr, 8 hr",https://facility.secure.dafni.rl.ac.uk/data/details?dataset_id=def84756-03f6-4aa1-8d84-8dab5997026b&version_id=13df57f4-f815-459e-9ee3-63212c4d299d&metadata_id=760e5c33-71f5-41bd-b5d6-6ba6595ea129
hipims_case_100RP8h35u,66f98f78-be4e-432f-9ab0-43ea6c85bb85,108000,3600,"1 in 100 years, 8-hour storm with 35% uplift","1:100 yr, 8 hr, 35% uplift",https://facility.secure.dafni.rl.ac.uk/data/details?dataset_id=db7c9d87-f64e-4c23-a172-383d34dea6f0&version_id=66f98f78-be4e-432f-9ab0-43ea6c85bb85&metadata_id=1d37d29d-f12a-4837-879b-6b8f8be61c27
hipims_case_100RP1h40u,ac79d7ec-1288-453b-b112-d91443b4fd0f,93600,3600,"1 in 100 years, 1-hour storm with 40% uplift","1:100 yr, 1 hr, 40% uplift",https://facility.secure.dafni.rl.ac.uk/data/details?dataset_id=c703b484-372b-4e75-8daa-8a0b7b38b48e&version_id=ac79d7ec-1288-453b-b112-d91443b4fd0f&metadata_id=56fe95be-091b-43b1-b400-f4bfd0e71453
hipims_case_100RP6h10u,7ae24a6f-462f-4c1c-af93-3345dab89058,108000,3600,"1 in 100 years, 6-hour storm with 10% uplift","1:100 yr, 6 hr, 10% uplift",https://facility.secure.dafni.rl.ac.uk/data/details?dataset_id=b66f202a-a821-4628-98c5-c98ed968b412&version_id=7ae24a6f-462f-4c1c-af93-3345dab89058&metadata_id=889a3ec9-430b-4868-be11-6069304a01e0
hipims_case_100RP8h10u,7b12255e-1f17-4a24-97c3-ac36f8027e46,108000,3600,"1 in 100 years, 8-hour storm with 10% uplift","1:100 yr, 8 hr, 10% uplift",https://facility.secure.dafni.rl.ac.uk/data/details?dataset_id=b2b9bb1f-aa1c-4661-a422-3e305c983150&version_id=7b12255e-1f17-4a24-97c3-ac36f8027e46&metadata_id=203a2afc-1b80-458c-a395-ae88d74b40d9
hipims_case_100RP1h15min,4fba6d51-af0f-4ac4-9ea3-c9670769e02f,35100,900,"1 in 100 years, 1 hour 15 minute storm","1:100 yr, 1 hr 15 min",https://facility.secure.dafni.rl.ac.uk/data/details?dataset_id=ac0e1d7c-4755-49c8-8911-a2308dfa1a46&version_id=4fba6d51-af0f-4ac4-9ea3-c9670769e02f&metadata_id=d9cde2b6-fe15-4c91-9a5f-21bf94139144
hipims_case_100RP8h45u,d3f5c433-cf62-4a34-a9f8-9bdb20ffb12b,108000,3600,"1 in 100 years, 8-hour storm with 45% uplift","1:100 yr, 8 hr, 45% uplift",https://facility.secure.dafni.rl.ac.uk/data/details?dataset_id=aa4e1259-925d-4347-a9fb-2f6d53c30a7a&version_id=d3f5c433-cf62-4a34-a9f8-9bdb20ffb12b&metadata_id=f4a00922-6b94-418b-90d5-0e1296455d3f
hipims_case_100RP3h,7409c608-1f02-4fd6-a30e-8e949f10fdc4,97200,3600,"1 in 100 years, 3-hour storm","1:100 yr, 3 hr",https://facility.secure.dafni.rl.ac.uk/data/details?dataset_id=99c8fc38-4b1b-4c65-ae78-7a18b0cf5c03&version_id=7409c608-1f02-4fd6-a30e-8e949f10fdc4&metadata_id=a613332f-1ccc-42cb-993c-59d76db6a6d5
hipims_case_100RP6h,4f0e9fb0-9b12-4b9e-966a-4ff9cc90aa97,108000,3600,"1 in 100 years, 6-hour storm","1:100 yr, 6 hr",https://facility.secure.dafni.rl.ac.uk/data/details?dataset_id=8c3fc68a-75e8-418a-9724-d70ffac212d2&version_id=4f0e9fb0-9b12-4b9e-966a-4ff9cc90aa97&metadata_id=83002617-bafd-4d1d-baac-12cd28cb77c6
hipims_case_100RP3h20u,3e96df20-620e-4836-9a73-aa91a7002be2,97200,3600,"1 in 100 years, 3-hour storm with 20% uplift","1:100 yr, 3 hr, 20% uplift",https://facility.secure.dafni.rl.ac.uk/data/details?dataset_id=7fe50ed3-34c6-407d-8915-204c5ae86ac9&version_id=3e96df20-620e-4836-9a73-aa91a7002be2&metadata_id=8297bd12-0532-4363-a9a9-cf175f628d1c
hipims_case_100RP3h10u,15d506dc-5229-44f1-89fc-c8a625b79e20,97200,3600,"1 in 100 years, 3-hour storm with 10% uplift","1:100 yr, 3 hr, 10% uplift",https://facility.secure.dafni.rl.ac.uk/data/details?dataset_id=7999c9d6-4f96-44f0-bd7e-574e17c9e20a&version_id=15d506dc-5229-44f1-89fc-c8a625b79e20&metadata_id=e22fb4ba-645d-42af-a867-941e7aaa5791
hipims_case_1000RP8h,63ba6bbf-d9b9-444d-b2fa-ffd63444ba2a,108000,3600,"1 in 1000 years, 8-hour storm","1:1000 yr, 8 hr",https://facility.secure.dafni.rl.ac.uk/data/details?dataset_id=74045e25-1e6e-4aa9-bca7-0e0155293602&version_id=63ba6bbf-d9b9-444d-b2fa-ffd63444ba2a&metadata_id=8e05e6a8-fea8-4803-95e4-aa009a60b658
hipims_case_1000RP6h,a867d695-8871-4b9a-b0fb-4e01a1e4299a,108000,3600,"1 in 1000 years, 6-hour storm","1:1000 yr, 6 hr",https://facility.secure.dafni.rl.ac.uk/data/details?dataset_id=65369419-a6c8-41bc-8826-a8a28afe1f74&version_id=a867d695-8871-4b9a-b0fb-4e01a1e4299a&metadata_id=40a213fb-5d39-4709-b25f-755bfaaaf08d
hipims_case_100RP6h37u,a730df5c-6260-4ef3-b228-7b157c93b6e6,108000,3600,"1 in 100 years, 6-hour storm with 37% uplift","1:100 yr, 6 hr, 37% uplift",https://facility.secure.dafni.rl.ac.uk/data/details?dataset_id=5bcd4277-469f-4941-9e79-4c0d161cad66&version_id=a730df5c-6260-4ef3-b228-7b157c93b6e6&metadata_id=2e2521f0-2c7e-469a-8dac-d88114dfe4d0
hipims_case_100RP3h25u,f0c7a20a-a2cc-4448-9f3b-2162b6c2f5ec,97200,3600,"1 in 100 years, 3-hour storm with 25% uplift","1:100 yr, 3 hr, 25% uplift",https://facility.secure.dafni.rl.ac.uk/data/details?dataset_id=58a2fa2e-a236-491e-b8c2-2879c11061c6&version_id=f0c7a20a-a2cc-4448-9f3b-2162b6c2f5ec&metadata_id=6a675dc4-bbd0-49ad-ad29-7e4d662fa4ec
hipims_case_100RP3h40u,6f8c26ec-69e4-45ae-ba7e-e893cb15aff5,97200,3600,"1 in 100 years, 3-hour storm with 40% uplift","1:100 yr, 3 hr, 40% uplift",https://facility.secure.dafni.rl.ac.uk/data/details?dataset_id=58193a45-ccfe-464a-a8eb-a9516ad04f42&version_id=6f8c26ec-69e4-45ae-ba7e-e893cb15aff5&metadata_id=49454d78-e990-43a3-bdae-d4decaea0dd0
hipims_case_100RP6h45u,6e27e6c4-706c-457b-91d2-207d987c70c6,108000,3600,"1 in 100 years, 6-hour storm with 45% uplift","1:100 yr, 6 hr, 45% uplift",https://facility.secure.dafni.rl.ac.uk/data/details?dataset_id=513c78f8-ffef-4c8a-8183-bed6d67f37c5&version_id=6e27e6c4-706c-457b-91d2-207d987c70c6&metadata_id=a263b1a5-6976-4ae1-9b80-045770ceb888
hipims_case_100RP6h20u,8aa220a4-3fe6-4e03-a737-b0e536242428,108000,3600,"1 in 100 years, 6-hour storm with 20% uplift","1:100 yr, 6 hr, 20% uplift",https://facility.secure.dafni.rl.ac.uk/data/details?dataset_id=4c26c576-d7d2-4ce9-a275-089d8f0669b3&version_id=8aa220a4-3fe6-4e03-a737-b0e536242428&metadata_id=a8be0dbd-7184-48c5-9cff-9298164addbd
hipims_case_100RP1h10u,f576d620-d7e5-4dde-909f-54a9da04ba58,93600,3600,"1 in 100 years, 1-hour storm with 10% upflit","1:100 yr, 1 hr, 10% uplift",https://facility.secure.dafni.rl.ac.uk/data/details?dataset_id=3b4ba459-ce65-4d2b-bdda-8e00170d7865&version_id=f576d620-d7e5-4dde-909f-54a9da04ba58&metadata_id=fb18db7a-6c1a-4334-9e16-008e0b08da3a
hipims_case_100RP1h,bc11c58a-1b25-4296-bce0-386bb1997e89,93600,3600,"1 in 100 years, 1-hour storm","1:100 yr, 1 hr",https://facility.secure.dafni.rl.ac.uk/data/details?dataset_id=1e733c2f-50c1-47d7-a4fc-6f5bf183c143&version_id=bc11c58a-1b25-4296-bce0-386bb1997e89&metadata_id=4d194bc6-43ce-4925-be44-6f99da39d17c
hipims_case_100RP1h20u,8324df7b-623e-406b-beac-41c6d40a81e2,93600,3600,"1 in 100 years, 1-hour storm with 20% uplift","1:100 yr, 1 hr with 20% uplift",https://facility.secure.dafni.rl.ac.uk/data/details?dataset_id=1934f19c-f725-4a00-893e-af092c173d2b&version_id=8324df7b-623e-406b-beac-41c6d40a81e2&metadata_id=a397d6a9-22e7-4794-b40b-27d44ce21f72
hipims_case_100RP6h25u,f351f6d4-e5c1-43a3-b046-0873345120af,108000,3600,"1 in 100 years, 6-hour storm with 25% uplift","1:100 yr, 6 hr with 25% uplift",https://facility.secure.dafni.rl.ac.uk/data/details?dataset_id=0357c4fa-10ee-4b36-bd80-14e5372761dd&version_id=f351f6d4-e5c1-43a3-b046-0873345120af&metadata_id=bb0435c5-ed17-465b-a35b-6af79f3036e7
