(module MountingHole:MountingHole_3.2mm_M3 locked (layer F.Cu) (tedit 5D57F21B)
  (descr "Mounting Hole 3.2mm, no annular, M3")
  (tags "mounting hole 3.2mm no annular m3")
  (attr virtual)
  (fp_text reference ‣ (at -3.7406 -0.3288) (layer F.SilkS)
    (effects (font (size 4 4) (thickness 0.3)))
  )
  (fp_text value MountingHole_3.2mm_M3 (at 0 4.2) (layer F.Fab) hide
    (effects (font (size 1 1) (thickness 0.15)))
  )
  (fp_circle (center 0 0) (end 3.45 0) (layer F.CrtYd) (width 0.05))
  (fp_circle (center 0 0) (end 3.2 0) (layer Cmts.User) (width 0.15))
  (fp_text user %R (at 0 0) (layer F.Fab) hide
    (effects (font (size 1 1) (thickness 0.15)))
  )
  (pad "" np_thru_hole circle (at 0 0) (size 3 3) (drill 3) (layers *.Cu *.Mask)
    (clearance 1.25))
)
