(export (version D)
  (design
    (source /home/edu/Proyectos/openZmeter/Hardware/DeviceV2_03/PCB_B/Front.sch)
    (date "vie 18 jun 2021 16:02:20 CEST")
    (tool "Eeschema 5.1.9+dfsg1-1~bpo10+1")
    (sheet (number 1) (name /) (tstamps /)
      (title_block
        (title)
        (company)
        (rev)
        (date)
        (source Front.sch)
        (comment (number 1) (value ""))
        (comment (number 2) (value ""))
        (comment (number 3) (value ""))
        (comment (number 4) (value "")))))
  (components
    (comp (ref BZ2)
      (value QMB-09B-05)
      (footprint Footprints:MLT-5030)
      (libsource (lib 3Phase-rescue) (part Buzzer-3Phase-rescue) (description ""))
      (sheetpath (names /) (tstamps /))
      (tstamp 628A53C3))
    (comp (ref J1)
      (value Conn_01x12_Female)
      (footprint Footprints:LCD_52.3x40.2)
      (libsource (lib Connector) (part Conn_01x12_Female) (description "Generic connector, single row, 01x12, script generated (kicad-library-utils/schlib/autogen/connector/)"))
      (sheetpath (names /) (tstamps /))
      (tstamp 608DA3B1))
    (comp (ref SW1)
      (value SW_Push-3Phase-rescue)
      (footprint Footprints:SW_Push_4.5x4.5mm_H8mm)
      (libsource (lib 3Phase-rescue) (part SW_Push-3Phase-rescue) (description ""))
      (sheetpath (names /) (tstamps /))
      (tstamp 5FE4F8B5))
    (comp (ref C8)
      (value "100nF 25v")
      (footprint Footprints:C_0603_1608Metric)
      (libsource (lib 3Phase-rescue) (part C_Small-3Phase-rescue) (description ""))
      (sheetpath (names /) (tstamps /))
      (tstamp 60DFD8CD))
    (comp (ref R1)
      (value 100k)
      (footprint Footprints:R_0603_1608Metric)
      (libsource (lib 3Phase-rescue) (part R-3Phase-rescue) (description ""))
      (sheetpath (names /) (tstamps /))
      (tstamp 5FE634D2))
    (comp (ref C10)
      (value "100nF 25v")
      (footprint Footprints:C_0603_1608Metric)
      (libsource (lib 3Phase-rescue) (part C_Small-3Phase-rescue) (description ""))
      (sheetpath (names /) (tstamps /))
      (tstamp 6097B2D2))
    (comp (ref C11)
      (value "100nF 25v")
      (footprint Footprints:C_0603_1608Metric)
      (libsource (lib 3Phase-rescue) (part C_Small-3Phase-rescue) (description ""))
      (sheetpath (names /) (tstamps /))
      (tstamp 6097C461))
    (comp (ref U7)
      (value MP2637)
      (footprint Footprints:QFN-24_4x4mm_P0.5mm)
      (libsource (lib Components) (part MP2637) (description ""))
      (sheetpath (names /) (tstamps /))
      (tstamp 60AE18C0))
    (comp (ref C22)
      (value "100nF 25v")
      (footprint Footprints:C_0603_1608Metric)
      (libsource (lib 3Phase-rescue) (part C_Small-3Phase-rescue) (description ""))
      (sheetpath (names /) (tstamps /))
      (tstamp 60B086C5))
    (comp (ref R21)
      (value 100k)
      (footprint Footprints:R_0603_1608Metric)
      (libsource (lib 3Phase-rescue) (part R-3Phase-rescue) (description ""))
      (sheetpath (names /) (tstamps /))
      (tstamp 60B25E51))
    (comp (ref R20)
      (value 100k)
      (footprint Footprints:R_0603_1608Metric)
      (libsource (lib 3Phase-rescue) (part R-3Phase-rescue) (description ""))
      (sheetpath (names /) (tstamps /))
      (tstamp 60B26586))
    (comp (ref R22)
      (value 100k)
      (footprint Footprints:R_0603_1608Metric)
      (libsource (lib 3Phase-rescue) (part R-3Phase-rescue) (description ""))
      (sheetpath (names /) (tstamps /))
      (tstamp 60B26D36))
    (comp (ref R23)
      (value 100k)
      (footprint Footprints:R_0603_1608Metric)
      (libsource (lib 3Phase-rescue) (part R-3Phase-rescue) (description ""))
      (sheetpath (names /) (tstamps /))
      (tstamp 60B27486))
    (comp (ref R28)
      (value 100k)
      (footprint Footprints:R_0603_1608Metric)
      (libsource (lib 3Phase-rescue) (part R-3Phase-rescue) (description ""))
      (sheetpath (names /) (tstamps /))
      (tstamp 60B8BC80))
    (comp (ref R27)
      (value 100k)
      (footprint Footprints:R_0603_1608Metric)
      (libsource (lib 3Phase-rescue) (part R-3Phase-rescue) (description ""))
      (sheetpath (names /) (tstamps /))
      (tstamp 60AEA5B0))
    (comp (ref R24)
      (value 100k)
      (footprint Footprints:R_0603_1608Metric)
      (libsource (lib 3Phase-rescue) (part R-3Phase-rescue) (description ""))
      (sheetpath (names /) (tstamps /))
      (tstamp 60C665B5))
    (comp (ref C23)
      (value "100nF 25v")
      (footprint Footprints:C_0603_1608Metric)
      (libsource (lib 3Phase-rescue) (part C_Small-3Phase-rescue) (description ""))
      (sheetpath (names /) (tstamps /))
      (tstamp 60C99C12))
    (comp (ref TH1)
      (value Thermistor_NTC-3Phase-rescue)
      (footprint Footprints:R_0603_1608Metric)
      (libsource (lib 3Phase-rescue) (part Thermistor_NTC-3Phase-rescue) (description ""))
      (sheetpath (names /) (tstamps /))
      (tstamp 61349593))
    (comp (ref R32)
      (value 100k)
      (footprint Footprints:R_0603_1608Metric)
      (libsource (lib 3Phase-rescue) (part R-3Phase-rescue) (description ""))
      (sheetpath (names /) (tstamps /))
      (tstamp 613636EA))
    (comp (ref BT2)
      (value "Battery clips")
      (footprint Footprints:18500_Clips)
      (libsource (lib Device) (part Battery_Cell) (description "Single-cell battery"))
      (sheetpath (names /) (tstamps /))
      (tstamp 61757E1B))
    (comp (ref C24)
      (value "100nF 25v")
      (footprint Footprints:C_0603_1608Metric)
      (libsource (lib 3Phase-rescue) (part C_Small-3Phase-rescue) (description ""))
      (sheetpath (names /) (tstamps /))
      (tstamp 617D4899))
    (comp (ref R29)
      (value 100k)
      (footprint Footprints:R_1206_3216Metric)
      (libsource (lib 3Phase-rescue) (part R-3Phase-rescue) (description ""))
      (sheetpath (names /) (tstamps /))
      (tstamp 617D5175))
    (comp (ref L3)
      (value L_Small)
      (footprint Footprints:MWSA0503S)
      (libsource (lib Device) (part L_Small) (description "Inductor, small symbol"))
      (sheetpath (names /) (tstamps /))
      (tstamp 6190555F))
    (comp (ref R31)
      (value 100k)
      (footprint Footprints:R_0603_1608Metric)
      (libsource (lib 3Phase-rescue) (part R-3Phase-rescue) (description ""))
      (sheetpath (names /) (tstamps /))
      (tstamp 6193955D))
    (comp (ref R30)
      (value 100k)
      (footprint Footprints:R_0603_1608Metric)
      (libsource (lib 3Phase-rescue) (part R-3Phase-rescue) (description ""))
      (sheetpath (names /) (tstamps /))
      (tstamp 61939C60))
    (comp (ref C25)
      (value "100nF 25v")
      (footprint Footprints:C_0805_2012Metric)
      (libsource (lib 3Phase-rescue) (part C_Small-3Phase-rescue) (description ""))
      (sheetpath (names /) (tstamps /))
      (tstamp 619F1E28))
    (comp (ref C26)
      (value "100nF 25v")
      (footprint Footprints:C_0805_2012Metric)
      (libsource (lib 3Phase-rescue) (part C_Small-3Phase-rescue) (description ""))
      (sheetpath (names /) (tstamps /))
      (tstamp 619F2314))
    (comp (ref C1)
      (value "100nF 25v")
      (footprint Footprints:C_0805_2012Metric)
      (libsource (lib 3Phase-rescue) (part C_Small-3Phase-rescue) (description ""))
      (sheetpath (names /) (tstamps /))
      (tstamp 61FC18F8))
    (comp (ref C2)
      (value "100nF 25v")
      (footprint Footprints:C_0805_2012Metric)
      (libsource (lib 3Phase-rescue) (part C_Small-3Phase-rescue) (description ""))
      (sheetpath (names /) (tstamps /))
      (tstamp 620655A1))
    (comp (ref BT1)
      (value "Battery clips")
      (footprint Footprints:18500_Clips)
      (libsource (lib Device) (part Battery_Cell) (description "Single-cell battery"))
      (sheetpath (names /) (tstamps /))
      (tstamp 60B6B247))
    (comp (ref D1)
      (value D_Small_ALT-3Phase-rescue)
      (footprint Footprints:D_SOD-323)
      (libsource (lib 3Phase-rescue) (part D_Small_ALT-3Phase-rescue) (description ""))
      (sheetpath (names /) (tstamps /))
      (tstamp 60DE4CBD))
    (comp (ref R2)
      (value 100k)
      (footprint Footprints:R_0603_1608Metric)
      (libsource (lib 3Phase-rescue) (part R-3Phase-rescue) (description ""))
      (sheetpath (names /) (tstamps /))
      (tstamp 60E1BA2C))
    (comp (ref J2)
      (value Conn_01x06_Male)
      (footprint Footprints:PinHeader_1x16_P2.54mm_Vertical)
      (libsource (lib Connector) (part Conn_01x16_Male) (description "Generic connector, single row, 01x16, script generated (kicad-library-utils/schlib/autogen/connector/)"))
      (sheetpath (names /) (tstamps /))
      (tstamp 60ADD37E))
    (comp (ref R17)
      (value 100k)
      (footprint Footprints:R_0603_1608Metric)
      (libsource (lib 3Phase-rescue) (part R-3Phase-rescue) (description ""))
      (sheetpath (names /) (tstamps /))
      (tstamp 60B233AB))
    (comp (ref Q1)
      (value SSM6N7002KFU)
      (footprint Footprints:SOT-363_SC-70-6)
      (libsource (lib Device) (part Q_DUAL_NMOS_S1G1D2S2G2D1) (description "Dual NMOS transistor, 6 pin package"))
      (sheetpath (names /) (tstamps /))
      (tstamp 6121BB6D)))
  (libparts
    (libpart (lib 3Phase-rescue) (part Buzzer-3Phase-rescue)
      (footprints
        (fp *Buzzer*))
      (fields
        (field (name Reference) BZ)
        (field (name Value) Buzzer-3Phase-rescue))
      (pins
        (pin (num 1) (name -) (type passive))
        (pin (num 2) (name +) (type passive))))
    (libpart (lib 3Phase-rescue) (part C_Small-3Phase-rescue)
      (footprints
        (fp C?)
        (fp C_????_*)
        (fp C_????)
        (fp SMD*_c)
        (fp Capacitor*))
      (fields
        (field (name Reference) C)
        (field (name Value) C_Small-3Phase-rescue))
      (pins
        (pin (num 1) (name ~) (type passive))
        (pin (num 2) (name ~) (type passive))))
    (libpart (lib 3Phase-rescue) (part D_Small_ALT-3Phase-rescue)
      (footprints
        (fp Diode_*)
        (fp D-Pak_TO252AA)
        (fp *SingleDiode)
        (fp *SingleDiode*)
        (fp *_Diode_*))
      (fields
        (field (name Reference) D)
        (field (name Value) D_Small_ALT-3Phase-rescue))
      (pins
        (pin (num 1) (name K) (type passive))
        (pin (num 2) (name A) (type passive))))
    (libpart (lib 3Phase-rescue) (part R-3Phase-rescue)
      (footprints
        (fp R_*)
        (fp Resistor_*))
      (fields
        (field (name Reference) R)
        (field (name Value) R-3Phase-rescue))
      (pins
        (pin (num 1) (name ~) (type passive))
        (pin (num 2) (name ~) (type passive))))
    (libpart (lib 3Phase-rescue) (part SW_Push-3Phase-rescue)
      (fields
        (field (name Reference) SW)
        (field (name Value) SW_Push-3Phase-rescue))
      (pins
        (pin (num 1) (name 1) (type passive))
        (pin (num 2) (name 2) (type passive))))
    (libpart (lib 3Phase-rescue) (part Thermistor_NTC-3Phase-rescue)
      (footprints
        (fp *NTC*)
        (fp *Thermistor*)
        (fp PIN?ARRAY*)
        (fp bornier*)
        (fp *Terminal?Block*))
      (fields
        (field (name Reference) TH)
        (field (name Value) Thermistor_NTC-3Phase-rescue))
      (pins
        (pin (num 1) (name ~) (type passive))
        (pin (num 2) (name ~) (type passive))))
    (libpart (lib Components) (part MP2637)
      (fields
        (field (name Reference) U)
        (field (name Value) MP2637))
      (pins
        (pin (num 1) (name PGND) (type input))
        (pin (num 2) (name ~CHG) (type input))
        (pin (num 3) (name ~BOOST) (type input))
        (pin (num 4) (name CSP) (type input))
        (pin (num 5) (name BATT) (type input))
        (pin (num 6) (name AGND) (type input))
        (pin (num 7) (name OLIM) (type input))
        (pin (num 8) (name ISET) (type input))
        (pin (num 9) (name NTC) (type input))
        (pin (num 10) (name FB) (type input))
        (pin (num 11) (name ~ACOK) (type input))
        (pin (num 12) (name REG) (type input))
        (pin (num 13) (name TMR) (type input))
        (pin (num 14) (name PWIN) (type input))
        (pin (num 15) (name ILIM) (type input))
        (pin (num 16) (name VCC) (type input))
        (pin (num 17) (name VB) (type input))
        (pin (num 18) (name EN) (type input))
        (pin (num 19) (name MODE) (type input))
        (pin (num 20) (name VIN) (type input))
        (pin (num 21) (name SYS) (type input))
        (pin (num 22) (name SW) (type input))
        (pin (num 23) (name PGND) (type input))
        (pin (num 24) (name PGND) (type input))))
    (libpart (lib Connector) (part Conn_01x12_Female)
      (description "Generic connector, single row, 01x12, script generated (kicad-library-utils/schlib/autogen/connector/)")
      (docs ~)
      (footprints
        (fp Connector*:*_1x??_*))
      (fields
        (field (name Reference) J)
        (field (name Value) Conn_01x12_Female))
      (pins
        (pin (num 1) (name Pin_1) (type passive))
        (pin (num 2) (name Pin_2) (type passive))
        (pin (num 3) (name Pin_3) (type passive))
        (pin (num 4) (name Pin_4) (type passive))
        (pin (num 5) (name Pin_5) (type passive))
        (pin (num 6) (name Pin_6) (type passive))
        (pin (num 7) (name Pin_7) (type passive))
        (pin (num 8) (name Pin_8) (type passive))
        (pin (num 9) (name Pin_9) (type passive))
        (pin (num 10) (name Pin_10) (type passive))
        (pin (num 11) (name Pin_11) (type passive))
        (pin (num 12) (name Pin_12) (type passive))))
    (libpart (lib Connector) (part Conn_01x16_Male)
      (description "Generic connector, single row, 01x16, script generated (kicad-library-utils/schlib/autogen/connector/)")
      (docs ~)
      (footprints
        (fp Connector*:*_1x??_*))
      (fields
        (field (name Reference) J)
        (field (name Value) Conn_01x16_Male))
      (pins
        (pin (num 1) (name Pin_1) (type passive))
        (pin (num 2) (name Pin_2) (type passive))
        (pin (num 3) (name Pin_3) (type passive))
        (pin (num 4) (name Pin_4) (type passive))
        (pin (num 5) (name Pin_5) (type passive))
        (pin (num 6) (name Pin_6) (type passive))
        (pin (num 7) (name Pin_7) (type passive))
        (pin (num 8) (name Pin_8) (type passive))
        (pin (num 9) (name Pin_9) (type passive))
        (pin (num 10) (name Pin_10) (type passive))
        (pin (num 11) (name Pin_11) (type passive))
        (pin (num 12) (name Pin_12) (type passive))
        (pin (num 13) (name Pin_13) (type passive))
        (pin (num 14) (name Pin_14) (type passive))
        (pin (num 15) (name Pin_15) (type passive))
        (pin (num 16) (name Pin_16) (type passive))))
    (libpart (lib Device) (part Battery_Cell)
      (description "Single-cell battery")
      (docs ~)
      (fields
        (field (name Reference) BT)
        (field (name Value) Battery_Cell))
      (pins
        (pin (num 1) (name +) (type passive))
        (pin (num 2) (name -) (type passive))))
    (libpart (lib Device) (part L_Small)
      (description "Inductor, small symbol")
      (docs ~)
      (footprints
        (fp Choke_*)
        (fp *Coil*)
        (fp Inductor_*)
        (fp L_*))
      (fields
        (field (name Reference) L)
        (field (name Value) L_Small))
      (pins
        (pin (num 1) (name ~) (type passive))
        (pin (num 2) (name ~) (type passive))))
    (libpart (lib Device) (part Q_DUAL_NMOS_S1G1D2S2G2D1)
      (description "Dual NMOS transistor, 6 pin package")
      (docs ~)
      (footprints
        (fp TSOP*)
        (fp SC?70*)
        (fp SC?88*)
        (fp SOT?363*))
      (fields
        (field (name Reference) Q)
        (field (name Value) Q_DUAL_NMOS_S1G1D2S2G2D1))
      (pins
        (pin (num 1) (name S) (type passive))
        (pin (num 2) (name G) (type input))
        (pin (num 3) (name D) (type passive))
        (pin (num 4) (name S) (type passive))
        (pin (num 5) (name G) (type input))
        (pin (num 6) (name D) (type passive)))))
  (libraries
    (library (logical 3Phase-rescue)
      (uri /home/edu/Proyectos/openZmeter/Hardware/DeviceV2_03/PCB_B/3Phase-rescue.lib))
    (library (logical Components)
      (uri /home/edu/Proyectos/openZmeter/Hardware/DeviceV2_03/PCB_B/Components.lib))
    (library (logical Connector)
      (uri /usr/share/kicad/library/Connector.lib))
    (library (logical Device)
      (uri /usr/share/kicad/library/Device.lib)))
  (nets
    (net (code 1) (name 3.3Vd)
      (node (ref J1) (pin 6))
      (node (ref J1) (pin 12))
      (node (ref J1) (pin 2))
      (node (ref J2) (pin 3))
      (node (ref D1) (pin 1))
      (node (ref BZ2) (pin 1)))
    (net (code 2) (name Vbat)
      (node (ref R29) (pin 2))
      (node (ref BT1) (pin 1))
      (node (ref BT2) (pin 1))
      (node (ref J2) (pin 1))
      (node (ref U7) (pin 5))
      (node (ref C24) (pin 2))
      (node (ref SW1) (pin 1)))
    (net (code 3) (name LCD_BL)
      (node (ref Q1) (pin 5))
      (node (ref J2) (pin 11)))
    (net (code 4) (name "Net-(R30-Pad1)")
      (node (ref R31) (pin 2))
      (node (ref R30) (pin 1))
      (node (ref U7) (pin 10)))
    (net (code 5) (name 5V)
      (node (ref J2) (pin 6))
      (node (ref J2) (pin 7))
      (node (ref R32) (pin 2))
      (node (ref C25) (pin 2))
      (node (ref C26) (pin 2))
      (node (ref R30) (pin 2))
      (node (ref U7) (pin 21)))
    (net (code 6) (name "Net-(R32-Pad1)")
      (node (ref R32) (pin 1))
      (node (ref U7) (pin 9))
      (node (ref TH1) (pin 1)))
    (net (code 7) (name MCLK)
      (node (ref J2) (pin 14))
      (node (ref J1) (pin 4)))
    (net (code 8) (name MOSI)
      (node (ref J1) (pin 5))
      (node (ref J2) (pin 13)))
    (net (code 9) (name LCD_SEL)
      (node (ref J1) (pin 1))
      (node (ref J2) (pin 16)))
    (net (code 10) (name "Net-(J1-Pad11)")
      (node (ref Q1) (pin 4))
      (node (ref J1) (pin 11)))
    (net (code 11) (name "Net-(BZ2-Pad2)")
      (node (ref Q1) (pin 1))
      (node (ref BZ2) (pin 2))
      (node (ref D1) (pin 2)))
    (net (code 12) (name EN)
      (node (ref J2) (pin 10))
      (node (ref R17) (pin 1))
      (node (ref U7) (pin 19)))
    (net (code 13) (name BTN)
      (node (ref J2) (pin 2))
      (node (ref R2) (pin 1))
      (node (ref R1) (pin 1))
      (node (ref C8) (pin 1)))
    (net (code 14) (name LCD_A0)
      (node (ref J2) (pin 15))
      (node (ref J1) (pin 3)))
    (net (code 15) (name "Net-(C11-Pad1)")
      (node (ref C11) (pin 1))
      (node (ref J1) (pin 7)))
    (net (code 16) (name "Net-(C11-Pad2)")
      (node (ref J1) (pin 8))
      (node (ref C11) (pin 2)))
    (net (code 17) (name "Net-(C10-Pad1)")
      (node (ref J1) (pin 9))
      (node (ref C10) (pin 1)))
    (net (code 18) (name "Net-(L3-Pad2)")
      (node (ref L3) (pin 2))
      (node (ref U7) (pin 22)))
    (net (code 19) (name "Net-(U7-Pad2)")
      (node (ref U7) (pin 2)))
    (net (code 20) (name "Net-(R27-Pad2)")
      (node (ref R27) (pin 2))
      (node (ref U7) (pin 15)))
    (net (code 21) (name GND)
      (node (ref J1) (pin 10))
      (node (ref U7) (pin 6))
      (node (ref R17) (pin 2))
      (node (ref C22) (pin 1))
      (node (ref R28) (pin 1))
      (node (ref C23) (pin 1))
      (node (ref R24) (pin 1))
      (node (ref R27) (pin 1))
      (node (ref C24) (pin 1))
      (node (ref BT2) (pin 2))
      (node (ref TH1) (pin 2))
      (node (ref C8) (pin 2))
      (node (ref R31) (pin 1))
      (node (ref C25) (pin 1))
      (node (ref Q1) (pin 3))
      (node (ref Q1) (pin 6))
      (node (ref J2) (pin 5))
      (node (ref J2) (pin 4))
      (node (ref C2) (pin 1))
      (node (ref C1) (pin 1))
      (node (ref R21) (pin 1))
      (node (ref R2) (pin 2))
      (node (ref BT1) (pin 2))
      (node (ref C26) (pin 1))
      (node (ref R23) (pin 1))
      (node (ref C10) (pin 2))
      (node (ref U7) (pin 1))
      (node (ref U7) (pin 24))
      (node (ref U7) (pin 23)))
    (net (code 22) (name "Net-(U7-Pad11)")
      (node (ref U7) (pin 11)))
    (net (code 23) (name "Net-(C22-Pad2)")
      (node (ref U7) (pin 18))
      (node (ref U7) (pin 16))
      (node (ref U7) (pin 17))
      (node (ref C22) (pin 2)))
    (net (code 24) (name Vin)
      (node (ref C1) (pin 2))
      (node (ref C2) (pin 2))
      (node (ref U7) (pin 20))
      (node (ref R22) (pin 2))
      (node (ref J2) (pin 8))
      (node (ref R20) (pin 2))
      (node (ref J2) (pin 9)))
    (net (code 25) (name "Net-(R20-Pad1)")
      (node (ref R21) (pin 2))
      (node (ref U7) (pin 12))
      (node (ref R20) (pin 1)))
    (net (code 26) (name "Net-(U7-Pad3)")
      (node (ref U7) (pin 3)))
    (net (code 27) (name BEEP)
      (node (ref J2) (pin 12))
      (node (ref Q1) (pin 2)))
    (net (code 28) (name "Net-(R1-Pad2)")
      (node (ref SW1) (pin 2))
      (node (ref R1) (pin 2)))
    (net (code 29) (name "Net-(R22-Pad1)")
      (node (ref R23) (pin 2))
      (node (ref R22) (pin 1))
      (node (ref U7) (pin 14)))
    (net (code 30) (name "Net-(L3-Pad1)")
      (node (ref L3) (pin 1))
      (node (ref R29) (pin 1))
      (node (ref U7) (pin 4)))
    (net (code 31) (name "Net-(R28-Pad2)")
      (node (ref R28) (pin 2))
      (node (ref U7) (pin 7)))
    (net (code 32) (name "Net-(R24-Pad2)")
      (node (ref U7) (pin 8))
      (node (ref R24) (pin 2)))
    (net (code 33) (name "Net-(C23-Pad2)")
      (node (ref U7) (pin 13))
      (node (ref C23) (pin 2)))))