M48
; DRILL file {KiCad 5.1.6+dfsg1-1~bpo10+1} date Fri Oct 16 21:04:30 2020
; FORMAT={-:-/ absolute / metric / decimal}
; #@! TF.CreationDate,2020-10-16T21:04:30+02:00
; #@! TF.GenerationSoftware,Kicad,Pcbnew,5.1.6+dfsg1-1~bpo10+1
; #@! TF.FileFunction,NonPlated,1,2,NPTH
FMAT,2
METRIC
T1C1.000
%
G90
G05
T1
X98.7Y-91.9
X98.7Y-96.3
T0
M30
