(module RJ11_4P4C (layer F.Cu) (tedit 5BE2FE35)
  (descr "RJ12 connector  https://cdn.amphenol-icc.com/media/wysiwyg/files/drawing/c-bmj-0082.pdf")
  (tags "RJ12 connector")
  (fp_text reference J1 (at 2.37 -0.43) (layer F.SilkS)
    (effects (font (size 1 1) (thickness 0.15)))
  )
  (fp_text value RJ11 (at 5.3 19.17) (layer F.Fab)
    (effects (font (size 1 1) (thickness 0.15)))
  )
  (fp_line (start 0 9.02) (end 0 0) (layer F.SilkS) (width 0.12))
  (fp_line (start 0 18) (end 0 11.22) (layer F.SilkS) (width 0.12))
  (fp_line (start 11.18 18) (end 0 18) (layer F.SilkS) (width 0.12))
  (fp_line (start 11.18 18) (end 11.18 11.22) (layer F.SilkS) (width 0.12))
  (fp_line (start 11.18 0) (end 11.18 9.02) (layer F.SilkS) (width 0.12))
  (fp_line (start 0 0) (end 11.18 0) (layer F.SilkS) (width 0.12))
  (fp_text user %R (at 7.09 8.99) (layer F.Fab)
    (effects (font (size 1 1) (thickness 0.15)))
  )
  (pad "" np_thru_hole circle (at 9.4 10.12) (size 3.25 3.25) (drill 3.25) (layers *.Cu *.Mask))
  (pad 4 thru_hole circle (at 7.495 1.23) (size 1.52 1.52) (drill 0.76) (layers *.Cu *.Mask))
  (pad 3 thru_hole circle (at 6.225 3.77) (size 1.52 1.52) (drill 0.76) (layers *.Cu *.Mask))
  (pad 2 thru_hole circle (at 4.955 1.23) (size 1.52 1.52) (drill 0.76) (layers *.Cu *.Mask))
  (pad "" np_thru_hole circle (at 1.78 10.12) (size 3.25 3.25) (drill 3.25) (layers *.Cu *.Mask))
  (pad 1 thru_hole rect (at 3.685 3.77) (size 1.5 1.5) (drill 0.7) (layers *.Cu *.Mask))
  (model ${KISYS3DMOD}/Connector_RJ.3dshapes/RJ12_Amphenol_54601.wrl
    (at (xyz 0 0 0))
    (scale (xyz 1 1 1))
    (rotate (xyz 0 0 0))
  )
)
