(export (version D)
  (design
    (source /home/edu/Proyectos/openZmeter/Hardware/DeviceV2_03/PCB_B/3Phase.sch)
    (date "jue 24 jun 2021 14:25:35 CEST")
    (tool "Eeschema 5.1.9+dfsg1-1~bpo10+1")
    (sheet (number 1) (name /) (tstamps /)
      (title_block
        (title)
        (company)
        (rev)
        (date)
        (source 3Phase.sch)
        (comment (number 1) (value ""))
        (comment (number 2) (value ""))
        (comment (number 3) (value ""))
        (comment (number 4) (value "")))))
  (components
    (comp (ref R14)
      (value 100h)
      (footprint Footprints:R_0603_1608Metric)
      (datasheet https://lcsc.com/product-detail/Chip-Resistor-Surface-Mount_100R-100R-1_C125923.html)
      (libsource (lib 3Phase-rescue) (part R-3Phase-rescue) (description ""))
      (sheetpath (names /) (tstamps /))
      (tstamp 5BD04949))
    (comp (ref R27)
      (value 200k)
      (footprint Footprints:R_1206_3216Metric)
      (datasheet https://lcsc.com/product-detail/_AC1206FR-07200KL_C144506.html)
      (libsource (lib 3Phase-rescue) (part R-3Phase-rescue) (description ""))
      (sheetpath (names /) (tstamps /))
      (tstamp 5BD04F97))
    (comp (ref R30)
      (value 200k)
      (footprint Footprints:R_1206_3216Metric)
      (datasheet https://lcsc.com/product-detail/_AC1206FR-07200KL_C144506.html)
      (libsource (lib 3Phase-rescue) (part R-3Phase-rescue) (description ""))
      (sheetpath (names /) (tstamps /))
      (tstamp 5BD0515E))
    (comp (ref R31)
      (value 1k02)
      (footprint Footprints:R_0603_1608Metric)
      (fields
        (field (name LCSC) C705734))
      (libsource (lib 3Phase-rescue) (part R-3Phase-rescue) (description ""))
      (sheetpath (names /) (tstamps /))
      (tstamp 5BD051BF))
    (comp (ref R32)
      (value 2.2k)
      (footprint Footprints:R_0603_1608Metric)
      (datasheet https://lcsc.com/product-detail/Chip-Resistor-Surface-Mount_2-2KR-2201-1_C114662.html)
      (libsource (lib 3Phase-rescue) (part R-3Phase-rescue) (description ""))
      (sheetpath (names /) (tstamps /))
      (tstamp 5BD05222))
    (comp (ref R35)
      (value 4k7)
      (footprint Footprints:R_0603_1608Metric)
      (datasheet https://lcsc.com/product-detail/Chip-Resistor-Surface-Mount_4-7KR-472-1_C99782.html)
      (libsource (lib 3Phase-rescue) (part R-3Phase-rescue) (description ""))
      (sheetpath (names /) (tstamps /))
      (tstamp 5BD052EE))
    (comp (ref C7)
      (value "100nF 25v")
      (footprint Footprints:R_0603_1608Metric)
      (datasheet https://lcsc.com/product-detail/Multilayer-Ceramic-Capacitors-MLCC-SMD-SMT_SAMSUNG_CL10B104KA8NNNC_100nF-104-10-25V_C1590.html)
      (libsource (lib 3Phase-rescue) (part C_Small-3Phase-rescue) (description ""))
      (sheetpath (names /) (tstamps /))
      (tstamp 5BD06419))
    (comp (ref J1)
      (value 95001-6P6C)
      (footprint Footprints:KF2EDGR_2.54x4)
      (libsource (lib 3Phase-rescue) (part CONN_01X04-3Phase-rescue) (description ""))
      (sheetpath (names /) (tstamps /))
      (tstamp 5BD094EB))
    (comp (ref P2)
      (value "2 x 2.54x2 pin header")
      (footprint "Footprints:NanoPI Air")
      (datasheet https://lcsc.com/product-detail/Pin-Header-Female-Header_Boom-Precision-Elec-2-54-1-2PFemale_C49661.html)
      (libsource (lib Components) (part NanoPi) (description ""))
      (sheetpath (names /) (tstamps /))
      (tstamp 5BFAFAB2))
    (comp (ref U13)
      (value STM32F042)
      (footprint Footprints:LQFP-32_7x7mm_Pitch0.8mm)
      (datasheet https://lcsc.com/product-detail/ST-Microelectronics_STMicroelectronics_STM32F042K6T6_STM32F042K6T6_C69216.html)
      (libsource (lib Components) (part STM32F042) (description ""))
      (sheetpath (names /) (tstamps /))
      (tstamp 5C0F1416))
    (comp (ref R38)
      (value 39h)
      (footprint Footprints:R_0603_1608Metric)
      (datasheet https://lcsc.com/product-detail/_RC0603JR-0739RL_C137630.html)
      (libsource (lib 3Phase-rescue) (part R-3Phase-rescue) (description ""))
      (sheetpath (names /) (tstamps /))
      (tstamp 5C1EE790))
    (comp (ref R55)
      (value 220h)
      (footprint Footprints:R_0603_1608Metric)
      (datasheet https://lcsc.com/product-detail/Chip-Resistor-Surface-Mount_220R-220R-1_C107696.html)
      (libsource (lib 3Phase-rescue) (part R-3Phase-rescue) (description ""))
      (sheetpath (names /) (tstamps /))
      (tstamp 5C1EFC16))
    (comp (ref C28)
      (value "100nF 25v")
      (footprint Footprints:R_0603_1608Metric)
      (datasheet https://lcsc.com/product-detail/Multilayer-Ceramic-Capacitors-MLCC-SMD-SMT_SAMSUNG_CL10B104KA8NNNC_100nF-104-10-25V_C1590.html)
      (libsource (lib 3Phase-rescue) (part C_Small-3Phase-rescue) (description ""))
      (sheetpath (names /) (tstamps /))
      (tstamp 5C17FA70))
    (comp (ref J5)
      (value "2.54x3 pin header")
      (footprint Footprints:PinHeader_1x03_P2.54mm_Vertical)
      (datasheet https://lcsc.com/product-detail/Pin-Header-Female-Header_Boom-Precision-Elec-Header-2-54mm-1-3P_C49257.html)
      (libsource (lib Components) (part Conn_01x03) (description "Generic connector, single row, 01x03, script generated (kicad-library-utils/schlib/autogen/connector/)"))
      (sheetpath (names /) (tstamps /))
      (tstamp 5E457107))
    (comp (ref R39)
      (value 4k7)
      (footprint Footprints:R_0603_1608Metric)
      (datasheet https://lcsc.com/product-detail/Chip-Resistor-Surface-Mount_4-7KR-472-1_C99782.html)
      (libsource (lib 3Phase-rescue) (part R-3Phase-rescue) (description ""))
      (sheetpath (names /) (tstamps /))
      (tstamp 5E8C6875))
    (comp (ref U19)
      (value STM32F301C8Tx)
      (footprint Package_QFP:LQFP-48_7x7mm_P0.5mm)
      (datasheet http://www.st.com/st-web-ui/static/active/en/resource/technical/document/datasheet/DM00093332.pdf)
      (libsource (lib MCU_ST_STM32F3) (part STM32F301C8Tx) (description "ARM Cortex-M4 MCU, 64KB flash, 16KB RAM, 72MHz, 2-3.6V, 37 GPIO, LQFP-48"))
      (sheetpath (names /) (tstamps /))
      (tstamp 60080381))
    (comp (ref U6)
      (value SI8921BB)
      (footprint Package_SO:SOIC-8_3.9x4.9mm_P1.27mm)
      (libsource (lib Components) (part SI8921BB) (description ""))
      (sheetpath (names /) (tstamps /))
      (tstamp 60C6672C))
    (comp (ref U14)
      (value SI8921BB)
      (footprint Package_SO:SOIC-8_3.9x4.9mm_P1.27mm)
      (libsource (lib Components) (part SI8921BB) (description ""))
      (sheetpath (names /) (tstamps /))
      (tstamp 60C6A971))
    (comp (ref R61)
      (value 12)
      (footprint Footprints:R_0603_1608Metric)
      (libsource (lib 3Phase-rescue) (part R-3Phase-rescue) (description ""))
      (sheetpath (names /) (tstamps /))
      (tstamp 60C90D6D))
    (comp (ref R67)
      (value 12)
      (footprint Footprints:R_0603_1608Metric)
      (libsource (lib 3Phase-rescue) (part R-3Phase-rescue) (description ""))
      (sheetpath (names /) (tstamps /))
      (tstamp 60C91A12))
    (comp (ref C42)
      (value "330pF NP0")
      (footprint Footprints:C_0603_1608Metric)
      (datasheet https://lcsc.com/product-detail/Multilayer-Ceramic-Capacitors-MLCC-SMD-SMT_SAMSUNG_CL10B104KA8NNNC_100nF-104-10-25V_C1590.html)
      (libsource (lib 3Phase-rescue) (part C_Small-3Phase-rescue) (description ""))
      (sheetpath (names /) (tstamps /))
      (tstamp 60C963B4))
    (comp (ref C43)
      (value "100nF 25v")
      (footprint Footprints:R_0603_1608Metric)
      (datasheet https://lcsc.com/product-detail/Multilayer-Ceramic-Capacitors-MLCC-SMD-SMT_SAMSUNG_CL10B104KA8NNNC_100nF-104-10-25V_C1590.html)
      (libsource (lib 3Phase-rescue) (part C_Small-3Phase-rescue) (description ""))
      (sheetpath (names /) (tstamps /))
      (tstamp 60ED639F))
    (comp (ref R34)
      (value 2.2k)
      (footprint Footprints:R_0603_1608Metric)
      (datasheet https://lcsc.com/product-detail/Chip-Resistor-Surface-Mount_2-2KR-2201-1_C114662.html)
      (libsource (lib 3Phase-rescue) (part R-3Phase-rescue) (description ""))
      (sheetpath (names /) (tstamps /))
      (tstamp 60F502AF))
    (comp (ref R68)
      (value 2.2k)
      (footprint Footprints:R_0603_1608Metric)
      (datasheet https://lcsc.com/product-detail/Chip-Resistor-Surface-Mount_2-2KR-2201-1_C114662.html)
      (libsource (lib 3Phase-rescue) (part R-3Phase-rescue) (description ""))
      (sheetpath (names /) (tstamps /))
      (tstamp 6111A63B))
    (comp (ref R25)
      (value 499k)
      (footprint Footprints:R_1206_3216Metric)
      (fields
        (field (name LCSC) C517514))
      (libsource (lib 3Phase-rescue) (part R-3Phase-rescue) (description ""))
      (sheetpath (names /) (tstamps /))
      (tstamp 5BD04F42))
    (comp (ref U17)
      (value B0505D-1W)
      (footprint Converter_DCDC:Converter_DCDC_muRata_CRE1xxxxxx3C_THT)
      (datasheet http://power.murata.com/datasheet?/data/power/ncl/kdc_cre1.pdf)
      (libsource (lib Components) (part B0505D-1W) (description "5V to 5V 200mA, Isolated 2W Single-Output DC-DC Converter Modules with 3kV isolation, SIP-4"))
      (sheetpath (names /) (tstamps /))
      (tstamp 631FBD24))
    (comp (ref C9)
      (value "100nF 25v")
      (footprint Footprints:R_0603_1608Metric)
      (datasheet https://lcsc.com/product-detail/Multilayer-Ceramic-Capacitors-MLCC-SMD-SMT_SAMSUNG_CL10B104KA8NNNC_100nF-104-10-25V_C1590.html)
      (libsource (lib 3Phase-rescue) (part C_Small-3Phase-rescue) (description ""))
      (sheetpath (names /) (tstamps /))
      (tstamp 632F85BD))
    (comp (ref R26)
      (value 200k)
      (footprint Footprints:R_1206_3216Metric)
      (datasheet https://lcsc.com/product-detail/_AC1206FR-07200KL_C144506.html)
      (libsource (lib 3Phase-rescue) (part R-3Phase-rescue) (description ""))
      (sheetpath (names /) (tstamps /))
      (tstamp 639150E9))
    (comp (ref R28)
      (value 200k)
      (footprint Footprints:R_1206_3216Metric)
      (datasheet https://lcsc.com/product-detail/_AC1206FR-07200KL_C144506.html)
      (libsource (lib 3Phase-rescue) (part R-3Phase-rescue) (description ""))
      (sheetpath (names /) (tstamps /))
      (tstamp 639150F3))
    (comp (ref R70)
      (value 2.2k)
      (footprint Footprints:R_0603_1608Metric)
      (datasheet https://lcsc.com/product-detail/Chip-Resistor-Surface-Mount_2-2KR-2201-1_C114662.html)
      (libsource (lib 3Phase-rescue) (part R-3Phase-rescue) (description ""))
      (sheetpath (names /) (tstamps /))
      (tstamp 639150FD))
    (comp (ref U15)
      (value SI8921BB)
      (footprint Package_SO:SOIC-8_3.9x4.9mm_P1.27mm)
      (libsource (lib Components) (part SI8921BB) (description ""))
      (sheetpath (names /) (tstamps /))
      (tstamp 6391510B))
    (comp (ref C44)
      (value "100nF 25v")
      (footprint Footprints:R_0603_1608Metric)
      (datasheet https://lcsc.com/product-detail/Multilayer-Ceramic-Capacitors-MLCC-SMD-SMT_SAMSUNG_CL10B104KA8NNNC_100nF-104-10-25V_C1590.html)
      (libsource (lib 3Phase-rescue) (part C_Small-3Phase-rescue) (description ""))
      (sheetpath (names /) (tstamps /))
      (tstamp 63915115))
    (comp (ref R60)
      (value 2.2k)
      (footprint Footprints:R_0603_1608Metric)
      (datasheet https://lcsc.com/product-detail/Chip-Resistor-Surface-Mount_2-2KR-2201-1_C114662.html)
      (libsource (lib 3Phase-rescue) (part R-3Phase-rescue) (description ""))
      (sheetpath (names /) (tstamps /))
      (tstamp 63915120))
    (comp (ref R69)
      (value 2.2k)
      (footprint Footprints:R_0603_1608Metric)
      (datasheet https://lcsc.com/product-detail/Chip-Resistor-Surface-Mount_2-2KR-2201-1_C114662.html)
      (libsource (lib 3Phase-rescue) (part R-3Phase-rescue) (description ""))
      (sheetpath (names /) (tstamps /))
      (tstamp 6391512F))
    (comp (ref U18)
      (value B0505D-1W)
      (footprint Converter_DCDC:Converter_DCDC_muRata_CRE1xxxxxx3C_THT)
      (datasheet http://power.murata.com/datasheet?/data/power/ncl/kdc_cre1.pdf)
      (libsource (lib Components) (part B0505D-1W) (description "5V to 5V 200mA, Isolated 2W Single-Output DC-DC Converter Modules with 3kV isolation, SIP-4"))
      (sheetpath (names /) (tstamps /))
      (tstamp 63915146))
    (comp (ref C38)
      (value "100nF 25v")
      (footprint Footprints:R_0603_1608Metric)
      (datasheet https://lcsc.com/product-detail/Multilayer-Ceramic-Capacitors-MLCC-SMD-SMT_SAMSUNG_CL10B104KA8NNNC_100nF-104-10-25V_C1590.html)
      (libsource (lib 3Phase-rescue) (part C_Small-3Phase-rescue) (description ""))
      (sheetpath (names /) (tstamps /))
      (tstamp 63915156))
    (comp (ref P1)
      (value "3.81x4 terminal block")
      (footprint Footprints:PhoenixContact_MC_1,5_2-G-3.81_1x02_P3.81mm_Horizontal)
      (datasheet https://lcsc.com/product-detail/Pluggable-System-Terminal-Block_Ningbo-Kangnex-Elec-WJ15EDGRC-3-81-4P_C7245.html)
      (libsource (lib Components) (part Conn_01x02) (description "Generic connector, single row, 01x03, script generated (kicad-library-utils/schlib/autogen/connector/)"))
      (sheetpath (names /) (tstamps /))
      (tstamp 63AF2892))
    (comp (ref P3)
      (value "3.81x4 terminal block")
      (footprint Footprints:PhoenixContact_MC_1,5_2-G-3.81_1x02_P3.81mm_Horizontal)
      (datasheet https://lcsc.com/product-detail/Pluggable-System-Terminal-Block_Ningbo-Kangnex-Elec-WJ15EDGRC-3-81-4P_C7245.html)
      (libsource (lib Components) (part Conn_01x02) (description "Generic connector, single row, 01x03, script generated (kicad-library-utils/schlib/autogen/connector/)"))
      (sheetpath (names /) (tstamps /))
      (tstamp 63F17E36))
    (comp (ref P4)
      (value "3.81x4 terminal block")
      (footprint Footprints:PhoenixContact_MC_1,5_2-G-3.81_1x02_P3.81mm_Horizontal)
      (datasheet https://lcsc.com/product-detail/Pluggable-System-Terminal-Block_Ningbo-Kangnex-Elec-WJ15EDGRC-3-81-4P_C7245.html)
      (libsource (lib Components) (part Conn_01x02) (description "Generic connector, single row, 01x03, script generated (kicad-library-utils/schlib/autogen/connector/)"))
      (sheetpath (names /) (tstamps /))
      (tstamp 640ED55E))
    (comp (ref R71)
      (value 12)
      (footprint Footprints:R_0603_1608Metric)
      (libsource (lib 3Phase-rescue) (part R-3Phase-rescue) (description ""))
      (sheetpath (names /) (tstamps /))
      (tstamp 665E2127))
    (comp (ref R72)
      (value 12)
      (footprint Footprints:R_0603_1608Metric)
      (libsource (lib 3Phase-rescue) (part R-3Phase-rescue) (description ""))
      (sheetpath (names /) (tstamps /))
      (tstamp 665E4489))
    (comp (ref C46)
      (value "330pF NP0")
      (footprint Footprints:C_0603_1608Metric)
      (datasheet https://lcsc.com/product-detail/Multilayer-Ceramic-Capacitors-MLCC-SMD-SMT_SAMSUNG_CL10B104KA8NNNC_100nF-104-10-25V_C1590.html)
      (libsource (lib 3Phase-rescue) (part C_Small-3Phase-rescue) (description ""))
      (sheetpath (names /) (tstamps /))
      (tstamp 665E4C6A))
    (comp (ref C45)
      (value "100nF 25v")
      (footprint Footprints:C_0603_1608Metric)
      (datasheet https://lcsc.com/product-detail/Multilayer-Ceramic-Capacitors-MLCC-SMD-SMT_SAMSUNG_CL10B104KA8NNNC_100nF-104-10-25V_C1590.html)
      (libsource (lib 3Phase-rescue) (part C_Small-3Phase-rescue) (description ""))
      (sheetpath (names /) (tstamps /))
      (tstamp 66B2A491))
    (comp (ref U16)
      (value B0505D-1W)
      (footprint Converter_DCDC:Converter_DCDC_muRata_CRE1xxxxxx3C_THT)
      (datasheet http://power.murata.com/datasheet?/data/power/ncl/kdc_cre1.pdf)
      (libsource (lib Components) (part B0505D-1W) (description "5V to 5V 200mA, Isolated 2W Single-Output DC-DC Converter Modules with 3kV isolation, SIP-4"))
      (sheetpath (names /) (tstamps /))
      (tstamp 615D213A))
    (comp (ref R24)
      (value 499k)
      (footprint Footprints:R_1206_3216Metric)
      (fields
        (field (name LCSC) C517514))
      (libsource (lib 3Phase-rescue) (part R-3Phase-rescue) (description ""))
      (sheetpath (names /) (tstamps /))
      (tstamp 5BD04E02))
    (comp (ref C39)
      (value "100nF 10v")
      (footprint Footprints:C_0603_1608Metric)
      (datasheet https://lcsc.com/product-detail/Multilayer-Ceramic-Capacitors-MLCC-SMD-SMT_SAMSUNG_CL10B104KA8NNNC_100nF-104-10-25V_C1590.html)
      (libsource (lib 3Phase-rescue) (part C_Small-3Phase-rescue) (description ""))
      (sheetpath (names /) (tstamps /))
      (tstamp 622A695B))
    (comp (ref R18)
      (value 12)
      (footprint Footprints:R_0603_1608Metric)
      (libsource (lib 3Phase-rescue) (part R-3Phase-rescue) (description ""))
      (sheetpath (names /) (tstamps /))
      (tstamp 69D44727))
    (comp (ref R21)
      (value 12)
      (footprint Footprints:R_0603_1608Metric)
      (libsource (lib 3Phase-rescue) (part R-3Phase-rescue) (description ""))
      (sheetpath (names /) (tstamps /))
      (tstamp 69D4472D))
    (comp (ref C8)
      (value "330pF NP0")
      (footprint Footprints:C_0603_1608Metric)
      (datasheet https://lcsc.com/product-detail/Multilayer-Ceramic-Capacitors-MLCC-SMD-SMT_SAMSUNG_CL10B104KA8NNNC_100nF-104-10-25V_C1590.html)
      (libsource (lib 3Phase-rescue) (part C_Small-3Phase-rescue) (description ""))
      (sheetpath (names /) (tstamps /))
      (tstamp 69D44733))
    (comp (ref R23)
      (value 12)
      (footprint Footprints:R_0603_1608Metric)
      (libsource (lib 3Phase-rescue) (part R-3Phase-rescue) (description ""))
      (sheetpath (names /) (tstamps /))
      (tstamp 69DB96E6))
    (comp (ref R29)
      (value 12)
      (footprint Footprints:R_0603_1608Metric)
      (libsource (lib 3Phase-rescue) (part R-3Phase-rescue) (description ""))
      (sheetpath (names /) (tstamps /))
      (tstamp 69DB96EC))
    (comp (ref C10)
      (value "330pF NP0")
      (footprint Footprints:C_0603_1608Metric)
      (datasheet https://lcsc.com/product-detail/Multilayer-Ceramic-Capacitors-MLCC-SMD-SMT_SAMSUNG_CL10B104KA8NNNC_100nF-104-10-25V_C1590.html)
      (libsource (lib 3Phase-rescue) (part C_Small-3Phase-rescue) (description ""))
      (sheetpath (names /) (tstamps /))
      (tstamp 69DB96F2))
    (comp (ref C3)
      (value "100nF 25v")
      (footprint Footprints:C_0603_1608Metric)
      (datasheet https://lcsc.com/product-detail/Multilayer-Ceramic-Capacitors-MLCC-SMD-SMT_SAMSUNG_CL10B104KA8NNNC_100nF-104-10-25V_C1590.html)
      (libsource (lib 3Phase-rescue) (part C_Small-3Phase-rescue) (description ""))
      (sheetpath (names /) (tstamps /))
      (tstamp 69E3DE31))
    (comp (ref C5)
      (value "100nF 25v")
      (footprint Footprints:C_0603_1608Metric)
      (datasheet https://lcsc.com/product-detail/Multilayer-Ceramic-Capacitors-MLCC-SMD-SMT_SAMSUNG_CL10B104KA8NNNC_100nF-104-10-25V_C1590.html)
      (libsource (lib 3Phase-rescue) (part C_Small-3Phase-rescue) (description ""))
      (sheetpath (names /) (tstamps /))
      (tstamp 69EB74D8))
    (comp (ref U1)
      (value INA826)
      (footprint Package_SO:VSSOP-8_3.0x3.0mm_P0.65mm)
      (datasheet http://www.ti.com/lit/ds/symlink/ina128.pdf)
      (libsource (lib Components) (part INA826) (description "Precision, Low Power Instrumentation Amplifier G = 1 + 50kOhm/Rg, DIP-8/SOIC-8"))
      (sheetpath (names /) (tstamps /))
      (tstamp 60DFD624))
    (comp (ref R33)
      (value 2.2k)
      (footprint Footprints:R_0603_1608Metric)
      (datasheet https://lcsc.com/product-detail/Chip-Resistor-Surface-Mount_2-2KR-2201-1_C114662.html)
      (libsource (lib 3Phase-rescue) (part R-3Phase-rescue) (description ""))
      (sheetpath (names /) (tstamps /))
      (tstamp 60DFF1B1))
    (comp (ref R36)
      (value 2.2k)
      (footprint Footprints:R_0603_1608Metric)
      (datasheet https://lcsc.com/product-detail/Chip-Resistor-Surface-Mount_2-2KR-2201-1_C114662.html)
      (libsource (lib 3Phase-rescue) (part R-3Phase-rescue) (description ""))
      (sheetpath (names /) (tstamps /))
      (tstamp 60E004E1))
    (comp (ref R40)
      (value 2.2k)
      (footprint Footprints:R_0603_1608Metric)
      (datasheet https://lcsc.com/product-detail/Chip-Resistor-Surface-Mount_2-2KR-2201-1_C114662.html)
      (libsource (lib 3Phase-rescue) (part R-3Phase-rescue) (description ""))
      (sheetpath (names /) (tstamps /))
      (tstamp 60E00DFD))
    (comp (ref R56)
      (value 2.2k)
      (footprint Footprints:R_0603_1608Metric)
      (datasheet https://lcsc.com/product-detail/Chip-Resistor-Surface-Mount_2-2KR-2201-1_C114662.html)
      (libsource (lib 3Phase-rescue) (part R-3Phase-rescue) (description ""))
      (sheetpath (names /) (tstamps /))
      (tstamp 60E01908))
    (comp (ref C11)
      (value "100nF 25v")
      (footprint Footprints:R_0603_1608Metric)
      (datasheet https://lcsc.com/product-detail/Multilayer-Ceramic-Capacitors-MLCC-SMD-SMT_SAMSUNG_CL10B104KA8NNNC_100nF-104-10-25V_C1590.html)
      (libsource (lib 3Phase-rescue) (part C_Small-3Phase-rescue) (description ""))
      (sheetpath (names /) (tstamps /))
      (tstamp 60E022C7))
    (comp (ref SW1)
      (value SW_DIP_x04)
      (footprint Button_Switch_SMD:SW_DIP_SPSTx04_Slide_Copal_CHS-04B_W7.62mm_P1.27mm)
      (datasheet ~)
      (libsource (lib Components) (part SW_DIP_x04) (description "4x DIP Switch, Single Pole Single Throw (SPST) switch, small symbol"))
      (sheetpath (names /) (tstamps /))
      (tstamp 61190C8D))
    (comp (ref R59)
      (value "100k 0.1%")
      (footprint Footprints:R_0603_1608Metric)
      (datasheet https://lcsc.com/product-detail/Chip-Resistor-Surface-Mount_2-2KR-2201-1_C114662.html)
      (libsource (lib 3Phase-rescue) (part R-3Phase-rescue) (description ""))
      (sheetpath (names /) (tstamps /))
      (tstamp 61191850))
    (comp (ref R62)
      (value "50k 0.1%")
      (footprint Footprints:R_0603_1608Metric)
      (datasheet https://lcsc.com/product-detail/Chip-Resistor-Surface-Mount_2-2KR-2201-1_C114662.html)
      (libsource (lib 3Phase-rescue) (part R-3Phase-rescue) (description ""))
      (sheetpath (names /) (tstamps /))
      (tstamp 61191DDD))
    (comp (ref R63)
      (value "25k 0.1%")
      (footprint Footprints:R_0603_1608Metric)
      (datasheet https://lcsc.com/product-detail/Chip-Resistor-Surface-Mount_2-2KR-2201-1_C114662.html)
      (libsource (lib 3Phase-rescue) (part R-3Phase-rescue) (description ""))
      (sheetpath (names /) (tstamps /))
      (tstamp 6119223E))
    (comp (ref R64)
      (value "5k6 0.1%")
      (footprint Footprints:R_0603_1608Metric)
      (datasheet https://lcsc.com/product-detail/Chip-Resistor-Surface-Mount_2-2KR-2201-1_C114662.html)
      (libsource (lib 3Phase-rescue) (part R-3Phase-rescue) (description ""))
      (sheetpath (names /) (tstamps /))
      (tstamp 6119265E))
    (comp (ref C12)
      (value "100nF 25v")
      (footprint Footprints:R_0603_1608Metric)
      (datasheet https://lcsc.com/product-detail/Multilayer-Ceramic-Capacitors-MLCC-SMD-SMT_SAMSUNG_CL10B104KA8NNNC_100nF-104-10-25V_C1590.html)
      (libsource (lib 3Phase-rescue) (part C_Small-3Phase-rescue) (description ""))
      (sheetpath (names /) (tstamps /))
      (tstamp 61700CAD))
    (comp (ref C17)
      (value "100nF 25v")
      (footprint Footprints:R_0603_1608Metric)
      (datasheet https://lcsc.com/product-detail/Multilayer-Ceramic-Capacitors-MLCC-SMD-SMT_SAMSUNG_CL10B104KA8NNNC_100nF-104-10-25V_C1590.html)
      (libsource (lib 3Phase-rescue) (part C_Small-3Phase-rescue) (description ""))
      (sheetpath (names /) (tstamps /))
      (tstamp 6179AF20))
    (comp (ref R73)
      (value "6k9 0.1%")
      (footprint Footprints:R_0603_1608Metric)
      (datasheet https://lcsc.com/product-detail/Chip-Resistor-Surface-Mount_2-2KR-2201-1_C114662.html)
      (libsource (lib 3Phase-rescue) (part R-3Phase-rescue) (description ""))
      (sheetpath (names /) (tstamps /))
      (tstamp 61F9A932))
    (comp (ref C6)
      (value "100nF 25v")
      (footprint Footprints:R_0603_1608Metric)
      (datasheet https://lcsc.com/product-detail/Multilayer-Ceramic-Capacitors-MLCC-SMD-SMT_SAMSUNG_CL10B104KA8NNNC_100nF-104-10-25V_C1590.html)
      (libsource (lib 3Phase-rescue) (part C_Small-3Phase-rescue) (description ""))
      (sheetpath (names /) (tstamps /))
      (tstamp 627837F8))
    (comp (ref R48)
      (value 100h)
      (footprint Footprints:R_0603_1608Metric)
      (datasheet https://lcsc.com/product-detail/Chip-Resistor-Surface-Mount_100R-100R-1_C125923.html)
      (libsource (lib 3Phase-rescue) (part R-3Phase-rescue) (description ""))
      (sheetpath (names /) (tstamps /))
      (tstamp 63413F5E))
    (comp (ref C23)
      (value "100nF 25v")
      (footprint Footprints:R_0603_1608Metric)
      (datasheet https://lcsc.com/product-detail/Multilayer-Ceramic-Capacitors-MLCC-SMD-SMT_SAMSUNG_CL10B104KA8NNNC_100nF-104-10-25V_C1590.html)
      (libsource (lib 3Phase-rescue) (part C_Small-3Phase-rescue) (description ""))
      (sheetpath (names /) (tstamps /))
      (tstamp 63414608))
    (comp (ref J2)
      (value 95001-6P6C)
      (footprint Footprints:KF2EDGR_2.54x4)
      (libsource (lib 3Phase-rescue) (part CONN_01X04-3Phase-rescue) (description ""))
      (sheetpath (names /) (tstamps /))
      (tstamp 63414612))
    (comp (ref U2)
      (value INA826)
      (footprint Package_SO:VSSOP-8_3.0x3.0mm_P0.65mm)
      (datasheet http://www.ti.com/lit/ds/symlink/ina128.pdf)
      (libsource (lib Components) (part INA826) (description "Precision, Low Power Instrumentation Amplifier G = 1 + 50kOhm/Rg, DIP-8/SOIC-8"))
      (sheetpath (names /) (tstamps /))
      (tstamp 6341461C))
    (comp (ref R1)
      (value 2.2k)
      (footprint Footprints:R_0603_1608Metric)
      (datasheet https://lcsc.com/product-detail/Chip-Resistor-Surface-Mount_2-2KR-2201-1_C114662.html)
      (libsource (lib 3Phase-rescue) (part R-3Phase-rescue) (description ""))
      (sheetpath (names /) (tstamps /))
      (tstamp 63414626))
    (comp (ref R4)
      (value 2.2k)
      (footprint Footprints:R_0603_1608Metric)
      (datasheet https://lcsc.com/product-detail/Chip-Resistor-Surface-Mount_2-2KR-2201-1_C114662.html)
      (libsource (lib 3Phase-rescue) (part R-3Phase-rescue) (description ""))
      (sheetpath (names /) (tstamps /))
      (tstamp 63414630))
    (comp (ref R7)
      (value 2.2k)
      (footprint Footprints:R_0603_1608Metric)
      (datasheet https://lcsc.com/product-detail/Chip-Resistor-Surface-Mount_2-2KR-2201-1_C114662.html)
      (libsource (lib 3Phase-rescue) (part R-3Phase-rescue) (description ""))
      (sheetpath (names /) (tstamps /))
      (tstamp 6341463A))
    (comp (ref R8)
      (value 2.2k)
      (footprint Footprints:R_0603_1608Metric)
      (datasheet https://lcsc.com/product-detail/Chip-Resistor-Surface-Mount_2-2KR-2201-1_C114662.html)
      (libsource (lib 3Phase-rescue) (part R-3Phase-rescue) (description ""))
      (sheetpath (names /) (tstamps /))
      (tstamp 63414644))
    (comp (ref C1)
      (value "100nF 25v")
      (footprint Footprints:R_0603_1608Metric)
      (datasheet https://lcsc.com/product-detail/Multilayer-Ceramic-Capacitors-MLCC-SMD-SMT_SAMSUNG_CL10B104KA8NNNC_100nF-104-10-25V_C1590.html)
      (libsource (lib 3Phase-rescue) (part C_Small-3Phase-rescue) (description ""))
      (sheetpath (names /) (tstamps /))
      (tstamp 6341464E))
    (comp (ref SW2)
      (value SW_DIP_x04)
      (footprint Button_Switch_SMD:SW_DIP_SPSTx04_Slide_Copal_CHS-04B_W7.62mm_P1.27mm)
      (datasheet ~)
      (libsource (lib Components) (part SW_DIP_x04) (description "4x DIP Switch, Single Pole Single Throw (SPST) switch, small symbol"))
      (sheetpath (names /) (tstamps /))
      (tstamp 6341468B))
    (comp (ref R13)
      (value "100k 0.1%")
      (footprint Footprints:R_0603_1608Metric)
      (datasheet https://lcsc.com/product-detail/Chip-Resistor-Surface-Mount_2-2KR-2201-1_C114662.html)
      (libsource (lib 3Phase-rescue) (part R-3Phase-rescue) (description ""))
      (sheetpath (names /) (tstamps /))
      (tstamp 63414695))
    (comp (ref R15)
      (value "50k 0.1%")
      (footprint Footprints:R_0603_1608Metric)
      (datasheet https://lcsc.com/product-detail/Chip-Resistor-Surface-Mount_2-2KR-2201-1_C114662.html)
      (libsource (lib 3Phase-rescue) (part R-3Phase-rescue) (description ""))
      (sheetpath (names /) (tstamps /))
      (tstamp 6341469F))
    (comp (ref R16)
      (value "25k 0.1%")
      (footprint Footprints:R_0603_1608Metric)
      (datasheet https://lcsc.com/product-detail/Chip-Resistor-Surface-Mount_2-2KR-2201-1_C114662.html)
      (libsource (lib 3Phase-rescue) (part R-3Phase-rescue) (description ""))
      (sheetpath (names /) (tstamps /))
      (tstamp 634146A9))
    (comp (ref R17)
      (value "5k6 0.1%")
      (footprint Footprints:R_0603_1608Metric)
      (datasheet https://lcsc.com/product-detail/Chip-Resistor-Surface-Mount_2-2KR-2201-1_C114662.html)
      (libsource (lib 3Phase-rescue) (part R-3Phase-rescue) (description ""))
      (sheetpath (names /) (tstamps /))
      (tstamp 634146B3))
    (comp (ref C2)
      (value "100nF 25v")
      (footprint Footprints:R_0603_1608Metric)
      (datasheet https://lcsc.com/product-detail/Multilayer-Ceramic-Capacitors-MLCC-SMD-SMT_SAMSUNG_CL10B104KA8NNNC_100nF-104-10-25V_C1590.html)
      (libsource (lib 3Phase-rescue) (part C_Small-3Phase-rescue) (description ""))
      (sheetpath (names /) (tstamps /))
      (tstamp 634146CF))
    (comp (ref C16)
      (value "100nF 25v")
      (footprint Footprints:R_0603_1608Metric)
      (datasheet https://lcsc.com/product-detail/Multilayer-Ceramic-Capacitors-MLCC-SMD-SMT_SAMSUNG_CL10B104KA8NNNC_100nF-104-10-25V_C1590.html)
      (libsource (lib 3Phase-rescue) (part C_Small-3Phase-rescue) (description ""))
      (sheetpath (names /) (tstamps /))
      (tstamp 634146D9))
    (comp (ref R45)
      (value "6k9 0.1%")
      (footprint Footprints:R_0603_1608Metric)
      (datasheet https://lcsc.com/product-detail/Chip-Resistor-Surface-Mount_2-2KR-2201-1_C114662.html)
      (libsource (lib 3Phase-rescue) (part R-3Phase-rescue) (description ""))
      (sheetpath (names /) (tstamps /))
      (tstamp 634146EE))
    (comp (ref C20)
      (value "100nF 25v")
      (footprint Footprints:R_0603_1608Metric)
      (datasheet https://lcsc.com/product-detail/Multilayer-Ceramic-Capacitors-MLCC-SMD-SMT_SAMSUNG_CL10B104KA8NNNC_100nF-104-10-25V_C1590.html)
      (libsource (lib 3Phase-rescue) (part C_Small-3Phase-rescue) (description ""))
      (sheetpath (names /) (tstamps /))
      (tstamp 6341470D))
    (comp (ref R49)
      (value 100h)
      (footprint Footprints:R_0603_1608Metric)
      (datasheet https://lcsc.com/product-detail/Chip-Resistor-Surface-Mount_100R-100R-1_C125923.html)
      (libsource (lib 3Phase-rescue) (part R-3Phase-rescue) (description ""))
      (sheetpath (names /) (tstamps /))
      (tstamp 63469E96))
    (comp (ref C24)
      (value "100nF 25v")
      (footprint Footprints:R_0603_1608Metric)
      (datasheet https://lcsc.com/product-detail/Multilayer-Ceramic-Capacitors-MLCC-SMD-SMT_SAMSUNG_CL10B104KA8NNNC_100nF-104-10-25V_C1590.html)
      (libsource (lib 3Phase-rescue) (part C_Small-3Phase-rescue) (description ""))
      (sheetpath (names /) (tstamps /))
      (tstamp 6346A5F2))
    (comp (ref J3)
      (value 95001-6P6C)
      (footprint Footprints:KF2EDGR_2.54x4)
      (libsource (lib 3Phase-rescue) (part CONN_01X04-3Phase-rescue) (description ""))
      (sheetpath (names /) (tstamps /))
      (tstamp 6346A5FC))
    (comp (ref U3)
      (value INA826)
      (footprint Package_SO:VSSOP-8_3.0x3.0mm_P0.65mm)
      (datasheet http://www.ti.com/lit/ds/symlink/ina128.pdf)
      (libsource (lib Components) (part INA826) (description "Precision, Low Power Instrumentation Amplifier G = 1 + 50kOhm/Rg, DIP-8/SOIC-8"))
      (sheetpath (names /) (tstamps /))
      (tstamp 6346A606))
    (comp (ref R2)
      (value 2.2k)
      (footprint Footprints:R_0603_1608Metric)
      (datasheet https://lcsc.com/product-detail/Chip-Resistor-Surface-Mount_2-2KR-2201-1_C114662.html)
      (libsource (lib 3Phase-rescue) (part R-3Phase-rescue) (description ""))
      (sheetpath (names /) (tstamps /))
      (tstamp 6346A610))
    (comp (ref R5)
      (value 2.2k)
      (footprint Footprints:R_0603_1608Metric)
      (datasheet https://lcsc.com/product-detail/Chip-Resistor-Surface-Mount_2-2KR-2201-1_C114662.html)
      (libsource (lib 3Phase-rescue) (part R-3Phase-rescue) (description ""))
      (sheetpath (names /) (tstamps /))
      (tstamp 6346A61A))
    (comp (ref R9)
      (value 2.2k)
      (footprint Footprints:R_0603_1608Metric)
      (datasheet https://lcsc.com/product-detail/Chip-Resistor-Surface-Mount_2-2KR-2201-1_C114662.html)
      (libsource (lib 3Phase-rescue) (part R-3Phase-rescue) (description ""))
      (sheetpath (names /) (tstamps /))
      (tstamp 6346A624))
    (comp (ref R10)
      (value 2.2k)
      (footprint Footprints:R_0603_1608Metric)
      (datasheet https://lcsc.com/product-detail/Chip-Resistor-Surface-Mount_2-2KR-2201-1_C114662.html)
      (libsource (lib 3Phase-rescue) (part R-3Phase-rescue) (description ""))
      (sheetpath (names /) (tstamps /))
      (tstamp 6346A62E))
    (comp (ref C4)
      (value "100nF 25v")
      (footprint Footprints:R_0603_1608Metric)
      (datasheet https://lcsc.com/product-detail/Multilayer-Ceramic-Capacitors-MLCC-SMD-SMT_SAMSUNG_CL10B104KA8NNNC_100nF-104-10-25V_C1590.html)
      (libsource (lib 3Phase-rescue) (part C_Small-3Phase-rescue) (description ""))
      (sheetpath (names /) (tstamps /))
      (tstamp 6346A638))
    (comp (ref SW3)
      (value SW_DIP_x04)
      (footprint Button_Switch_SMD:SW_DIP_SPSTx04_Slide_Copal_CHS-04B_W7.62mm_P1.27mm)
      (datasheet ~)
      (libsource (lib Components) (part SW_DIP_x04) (description "4x DIP Switch, Single Pole Single Throw (SPST) switch, small symbol"))
      (sheetpath (names /) (tstamps /))
      (tstamp 6346A675))
    (comp (ref R19)
      (value "100k 0.1%")
      (footprint Footprints:R_0603_1608Metric)
      (datasheet https://lcsc.com/product-detail/Chip-Resistor-Surface-Mount_2-2KR-2201-1_C114662.html)
      (libsource (lib 3Phase-rescue) (part R-3Phase-rescue) (description ""))
      (sheetpath (names /) (tstamps /))
      (tstamp 6346A67F))
    (comp (ref R20)
      (value "50k 0.1%")
      (footprint Footprints:R_0603_1608Metric)
      (datasheet https://lcsc.com/product-detail/Chip-Resistor-Surface-Mount_2-2KR-2201-1_C114662.html)
      (libsource (lib 3Phase-rescue) (part R-3Phase-rescue) (description ""))
      (sheetpath (names /) (tstamps /))
      (tstamp 6346A689))
    (comp (ref R22)
      (value "25k 0.1%")
      (footprint Footprints:R_0603_1608Metric)
      (datasheet https://lcsc.com/product-detail/Chip-Resistor-Surface-Mount_2-2KR-2201-1_C114662.html)
      (libsource (lib 3Phase-rescue) (part R-3Phase-rescue) (description ""))
      (sheetpath (names /) (tstamps /))
      (tstamp 6346A693))
    (comp (ref R37)
      (value "5k6 0.1%")
      (footprint Footprints:R_0603_1608Metric)
      (datasheet https://lcsc.com/product-detail/Chip-Resistor-Surface-Mount_2-2KR-2201-1_C114662.html)
      (libsource (lib 3Phase-rescue) (part R-3Phase-rescue) (description ""))
      (sheetpath (names /) (tstamps /))
      (tstamp 6346A69D))
    (comp (ref C13)
      (value "100nF 25v")
      (footprint Footprints:R_0603_1608Metric)
      (datasheet https://lcsc.com/product-detail/Multilayer-Ceramic-Capacitors-MLCC-SMD-SMT_SAMSUNG_CL10B104KA8NNNC_100nF-104-10-25V_C1590.html)
      (libsource (lib 3Phase-rescue) (part C_Small-3Phase-rescue) (description ""))
      (sheetpath (names /) (tstamps /))
      (tstamp 6346A6B9))
    (comp (ref C18)
      (value "100nF 25v")
      (footprint Footprints:R_0603_1608Metric)
      (datasheet https://lcsc.com/product-detail/Multilayer-Ceramic-Capacitors-MLCC-SMD-SMT_SAMSUNG_CL10B104KA8NNNC_100nF-104-10-25V_C1590.html)
      (libsource (lib 3Phase-rescue) (part C_Small-3Phase-rescue) (description ""))
      (sheetpath (names /) (tstamps /))
      (tstamp 6346A6C3))
    (comp (ref R46)
      (value "6k9 0.1%")
      (footprint Footprints:R_0603_1608Metric)
      (datasheet https://lcsc.com/product-detail/Chip-Resistor-Surface-Mount_2-2KR-2201-1_C114662.html)
      (libsource (lib 3Phase-rescue) (part R-3Phase-rescue) (description ""))
      (sheetpath (names /) (tstamps /))
      (tstamp 6346A6D8))
    (comp (ref C21)
      (value "100nF 25v")
      (footprint Footprints:R_0603_1608Metric)
      (datasheet https://lcsc.com/product-detail/Multilayer-Ceramic-Capacitors-MLCC-SMD-SMT_SAMSUNG_CL10B104KA8NNNC_100nF-104-10-25V_C1590.html)
      (libsource (lib 3Phase-rescue) (part C_Small-3Phase-rescue) (description ""))
      (sheetpath (names /) (tstamps /))
      (tstamp 6346A6F7))
    (comp (ref R50)
      (value 100h)
      (footprint Footprints:R_0603_1608Metric)
      (datasheet https://lcsc.com/product-detail/Chip-Resistor-Surface-Mount_100R-100R-1_C125923.html)
      (libsource (lib 3Phase-rescue) (part R-3Phase-rescue) (description ""))
      (sheetpath (names /) (tstamps /))
      (tstamp 6346A707))
    (comp (ref C25)
      (value "100nF 25v")
      (footprint Footprints:R_0603_1608Metric)
      (datasheet https://lcsc.com/product-detail/Multilayer-Ceramic-Capacitors-MLCC-SMD-SMT_SAMSUNG_CL10B104KA8NNNC_100nF-104-10-25V_C1590.html)
      (libsource (lib 3Phase-rescue) (part C_Small-3Phase-rescue) (description ""))
      (sheetpath (names /) (tstamps /))
      (tstamp 6346A711))
    (comp (ref J4)
      (value 95001-6P6C)
      (footprint Footprints:KF2EDGR_2.54x4)
      (libsource (lib 3Phase-rescue) (part CONN_01X04-3Phase-rescue) (description ""))
      (sheetpath (names /) (tstamps /))
      (tstamp 6346A71B))
    (comp (ref U4)
      (value INA826)
      (footprint Package_SO:VSSOP-8_3.0x3.0mm_P0.65mm)
      (datasheet http://www.ti.com/lit/ds/symlink/ina128.pdf)
      (libsource (lib Components) (part INA826) (description "Precision, Low Power Instrumentation Amplifier G = 1 + 50kOhm/Rg, DIP-8/SOIC-8"))
      (sheetpath (names /) (tstamps /))
      (tstamp 6346A725))
    (comp (ref R3)
      (value 2.2k)
      (footprint Footprints:R_0603_1608Metric)
      (datasheet https://lcsc.com/product-detail/Chip-Resistor-Surface-Mount_2-2KR-2201-1_C114662.html)
      (libsource (lib 3Phase-rescue) (part R-3Phase-rescue) (description ""))
      (sheetpath (names /) (tstamps /))
      (tstamp 6346A72F))
    (comp (ref R6)
      (value 2.2k)
      (footprint Footprints:R_0603_1608Metric)
      (datasheet https://lcsc.com/product-detail/Chip-Resistor-Surface-Mount_2-2KR-2201-1_C114662.html)
      (libsource (lib 3Phase-rescue) (part R-3Phase-rescue) (description ""))
      (sheetpath (names /) (tstamps /))
      (tstamp 6346A739))
    (comp (ref R11)
      (value 2.2k)
      (footprint Footprints:R_0603_1608Metric)
      (datasheet https://lcsc.com/product-detail/Chip-Resistor-Surface-Mount_2-2KR-2201-1_C114662.html)
      (libsource (lib 3Phase-rescue) (part R-3Phase-rescue) (description ""))
      (sheetpath (names /) (tstamps /))
      (tstamp 6346A743))
    (comp (ref R12)
      (value 2.2k)
      (footprint Footprints:R_0603_1608Metric)
      (datasheet https://lcsc.com/product-detail/Chip-Resistor-Surface-Mount_2-2KR-2201-1_C114662.html)
      (libsource (lib 3Phase-rescue) (part R-3Phase-rescue) (description ""))
      (sheetpath (names /) (tstamps /))
      (tstamp 6346A74D))
    (comp (ref C14)
      (value "100nF 25v")
      (footprint Footprints:R_0603_1608Metric)
      (datasheet https://lcsc.com/product-detail/Multilayer-Ceramic-Capacitors-MLCC-SMD-SMT_SAMSUNG_CL10B104KA8NNNC_100nF-104-10-25V_C1590.html)
      (libsource (lib 3Phase-rescue) (part C_Small-3Phase-rescue) (description ""))
      (sheetpath (names /) (tstamps /))
      (tstamp 6346A757))
    (comp (ref SW4)
      (value SW_DIP_x04)
      (footprint Button_Switch_SMD:SW_DIP_SPSTx04_Slide_Copal_CHS-04B_W7.62mm_P1.27mm)
      (datasheet ~)
      (libsource (lib Components) (part SW_DIP_x04) (description "4x DIP Switch, Single Pole Single Throw (SPST) switch, small symbol"))
      (sheetpath (names /) (tstamps /))
      (tstamp 6346A794))
    (comp (ref R41)
      (value "100k 0.1%")
      (footprint Footprints:R_0603_1608Metric)
      (datasheet https://lcsc.com/product-detail/Chip-Resistor-Surface-Mount_2-2KR-2201-1_C114662.html)
      (libsource (lib 3Phase-rescue) (part R-3Phase-rescue) (description ""))
      (sheetpath (names /) (tstamps /))
      (tstamp 6346A79E))
    (comp (ref R42)
      (value "50k 0.1%")
      (footprint Footprints:R_0603_1608Metric)
      (datasheet https://lcsc.com/product-detail/Chip-Resistor-Surface-Mount_2-2KR-2201-1_C114662.html)
      (libsource (lib 3Phase-rescue) (part R-3Phase-rescue) (description ""))
      (sheetpath (names /) (tstamps /))
      (tstamp 6346A7A8))
    (comp (ref R43)
      (value "25k 0.1%")
      (footprint Footprints:R_0603_1608Metric)
      (datasheet https://lcsc.com/product-detail/Chip-Resistor-Surface-Mount_2-2KR-2201-1_C114662.html)
      (libsource (lib 3Phase-rescue) (part R-3Phase-rescue) (description ""))
      (sheetpath (names /) (tstamps /))
      (tstamp 6346A7B2))
    (comp (ref R44)
      (value "5k6 0.1%")
      (footprint Footprints:R_0603_1608Metric)
      (datasheet https://lcsc.com/product-detail/Chip-Resistor-Surface-Mount_2-2KR-2201-1_C114662.html)
      (libsource (lib 3Phase-rescue) (part R-3Phase-rescue) (description ""))
      (sheetpath (names /) (tstamps /))
      (tstamp 6346A7BC))
    (comp (ref C15)
      (value "100nF 25v")
      (footprint Footprints:R_0603_1608Metric)
      (datasheet https://lcsc.com/product-detail/Multilayer-Ceramic-Capacitors-MLCC-SMD-SMT_SAMSUNG_CL10B104KA8NNNC_100nF-104-10-25V_C1590.html)
      (libsource (lib 3Phase-rescue) (part C_Small-3Phase-rescue) (description ""))
      (sheetpath (names /) (tstamps /))
      (tstamp 6346A7D8))
    (comp (ref C19)
      (value "100nF 25v")
      (footprint Footprints:R_0603_1608Metric)
      (datasheet https://lcsc.com/product-detail/Multilayer-Ceramic-Capacitors-MLCC-SMD-SMT_SAMSUNG_CL10B104KA8NNNC_100nF-104-10-25V_C1590.html)
      (libsource (lib 3Phase-rescue) (part C_Small-3Phase-rescue) (description ""))
      (sheetpath (names /) (tstamps /))
      (tstamp 6346A7E2))
    (comp (ref R47)
      (value "6k9 0.1%")
      (footprint Footprints:R_0603_1608Metric)
      (datasheet https://lcsc.com/product-detail/Chip-Resistor-Surface-Mount_2-2KR-2201-1_C114662.html)
      (libsource (lib 3Phase-rescue) (part R-3Phase-rescue) (description ""))
      (sheetpath (names /) (tstamps /))
      (tstamp 6346A7F7))
    (comp (ref C22)
      (value "100nF 25v")
      (footprint Footprints:R_0603_1608Metric)
      (datasheet https://lcsc.com/product-detail/Multilayer-Ceramic-Capacitors-MLCC-SMD-SMT_SAMSUNG_CL10B104KA8NNNC_100nF-104-10-25V_C1590.html)
      (libsource (lib 3Phase-rescue) (part C_Small-3Phase-rescue) (description ""))
      (sheetpath (names /) (tstamps /))
      (tstamp 6346A816))
    (comp (ref R57)
      (value 2.2k)
      (footprint Footprints:R_0603_1608Metric)
      (datasheet https://lcsc.com/product-detail/Chip-Resistor-Surface-Mount_2-2KR-2201-1_C114662.html)
      (libsource (lib 3Phase-rescue) (part R-3Phase-rescue) (description ""))
      (sheetpath (names /) (tstamps /))
      (tstamp 61F8F42D))
    (comp (ref J6)
      (value Conn_01x16_Male)
      (footprint Connector_PinSocket_2.54mm:PinSocket_1x16_P2.54mm_Vertical)
      (datasheet ~)
      (libsource (lib Connector) (part Conn_01x16_Male) (description "Generic connector, single row, 01x16, script generated (kicad-library-utils/schlib/autogen/connector/)"))
      (sheetpath (names /) (tstamps /))
      (tstamp 60D13074))
    (comp (ref PS1)
      (value AC-DC)
      (footprint Footprints:AC-DC_Aliexpress)
      (datasheet http://www.hlktech.net/product_detail.php?ProId=54)
      (libsource (lib Components) (part AC-DC) (description "Compact AC/DC board mount power module 3W 5V"))
      (sheetpath (names /) (tstamps /))
      (tstamp 60FF32A6))
    (comp (ref P6)
      (value "3.81x4 terminal block")
      (footprint Footprints:PhoenixContact_MC_1,5_2-G-3.81_1x02_P3.81mm_Horizontal)
      (datasheet https://lcsc.com/product-detail/Pluggable-System-Terminal-Block_Ningbo-Kangnex-Elec-WJ15EDGRC-3-81-4P_C7245.html)
      (libsource (lib Components) (part Conn_01x02) (description "Generic connector, single row, 01x03, script generated (kicad-library-utils/schlib/autogen/connector/)"))
      (sheetpath (names /) (tstamps /))
      (tstamp 6993C0AD))
    (comp (ref U11)
      (value SSR_MOSFET_DIP4)
      (footprint Package_DIP:DIP-4_W7.62mm)
      (datasheet https://docs.broadcom.com/docs/AV02-0173EN)
      (libsource (lib Components) (part SSR_MOSFET_DIP4) (description "Form A, Solid State Relay (Photo MOSFET) 60V, 0.2A, 10Ohm, SO-4"))
      (sheetpath (names /) (tstamps /))
      (tstamp 699206B6))
    (comp (ref F1)
      (value Fuse)
      (footprint Fuse:Fuse_Littelfuse_395Series)
      (datasheet ~)
      (libsource (lib Device) (part Fuse) (description Fuse))
      (sheetpath (names /) (tstamps /))
      (tstamp 653D1796))
    (comp (ref P5)
      (value "3.81x4 terminal block")
      (footprint Footprints:PhoenixContact_MC_1,5_2-G-3.81_1x02_P3.81mm_Horizontal)
      (datasheet https://lcsc.com/product-detail/Pluggable-System-Terminal-Block_Ningbo-Kangnex-Elec-WJ15EDGRC-3-81-4P_C7245.html)
      (libsource (lib Components) (part Conn_01x02) (description "Generic connector, single row, 01x03, script generated (kicad-library-utils/schlib/autogen/connector/)"))
      (sheetpath (names /) (tstamps /))
      (tstamp 6519880B))
    (comp (ref RV1)
      (value 05D391K)
      (footprint Footprints:RV_Disc_D7mm_W3.4mm_P5mm)
      (datasheet https://lcsc.com/product-detail/Varistors_VDR-Varistor-VDR-05D391K_C283919.html)
      (libsource (lib 3Phase-rescue) (part Varistor-3Phase-rescue) (description ""))
      (sheetpath (names /) (tstamps /))
      (tstamp 5BDB8784))
    (comp (ref J7)
      (value 95001-6P6C)
      (footprint Footprints:KF2EDGR_2.54x4)
      (libsource (lib 3Phase-rescue) (part CONN_01X04-3Phase-rescue) (description ""))
      (sheetpath (names /) (tstamps /))
      (tstamp 60E2E7C5)))
  (libparts
    (libpart (lib 3Phase-rescue) (part CONN_01X04-3Phase-rescue)
      (footprints
        (fp Pin_Header_Straight_1X04)
        (fp Pin_Header_Angled_1X04)
        (fp Socket_Strip_Straight_1X04)
        (fp Socket_Strip_Angled_1X04))
      (fields
        (field (name Reference) P)
        (field (name Value) CONN_01X04-3Phase-rescue))
      (pins
        (pin (num 1) (name P1) (type passive))
        (pin (num 2) (name P2) (type passive))
        (pin (num 3) (name P3) (type passive))
        (pin (num 4) (name P4) (type passive))))
    (libpart (lib 3Phase-rescue) (part C_Small-3Phase-rescue)
      (footprints
        (fp C?)
        (fp C_????_*)
        (fp C_????)
        (fp SMD*_c)
        (fp Capacitor*))
      (fields
        (field (name Reference) C)
        (field (name Value) C_Small-3Phase-rescue))
      (pins
        (pin (num 1) (name ~) (type passive))
        (pin (num 2) (name ~) (type passive))))
    (libpart (lib 3Phase-rescue) (part R-3Phase-rescue)
      (footprints
        (fp R_*)
        (fp Resistor_*))
      (fields
        (field (name Reference) R)
        (field (name Value) R-3Phase-rescue))
      (pins
        (pin (num 1) (name ~) (type passive))
        (pin (num 2) (name ~) (type passive))))
    (libpart (lib 3Phase-rescue) (part Varistor-3Phase-rescue)
      (footprints
        (fp RV_*)
        (fp Varistor*))
      (fields
        (field (name Reference) RV)
        (field (name Value) Varistor-3Phase-rescue))
      (pins
        (pin (num 1) (name ~) (type passive))
        (pin (num 2) (name ~) (type passive))))
    (libpart (lib Components) (part AC-DC)
      (aliases
        (alias HLK-PM03)
        (alias HLK-PM12)
        (alias HLK-PM24))
      (description "Compact AC/DC board mount power module 3W 5V")
      (docs http://www.hlktech.net/product_detail.php?ProId=54)
      (footprints
        (fp Converter*ACDC*HiLink*HLK?PM*))
      (fields
        (field (name Reference) PS)
        (field (name Value) AC-DC)
        (field (name Footprint) Converter_ACDC:Converter_ACDC_HiLink_HLK-PMxx))
      (pins
        (pin (num 1) (name AC/N) (type power_in))
        (pin (num 2) (name AC/L) (type power_in))
        (pin (num 3) (name -Vout) (type power_out))
        (pin (num 4) (name +Vout) (type power_out))))
    (libpart (lib Components) (part B0505D-1W)
      (aliases
        (alias CRE1S0305S3C))
      (description "5V to 5V 200mA, Isolated 2W Single-Output DC-DC Converter Modules with 3kV isolation, SIP-4")
      (docs http://power.murata.com/datasheet?/data/power/ncl/kdc_cre1.pdf)
      (footprints
        (fp Converter*DCDC*muRata*CRE1xxxxxx3C*))
      (fields
        (field (name Reference) U)
        (field (name Value) B0505D-1W)
        (field (name Footprint) Converter_DCDC:Converter_DCDC_muRata_CRE1xxxxxx3C_THT))
      (pins
        (pin (num 1) (name -IN) (type power_in))
        (pin (num 2) (name +IN) (type power_in))
        (pin (num 3) (name -VOUT) (type power_out))
        (pin (num 4) (name +VOUT) (type power_out))))
    (libpart (lib Components) (part Conn_01x02)
      (description "Generic connector, single row, 01x03, script generated (kicad-library-utils/schlib/autogen/connector/)")
      (docs ~)
      (footprints
        (fp Connector*:*_1x??_*))
      (fields
        (field (name Reference) J)
        (field (name Value) Conn_01x02))
      (pins
        (pin (num 1) (name Pin_1) (type passive))
        (pin (num 2) (name Pin_2) (type passive))))
    (libpart (lib Components) (part Conn_01x03)
      (description "Generic connector, single row, 01x03, script generated (kicad-library-utils/schlib/autogen/connector/)")
      (docs ~)
      (footprints
        (fp Connector*:*_1x??_*))
      (fields
        (field (name Reference) J)
        (field (name Value) Conn_01x03))
      (pins
        (pin (num 1) (name Pin_1) (type passive))
        (pin (num 2) (name Pin_2) (type passive))
        (pin (num 3) (name Pin_3) (type passive))))
    (libpart (lib Components) (part INA826)
      (aliases
        (alias INA129))
      (description "Precision, Low Power Instrumentation Amplifier G = 1 + 50kOhm/Rg, DIP-8/SOIC-8")
      (docs http://www.ti.com/lit/ds/symlink/ina128.pdf)
      (footprints
        (fp DIP*W7.62mm*)
        (fp SOIC*P1.27mm*))
      (fields
        (field (name Reference) U)
        (field (name Value) INA826))
      (pins
        (pin (num 1) (name Rg) (type passive))
        (pin (num 2) (name -) (type input))
        (pin (num 3) (name +) (type input))
        (pin (num 4) (name V-) (type power_in))
        (pin (num 5) (name Ref) (type input))
        (pin (num 6) (name ~) (type output))
        (pin (num 7) (name V+) (type power_in))
        (pin (num 8) (name Rg) (type passive))))
    (libpart (lib Components) (part NanoPi)
      (footprints
        (fp NanoPI*))
      (fields
        (field (name Reference) U)
        (field (name Value) NanoPi))
      (pins
        (pin (num DM) (name DM) (type input))
        (pin (num DP) (name DP) (type input))
        (pin (num GND) (name GND) (type input))
        (pin (num Vcc) (name Vcc) (type input))))
    (libpart (lib Components) (part SI8921BB)
      (aliases
        (alias ACPL-C79A)
        (alias ACPL-C79B))
      (footprints
        (fp SSO*6.8x5.9mm*P1.27mm*Clearance8mm*))
      (fields
        (field (name Reference) U)
        (field (name Value) SI8921BB)
        (field (name Footprint) Package_SO:SOIC-8_3.9x4.9mm_P1.27mm))
      (pins
        (pin (num 1) (name VDD1) (type power_in))
        (pin (num 2) (name IN+) (type input))
        (pin (num 3) (name IN-) (type input))
        (pin (num 4) (name GND1) (type power_in))
        (pin (num 5) (name GND2) (type power_in))
        (pin (num 6) (name OUT-) (type output))
        (pin (num 7) (name OUT+) (type output))
        (pin (num 8) (name VDD2) (type power_in))))
    (libpart (lib Components) (part SSR_MOSFET_DIP4)
      (description "Form A, Solid State Relay (Photo MOSFET) 60V, 0.2A, 10Ohm, SO-4")
      (docs https://docs.broadcom.com/docs/AV02-0173EN)
      (footprints
        (fp SO*4.4x4.3mm*P2.54mm*))
      (fields
        (field (name Reference) U)
        (field (name Value) SSR_MOSFET_DIP4)
        (field (name Footprint) Package_SO:SO-4_4.4x4.3mm_P2.54mm))
      (pins
        (pin (num 1) (name ~) (type passive))
        (pin (num 2) (name ~) (type passive))
        (pin (num 3) (name ~) (type passive))
        (pin (num 4) (name ~) (type passive))))
    (libpart (lib Components) (part STM32F042)
      (fields
        (field (name Reference) U)
        (field (name Value) STM32F042))
      (pins
        (pin (num 1) (name VDD) (type power_in))
        (pin (num 2) (name PF0) (type output))
        (pin (num 3) (name PF1) (type output))
        (pin (num 4) (name ~RST) (type input))
        (pin (num 5) (name VDDA) (type power_in))
        (pin (num 6) (name WKUP1) (type input))
        (pin (num 7) (name PA1) (type output))
        (pin (num 8) (name ADC2) (type input))
        (pin (num 9) (name ADC3) (type input))
        (pin (num 10) (name ADC4) (type input))
        (pin (num 11) (name ADC5) (type input))
        (pin (num 12) (name ADC6) (type input))
        (pin (num 13) (name ADC7) (type input))
        (pin (num 14) (name ADC8) (type input))
        (pin (num 15) (name ADC9) (type input))
        (pin (num 16) (name GND) (type power_in))
        (pin (num 17) (name VDDIO2) (type power_in))
        (pin (num 18) (name PA8) (type output))
        (pin (num 19) (name PA9) (type output))
        (pin (num 20) (name PA10) (type output))
        (pin (num 21) (name USB-) (type BiDi))
        (pin (num 22) (name USB+) (type BiDi))
        (pin (num 23) (name SWDIO) (type output))
        (pin (num 24) (name SWDCK) (type output))
        (pin (num 25) (name PA15) (type output))
        (pin (num 26) (name PB3) (type output))
        (pin (num 27) (name PB4) (type output))
        (pin (num 28) (name PB5) (type output))
        (pin (num 29) (name PB6) (type output))
        (pin (num 30) (name PB7) (type input))
        (pin (num 31) (name PB8/BOOT0) (type BiDi))
        (pin (num 32) (name GND) (type power_in))))
    (libpart (lib Components) (part SW_DIP_x04)
      (description "4x DIP Switch, Single Pole Single Throw (SPST) switch, small symbol")
      (docs ~)
      (footprints
        (fp SW?DIP?x4*))
      (fields
        (field (name Reference) SW)
        (field (name Value) SW_DIP_x04))
      (pins
        (pin (num 1) (name ~) (type passive))
        (pin (num 2) (name ~) (type passive))
        (pin (num 3) (name ~) (type passive))
        (pin (num 4) (name ~) (type passive))
        (pin (num 5) (name ~) (type passive))
        (pin (num 6) (name ~) (type passive))
        (pin (num 7) (name ~) (type passive))
        (pin (num 8) (name ~) (type passive))))
    (libpart (lib Connector) (part Conn_01x16_Male)
      (description "Generic connector, single row, 01x16, script generated (kicad-library-utils/schlib/autogen/connector/)")
      (docs ~)
      (footprints
        (fp Connector*:*_1x??_*))
      (fields
        (field (name Reference) J)
        (field (name Value) Conn_01x16_Male))
      (pins
        (pin (num 1) (name Pin_1) (type passive))
        (pin (num 2) (name Pin_2) (type passive))
        (pin (num 3) (name Pin_3) (type passive))
        (pin (num 4) (name Pin_4) (type passive))
        (pin (num 5) (name Pin_5) (type passive))
        (pin (num 6) (name Pin_6) (type passive))
        (pin (num 7) (name Pin_7) (type passive))
        (pin (num 8) (name Pin_8) (type passive))
        (pin (num 9) (name Pin_9) (type passive))
        (pin (num 10) (name Pin_10) (type passive))
        (pin (num 11) (name Pin_11) (type passive))
        (pin (num 12) (name Pin_12) (type passive))
        (pin (num 13) (name Pin_13) (type passive))
        (pin (num 14) (name Pin_14) (type passive))
        (pin (num 15) (name Pin_15) (type passive))
        (pin (num 16) (name Pin_16) (type passive))))
    (libpart (lib Device) (part Fuse)
      (description Fuse)
      (docs ~)
      (footprints
        (fp *Fuse*))
      (fields
        (field (name Reference) F)
        (field (name Value) Fuse))
      (pins
        (pin (num 1) (name ~) (type passive))
        (pin (num 2) (name ~) (type passive))))
    (libpart (lib MCU_ST_STM32F3) (part STM32F301C6Tx)
      (aliases
        (alias STM32F301C8Tx))
      (description "ARM Cortex-M4 MCU, 32KB flash, 16KB RAM, 72MHz, 2-3.6V, 37 GPIO, LQFP-48")
      (docs http://www.st.com/st-web-ui/static/active/en/resource/technical/document/datasheet/DM00093332.pdf)
      (footprints
        (fp LQFP*7x7mm*P0.5mm*))
      (fields
        (field (name Reference) U)
        (field (name Value) STM32F301C6Tx)
        (field (name Footprint) Package_QFP:LQFP-48_7x7mm_P0.5mm))
      (pins
        (pin (num 1) (name VBAT) (type power_in))
        (pin (num 2) (name PC13) (type BiDi))
        (pin (num 3) (name PC14) (type BiDi))
        (pin (num 4) (name PC15) (type BiDi))
        (pin (num 5) (name PF0) (type input))
        (pin (num 6) (name PF1) (type input))
        (pin (num 7) (name NRST) (type input))
        (pin (num 8) (name VSSA) (type power_in))
        (pin (num 9) (name VDDA) (type power_in))
        (pin (num 10) (name PA0) (type BiDi))
        (pin (num 11) (name PA1) (type BiDi))
        (pin (num 12) (name PA2) (type BiDi))
        (pin (num 13) (name PA3) (type BiDi))
        (pin (num 14) (name PA4) (type BiDi))
        (pin (num 15) (name PA5) (type BiDi))
        (pin (num 16) (name PA6) (type BiDi))
        (pin (num 17) (name PA7) (type BiDi))
        (pin (num 18) (name PB0) (type BiDi))
        (pin (num 19) (name PB1) (type BiDi))
        (pin (num 20) (name PB2) (type BiDi))
        (pin (num 21) (name PB10) (type BiDi))
        (pin (num 22) (name PB11) (type BiDi))
        (pin (num 23) (name VSS) (type power_in))
        (pin (num 24) (name VDD) (type power_in))
        (pin (num 25) (name PB12) (type BiDi))
        (pin (num 26) (name PB13) (type BiDi))
        (pin (num 27) (name PB14) (type BiDi))
        (pin (num 28) (name PB15) (type BiDi))
        (pin (num 29) (name PA8) (type BiDi))
        (pin (num 30) (name PA9) (type BiDi))
        (pin (num 31) (name PA10) (type BiDi))
        (pin (num 32) (name PA11) (type BiDi))
        (pin (num 33) (name PA12) (type BiDi))
        (pin (num 34) (name PA13) (type BiDi))
        (pin (num 35) (name VSS) (type power_in))
        (pin (num 36) (name VDD) (type power_in))
        (pin (num 37) (name PA14) (type BiDi))
        (pin (num 38) (name PA15) (type BiDi))
        (pin (num 39) (name PB3) (type BiDi))
        (pin (num 40) (name PB4) (type BiDi))
        (pin (num 41) (name PB5) (type BiDi))
        (pin (num 42) (name PB6) (type BiDi))
        (pin (num 43) (name PB7) (type BiDi))
        (pin (num 44) (name BOOT0) (type input))
        (pin (num 45) (name PB8) (type BiDi))
        (pin (num 46) (name PB9) (type BiDi))
        (pin (num 47) (name VSS) (type power_in))
        (pin (num 48) (name VDD) (type power_in)))))
  (libraries
    (library (logical 3Phase-rescue)
      (uri /home/edu/Proyectos/openZmeter/Hardware/DeviceV2_03/PCB_B/3Phase-rescue.lib))
    (library (logical Components)
      (uri /home/edu/Proyectos/openZmeter/Hardware/DeviceV2_03/PCB_B/Components.lib))
    (library (logical Connector)
      (uri /usr/share/kicad/library/Connector.lib))
    (library (logical Device)
      (uri /usr/share/kicad/library/Device.lib))
    (library (logical MCU_ST_STM32F3)
      (uri /usr/share/kicad/library/MCU_ST_STM32F3.lib)))
  (nets
    (net (code 1) (name "Net-(R17-Pad1)")
      (node (ref R17) (pin 1))
      (node (ref R45) (pin 2)))
    (net (code 2) (name GND)
      (node (ref C25) (pin 2))
      (node (ref J4) (pin 4))
      (node (ref U4) (pin 4))
      (node (ref C21) (pin 2))
      (node (ref J6) (pin 4))
      (node (ref J6) (pin 5))
      (node (ref R3) (pin 2))
      (node (ref R6) (pin 2))
      (node (ref C13) (pin 1))
      (node (ref C18) (pin 1))
      (node (ref C22) (pin 2))
      (node (ref C23) (pin 2))
      (node (ref J2) (pin 4))
      (node (ref R4) (pin 2))
      (node (ref U2) (pin 4))
      (node (ref R1) (pin 2))
      (node (ref C15) (pin 1))
      (node (ref PS1) (pin 3))
      (node (ref C19) (pin 1))
      (node (ref U1) (pin 4))
      (node (ref C5) (pin 1))
      (node (ref U18) (pin 1))
      (node (ref U16) (pin 1))
      (node (ref C45) (pin 1))
      (node (ref U17) (pin 1))
      (node (ref U15) (pin 5))
      (node (ref R33) (pin 2))
      (node (ref R36) (pin 2))
      (node (ref U13) (pin 16))
      (node (ref P2) (pin GND))
      (node (ref C7) (pin 2))
      (node (ref J1) (pin 4))
      (node (ref U13) (pin 32))
      (node (ref U6) (pin 5))
      (node (ref U14) (pin 5))
      (node (ref C3) (pin 1))
      (node (ref C28) (pin 1))
      (node (ref J5) (pin 3))
      (node (ref C2) (pin 1))
      (node (ref J3) (pin 4))
      (node (ref C17) (pin 1))
      (node (ref C12) (pin 1))
      (node (ref C6) (pin 2))
      (node (ref C24) (pin 2))
      (node (ref C20) (pin 2))
      (node (ref R2) (pin 2))
      (node (ref R5) (pin 2))
      (node (ref C16) (pin 1))
      (node (ref U3) (pin 4)))
    (net (code 3) (name IN_3)
      (node (ref C25) (pin 1))
      (node (ref R50) (pin 2))
      (node (ref C7) (pin 1))
      (node (ref R48) (pin 2))
      (node (ref C23) (pin 1))
      (node (ref C24) (pin 1))
      (node (ref R49) (pin 2))
      (node (ref R14) (pin 2)))
    (net (code 4) (name "Net-(R49-Pad1)")
      (node (ref R49) (pin 1))
      (node (ref U3) (pin 6)))
    (net (code 5) (name 5V)
      (node (ref C21) (pin 1))
      (node (ref U3) (pin 7))
      (node (ref C3) (pin 2))
      (node (ref J4) (pin 1))
      (node (ref J1) (pin 1))
      (node (ref U4) (pin 7))
      (node (ref J3) (pin 1))
      (node (ref U17) (pin 2))
      (node (ref U15) (pin 8))
      (node (ref C5) (pin 2))
      (node (ref U1) (pin 7))
      (node (ref U14) (pin 8))
      (node (ref U16) (pin 2))
      (node (ref C20) (pin 1))
      (node (ref U6) (pin 8))
      (node (ref C45) (pin 2))
      (node (ref C6) (pin 1))
      (node (ref C22) (pin 1))
      (node (ref J2) (pin 1))
      (node (ref U18) (pin 2))
      (node (ref U2) (pin 7)))
    (net (code 6) (name "Net-(R13-Pad2)")
      (node (ref R13) (pin 2))
      (node (ref SW2) (pin 8)))
    (net (code 7) (name "Net-(R15-Pad2)")
      (node (ref SW2) (pin 7))
      (node (ref R15) (pin 2)))
    (net (code 8) (name "Net-(R16-Pad2)")
      (node (ref SW2) (pin 6))
      (node (ref R16) (pin 2)))
    (net (code 9) (name "Net-(R17-Pad2)")
      (node (ref SW2) (pin 5))
      (node (ref R17) (pin 2)))
    (net (code 10) (name "Net-(SW2-Pad1)")
      (node (ref U2) (pin 1))
      (node (ref SW2) (pin 2))
      (node (ref SW2) (pin 1))
      (node (ref SW2) (pin 3))
      (node (ref SW2) (pin 4)))
    (net (code 11) (name "Net-(R13-Pad1)")
      (node (ref R15) (pin 1))
      (node (ref R45) (pin 1))
      (node (ref R13) (pin 1))
      (node (ref R16) (pin 1))
      (node (ref U2) (pin 8)))
    (net (code 12) (name REF_1.25)
      (node (ref U2) (pin 5))
      (node (ref U4) (pin 5))
      (node (ref U3) (pin 5))
      (node (ref U1) (pin 5)))
    (net (code 13) (name "Net-(R19-Pad2)")
      (node (ref R19) (pin 2))
      (node (ref SW3) (pin 8)))
    (net (code 14) (name "Net-(R20-Pad2)")
      (node (ref R20) (pin 2))
      (node (ref SW3) (pin 7)))
    (net (code 15) (name "Net-(R22-Pad2)")
      (node (ref R22) (pin 2))
      (node (ref SW3) (pin 6)))
    (net (code 16) (name "Net-(R37-Pad2)")
      (node (ref SW3) (pin 5))
      (node (ref R37) (pin 2)))
    (net (code 17) (name "Net-(J3-Pad3)")
      (node (ref J3) (pin 3))
      (node (ref R10) (pin 2))
      (node (ref R5) (pin 1)))
    (net (code 18) (name "Net-(J3-Pad2)")
      (node (ref R9) (pin 2))
      (node (ref J3) (pin 2))
      (node (ref R2) (pin 1)))
    (net (code 19) (name "Net-(R19-Pad1)")
      (node (ref R20) (pin 1))
      (node (ref U3) (pin 8))
      (node (ref R19) (pin 1))
      (node (ref R22) (pin 1))
      (node (ref R46) (pin 1)))
    (net (code 20) (name "Net-(C13-Pad2)")
      (node (ref R10) (pin 1))
      (node (ref C4) (pin 1))
      (node (ref C13) (pin 2))
      (node (ref U3) (pin 2)))
    (net (code 21) (name "Net-(SW3-Pad1)")
      (node (ref SW3) (pin 2))
      (node (ref U3) (pin 1))
      (node (ref SW3) (pin 4))
      (node (ref SW3) (pin 3))
      (node (ref SW3) (pin 1)))
    (net (code 22) (name "Net-(R64-Pad1)")
      (node (ref R64) (pin 1))
      (node (ref R73) (pin 2)))
    (net (code 23) (name "Net-(C11-Pad1)")
      (node (ref U1) (pin 2))
      (node (ref C12) (pin 2))
      (node (ref C11) (pin 1))
      (node (ref R56) (pin 1)))
    (net (code 24) (name "Net-(SW1-Pad1)")
      (node (ref SW1) (pin 3))
      (node (ref SW1) (pin 2))
      (node (ref U1) (pin 1))
      (node (ref SW1) (pin 1))
      (node (ref SW1) (pin 4)))
    (net (code 25) (name "Net-(R59-Pad2)")
      (node (ref SW1) (pin 8))
      (node (ref R59) (pin 2)))
    (net (code 26) (name "Net-(R62-Pad2)")
      (node (ref SW1) (pin 7))
      (node (ref R62) (pin 2)))
    (net (code 27) (name "Net-(R63-Pad2)")
      (node (ref SW1) (pin 6))
      (node (ref R63) (pin 2)))
    (net (code 28) (name "Net-(R64-Pad2)")
      (node (ref R64) (pin 2))
      (node (ref SW1) (pin 5)))
    (net (code 29) (name "Net-(R59-Pad1)")
      (node (ref R63) (pin 1))
      (node (ref U1) (pin 8))
      (node (ref R73) (pin 1))
      (node (ref R62) (pin 1))
      (node (ref R59) (pin 1)))
    (net (code 30) (name "Net-(C1-Pad2)")
      (node (ref C16) (pin 2))
      (node (ref C1) (pin 2))
      (node (ref U2) (pin 3))
      (node (ref R7) (pin 1)))
    (net (code 31) (name "Net-(R48-Pad1)")
      (node (ref U2) (pin 6))
      (node (ref R48) (pin 1)))
    (net (code 32) (name "Net-(C1-Pad1)")
      (node (ref C2) (pin 2))
      (node (ref R8) (pin 1))
      (node (ref C1) (pin 1))
      (node (ref U2) (pin 2)))
    (net (code 33) (name "Net-(J2-Pad3)")
      (node (ref R4) (pin 1))
      (node (ref R8) (pin 2))
      (node (ref J2) (pin 3)))
    (net (code 34) (name "Net-(J2-Pad2)")
      (node (ref R7) (pin 2))
      (node (ref J2) (pin 2))
      (node (ref R1) (pin 1)))
    (net (code 35) (name "Net-(R57-Pad2)")
      (node (ref R57) (pin 2)))
    (net (code 36) (name "Net-(R57-Pad1)")
      (node (ref R57) (pin 1)))
    (net (code 37) (name Vin)
      (node (ref PS1) (pin 4))
      (node (ref J6) (pin 9))
      (node (ref J6) (pin 8)))
    (net (code 38) (name 5v)
      (node (ref J6) (pin 7))
      (node (ref J6) (pin 6)))
    (net (code 39) (name LCD_CS)
      (node (ref J6) (pin 16)))
    (net (code 40) (name LCD_A0)
      (node (ref J6) (pin 15)))
    (net (code 41) (name MCLK)
      (node (ref J6) (pin 14)))
    (net (code 42) (name EN)
      (node (ref J6) (pin 10)))
    (net (code 43) (name LCD_BL)
      (node (ref J6) (pin 11)))
    (net (code 44) (name Beep)
      (node (ref J6) (pin 12)))
    (net (code 45) (name MOSI)
      (node (ref J6) (pin 13)))
    (net (code 46) (name "Net-(R44-Pad2)")
      (node (ref SW4) (pin 5))
      (node (ref R44) (pin 2)))
    (net (code 47) (name "Net-(R43-Pad2)")
      (node (ref SW4) (pin 6))
      (node (ref R43) (pin 2)))
    (net (code 48) (name "Net-(R42-Pad2)")
      (node (ref SW4) (pin 7))
      (node (ref R42) (pin 2)))
    (net (code 49) (name "Net-(R41-Pad2)")
      (node (ref R41) (pin 2))
      (node (ref SW4) (pin 8)))
    (net (code 50) (name "Net-(R41-Pad1)")
      (node (ref R41) (pin 1))
      (node (ref R47) (pin 1))
      (node (ref R42) (pin 1))
      (node (ref U4) (pin 8))
      (node (ref R43) (pin 1)))
    (net (code 51) (name "Net-(R44-Pad1)")
      (node (ref R44) (pin 1))
      (node (ref R47) (pin 2)))
    (net (code 52) (name "Net-(F1-Pad2)")
      (node (ref P5) (pin 2))
      (node (ref F1) (pin 2)))
    (net (code 53) (name "Net-(P6-Pad2)")
      (node (ref U11) (pin 4))
      (node (ref P6) (pin 2)))
    (net (code 54) (name "Net-(U11-Pad2)")
      (node (ref U11) (pin 2)))
    (net (code 55) (name "Net-(U11-Pad1)")
      (node (ref U11) (pin 1)))
    (net (code 56) (name "Net-(P6-Pad1)")
      (node (ref P6) (pin 1))
      (node (ref U11) (pin 3)))
    (net (code 57) (name "Net-(F1-Pad1)")
      (node (ref RV1) (pin 2))
      (node (ref F1) (pin 1))
      (node (ref PS1) (pin 2)))
    (net (code 58) (name "Net-(J7-Pad4)")
      (node (ref J7) (pin 4)))
    (net (code 59) (name "Net-(J7-Pad3)")
      (node (ref J7) (pin 3)))
    (net (code 60) (name "Net-(J7-Pad2)")
      (node (ref J7) (pin 2)))
    (net (code 61) (name "Net-(J7-Pad1)")
      (node (ref J7) (pin 1)))
    (net (code 62) (name "Net-(P5-Pad1)")
      (node (ref PS1) (pin 1))
      (node (ref P5) (pin 1))
      (node (ref RV1) (pin 1)))
    (net (code 63) (name 3.3Vd)
      (node (ref J6) (pin 3)))
    (net (code 64) (name Vbat)
      (node (ref J6) (pin 1)))
    (net (code 65) (name BTN)
      (node (ref J6) (pin 2)))
    (net (code 66) (name "Net-(R37-Pad1)")
      (node (ref R46) (pin 2))
      (node (ref R37) (pin 1)))
    (net (code 67) (name "Net-(C14-Pad1)")
      (node (ref C15) (pin 2))
      (node (ref U4) (pin 2))
      (node (ref R12) (pin 1))
      (node (ref C14) (pin 1)))
    (net (code 68) (name "Net-(R50-Pad1)")
      (node (ref U4) (pin 6))
      (node (ref R50) (pin 1)))
    (net (code 69) (name "Net-(C18-Pad2)")
      (node (ref C4) (pin 2))
      (node (ref C18) (pin 2))
      (node (ref R9) (pin 1))
      (node (ref U3) (pin 3)))
    (net (code 70) (name "Net-(SW4-Pad1)")
      (node (ref SW4) (pin 4))
      (node (ref SW4) (pin 3))
      (node (ref SW4) (pin 2))
      (node (ref SW4) (pin 1))
      (node (ref U4) (pin 1)))
    (net (code 71) (name "Net-(C14-Pad2)")
      (node (ref R11) (pin 1))
      (node (ref C19) (pin 2))
      (node (ref C14) (pin 2))
      (node (ref U4) (pin 3)))
    (net (code 72) (name "Net-(J4-Pad3)")
      (node (ref J4) (pin 3))
      (node (ref R12) (pin 2))
      (node (ref R6) (pin 1)))
    (net (code 73) (name "Net-(J4-Pad2)")
      (node (ref R11) (pin 2))
      (node (ref R3) (pin 1))
      (node (ref J4) (pin 2)))
    (net (code 74) (name +3V3)
      (node (ref U13) (pin 1))
      (node (ref U13) (pin 17))
      (node (ref R35) (pin 2)))
    (net (code 75) (name "Net-(U19-Pad7)")
      (node (ref U19) (pin 7)))
    (net (code 76) (name "Net-(U19-Pad44)")
      (node (ref U19) (pin 44)))
    (net (code 77) (name GAIN_SW)
      (node (ref U13) (pin 3)))
    (net (code 78) (name "Net-(U19-Pad10)")
      (node (ref U19) (pin 10)))
    (net (code 79) (name L3I_ADC)
      (node (ref U13) (pin 13)))
    (net (code 80) (name "Net-(U19-Pad14)")
      (node (ref U19) (pin 14)))
    (net (code 81) (name "Net-(U19-Pad22)")
      (node (ref U19) (pin 22)))
    (net (code 82) (name "Net-(U19-Pad21)")
      (node (ref U19) (pin 21)))
    (net (code 83) (name "Net-(U19-Pad19)")
      (node (ref U19) (pin 19)))
    (net (code 84) (name "Net-(U19-Pad18)")
      (node (ref U19) (pin 18)))
    (net (code 85) (name "Net-(U19-Pad30)")
      (node (ref U19) (pin 30)))
    (net (code 86) (name "Net-(U19-Pad29)")
      (node (ref U19) (pin 29)))
    (net (code 87) (name "Net-(U19-Pad17)")
      (node (ref U19) (pin 17)))
    (net (code 88) (name "Net-(U19-Pad16)")
      (node (ref U19) (pin 16)))
    (net (code 89) (name "Net-(U19-Pad15)")
      (node (ref U19) (pin 15)))
    (net (code 90) (name "Net-(U19-Pad13)")
      (node (ref U19) (pin 13)))
    (net (code 91) (name "Net-(U19-Pad12)")
      (node (ref U19) (pin 12)))
    (net (code 92) (name "Net-(U19-Pad38)")
      (node (ref U19) (pin 38)))
    (net (code 93) (name "Net-(U19-Pad37)")
      (node (ref U19) (pin 37)))
    (net (code 94) (name "Net-(U19-Pad34)")
      (node (ref U19) (pin 34)))
    (net (code 95) (name "Net-(U19-Pad33)")
      (node (ref U19) (pin 33)))
    (net (code 96) (name "Net-(U19-Pad32)")
      (node (ref U19) (pin 32)))
    (net (code 97) (name "Net-(U19-Pad31)")
      (node (ref U19) (pin 31)))
    (net (code 98) (name "Net-(U19-Pad11)")
      (node (ref U19) (pin 11)))
    (net (code 99) (name "Net-(J5-Pad1)")
      (node (ref U13) (pin 24))
      (node (ref J5) (pin 1)))
    (net (code 100) (name "Net-(R35-Pad1)")
      (node (ref U13) (pin 4))
      (node (ref R35) (pin 1)))
    (net (code 101) (name NI_ADC)
      (node (ref U13) (pin 14)))
    (net (code 102) (name "Net-(U19-Pad25)")
      (node (ref U19) (pin 25)))
    (net (code 103) (name +1V65)
      (node (ref U13) (pin 7)))
    (net (code 104) (name "Net-(J5-Pad2)")
      (node (ref J5) (pin 2))
      (node (ref U13) (pin 23)))
    (net (code 105) (name "Net-(C42-Pad1)")
      (node (ref U6) (pin 2))
      (node (ref C42) (pin 1))
      (node (ref R61) (pin 1)))
    (net (code 106) (name "Net-(C42-Pad2)")
      (node (ref R67) (pin 1))
      (node (ref U6) (pin 3))
      (node (ref C42) (pin 2)))
    (net (code 107) (name "Net-(R25-Pad1)")
      (node (ref R61) (pin 2))
      (node (ref R31) (pin 2))
      (node (ref R25) (pin 1)))
    (net (code 108) (name "Net-(C43-Pad1)")
      (node (ref R32) (pin 1))
      (node (ref U14) (pin 3))
      (node (ref C43) (pin 1)))
    (net (code 109) (name "Net-(U19-Pad45)")
      (node (ref U19) (pin 45)))
    (net (code 110) (name "Net-(U19-Pad36)")
      (node (ref U19) (pin 36)))
    (net (code 111) (name "Net-(U19-Pad24)")
      (node (ref U19) (pin 24)))
    (net (code 112) (name "Net-(U19-Pad1)")
      (node (ref U19) (pin 1)))
    (net (code 113) (name "Net-(U19-Pad6)")
      (node (ref U19) (pin 6)))
    (net (code 114) (name "Net-(U19-Pad5)")
      (node (ref U19) (pin 5)))
    (net (code 115) (name "Net-(U19-Pad4)")
      (node (ref U19) (pin 4)))
    (net (code 116) (name "Net-(U19-Pad3)")
      (node (ref U19) (pin 3)))
    (net (code 117) (name "Net-(U19-Pad2)")
      (node (ref U19) (pin 2)))
    (net (code 118) (name "Net-(U19-Pad46)")
      (node (ref U19) (pin 46)))
    (net (code 119) (name "Net-(U19-Pad48)")
      (node (ref U19) (pin 48)))
    (net (code 120) (name "Net-(U19-Pad43)")
      (node (ref U19) (pin 43)))
    (net (code 121) (name "Net-(U19-Pad42)")
      (node (ref U19) (pin 42)))
    (net (code 122) (name "Net-(U19-Pad41)")
      (node (ref U19) (pin 41)))
    (net (code 123) (name "Net-(U19-Pad40)")
      (node (ref U19) (pin 40)))
    (net (code 124) (name "Net-(U19-Pad39)")
      (node (ref U19) (pin 39)))
    (net (code 125) (name "Net-(U19-Pad20)")
      (node (ref U19) (pin 20)))
    (net (code 126) (name "Net-(U19-Pad28)")
      (node (ref U19) (pin 28)))
    (net (code 127) (name "Net-(U19-Pad27)")
      (node (ref U19) (pin 27)))
    (net (code 128) (name "Net-(U19-Pad26)")
      (node (ref U19) (pin 26)))
    (net (code 129) (name "Net-(C43-Pad2)")
      (node (ref C43) (pin 2))
      (node (ref R68) (pin 1))
      (node (ref U14) (pin 2)))
    (net (code 130) (name "Net-(R72-Pad2)")
      (node (ref R72) (pin 2))
      (node (ref U6) (pin 6)))
    (net (code 131) (name "Net-(U19-Pad8)")
      (node (ref U19) (pin 8)))
    (net (code 132) (name "Net-(U19-Pad47)")
      (node (ref U19) (pin 47)))
    (net (code 133) (name "Net-(U19-Pad35)")
      (node (ref U19) (pin 35)))
    (net (code 134) (name "Net-(U19-Pad23)")
      (node (ref U19) (pin 23)))
    (net (code 135) (name "Net-(U19-Pad9)")
      (node (ref U19) (pin 9)))
    (net (code 136) (name "Net-(U13-Pad31)")
      (node (ref U13) (pin 31)))
    (net (code 137) (name "Net-(U13-Pad30)")
      (node (ref U13) (pin 30)))
    (net (code 138) (name "Net-(U13-Pad29)")
      (node (ref U13) (pin 29)))
    (net (code 139) (name "Net-(U13-Pad28)")
      (node (ref U13) (pin 28)))
    (net (code 140) (name "Net-(U13-Pad27)")
      (node (ref U13) (pin 27)))
    (net (code 141) (name "Net-(U13-Pad26)")
      (node (ref U13) (pin 26)))
    (net (code 142) (name "Net-(U13-Pad25)")
      (node (ref U13) (pin 25)))
    (net (code 143) (name "Net-(P2-PadDM)")
      (node (ref P2) (pin DM))
      (node (ref U13) (pin 21)))
    (net (code 144) (name "Net-(P2-PadDP)")
      (node (ref U13) (pin 22))
      (node (ref P2) (pin DP)))
    (net (code 145) (name +3.3VA)
      (node (ref U13) (pin 5)))
    (net (code 146) (name "Net-(R27-Pad1)")
      (node (ref R27) (pin 1))
      (node (ref R30) (pin 2)))
    (net (code 147) (name "Net-(R30-Pad1)")
      (node (ref R68) (pin 2))
      (node (ref R34) (pin 1))
      (node (ref R30) (pin 1)))
    (net (code 148) (name "Net-(R38-Pad1)")
      (node (ref R38) (pin 1))
      (node (ref U13) (pin 20)))
    (net (code 149) (name "Net-(U13-Pad2)")
      (node (ref U13) (pin 2)))
    (net (code 150) (name CHRG)
      (node (ref U13) (pin 18)))
    (net (code 151) (name L2I_ADC)
      (node (ref U13) (pin 12)))
    (net (code 152) (name L1I_ADC)
      (node (ref U13) (pin 11)))
    (net (code 153) (name +5V)
      (node (ref P2) (pin Vcc)))
    (net (code 154) (name "Net-(R38-Pad2)")
      (node (ref R38) (pin 2)))
    (net (code 155) (name "Net-(R39-Pad1)")
      (node (ref R39) (pin 1)))
    (net (code 156) (name "Net-(C28-Pad2)")
      (node (ref R39) (pin 2))
      (node (ref U13) (pin 6))
      (node (ref C28) (pin 2)))
    (net (code 157) (name "Net-(R55-Pad2)")
      (node (ref R55) (pin 2)))
    (net (code 158) (name "Net-(R55-Pad1)")
      (node (ref U13) (pin 19))
      (node (ref R55) (pin 1)))
    (net (code 159) (name L3V_ADC)
      (node (ref U13) (pin 10)))
    (net (code 160) (name L2V_ADC)
      (node (ref U13) (pin 9)))
    (net (code 161) (name L1V_ADC)
      (node (ref U13) (pin 8)))
    (net (code 162) (name BAT_ADC)
      (node (ref U13) (pin 15)))
    (net (code 163) (name "Net-(R29-Pad2)")
      (node (ref R29) (pin 2))
      (node (ref U15) (pin 6)))
    (net (code 164) (name IN_3N)
      (node (ref R29) (pin 1))
      (node (ref C10) (pin 2)))
    (net (code 165) (name IN_3P)
      (node (ref C10) (pin 1))
      (node (ref R23) (pin 1)))
    (net (code 166) (name "Net-(R23-Pad2)")
      (node (ref U15) (pin 7))
      (node (ref R23) (pin 2)))
    (net (code 167) (name IN_2N)
      (node (ref R21) (pin 1))
      (node (ref C8) (pin 2)))
    (net (code 168) (name "Net-(R18-Pad2)")
      (node (ref R18) (pin 2))
      (node (ref U14) (pin 7)))
    (net (code 169) (name IN_2P)
      (node (ref R18) (pin 1))
      (node (ref C8) (pin 1)))
    (net (code 170) (name "Net-(C9-Pad2)")
      (node (ref R32) (pin 2))
      (node (ref U17) (pin 3))
      (node (ref R34) (pin 2))
      (node (ref P3) (pin 1))
      (node (ref C9) (pin 2))
      (node (ref U14) (pin 4)))
    (net (code 171) (name "Net-(C9-Pad1)")
      (node (ref U17) (pin 4))
      (node (ref C9) (pin 1))
      (node (ref U14) (pin 1)))
    (net (code 172) (name "Net-(R21-Pad2)")
      (node (ref U14) (pin 6))
      (node (ref R21) (pin 2)))
    (net (code 173) (name "Net-(C39-Pad1)")
      (node (ref U6) (pin 1))
      (node (ref U16) (pin 4))
      (node (ref C39) (pin 1)))
    (net (code 174) (name "Net-(J1-Pad2)")
      (node (ref R40) (pin 2))
      (node (ref J1) (pin 2))
      (node (ref R33) (pin 1)))
    (net (code 175) (name "Net-(J1-Pad3)")
      (node (ref J1) (pin 3))
      (node (ref R56) (pin 2))
      (node (ref R36) (pin 1)))
    (net (code 176) (name "Net-(R14-Pad1)")
      (node (ref R14) (pin 1))
      (node (ref U1) (pin 6)))
    (net (code 177) (name "Net-(C11-Pad2)")
      (node (ref C17) (pin 2))
      (node (ref U1) (pin 3))
      (node (ref C11) (pin 2))
      (node (ref R40) (pin 1)))
    (net (code 178) (name "Net-(C44-Pad2)")
      (node (ref U15) (pin 2))
      (node (ref C44) (pin 2))
      (node (ref R69) (pin 1)))
    (net (code 179) (name "Net-(C44-Pad1)")
      (node (ref C44) (pin 1))
      (node (ref U15) (pin 3))
      (node (ref R70) (pin 1)))
    (net (code 180) (name "Net-(C38-Pad1)")
      (node (ref U15) (pin 1))
      (node (ref U18) (pin 4))
      (node (ref C38) (pin 1)))
    (net (code 181) (name "Net-(R26-Pad1)")
      (node (ref R28) (pin 2))
      (node (ref R26) (pin 1)))
    (net (code 182) (name "Net-(R28-Pad1)")
      (node (ref R60) (pin 1))
      (node (ref R69) (pin 2))
      (node (ref R28) (pin 1)))
    (net (code 183) (name IN_N1)
      (node (ref R67) (pin 2))
      (node (ref U16) (pin 3))
      (node (ref U6) (pin 4))
      (node (ref P1) (pin 1))
      (node (ref C39) (pin 2))
      (node (ref R31) (pin 1)))
    (net (code 184) (name "Net-(R24-Pad1)")
      (node (ref R25) (pin 2))
      (node (ref R24) (pin 1)))
    (net (code 185) (name IN_1N)
      (node (ref R72) (pin 1))
      (node (ref C46) (pin 2)))
    (net (code 186) (name IN_1P)
      (node (ref R71) (pin 1))
      (node (ref C46) (pin 1)))
    (net (code 187) (name "Net-(R71-Pad2)")
      (node (ref R71) (pin 2))
      (node (ref U6) (pin 7)))
    (net (code 188) (name IN_L1)
      (node (ref R24) (pin 2))
      (node (ref P1) (pin 2)))
    (net (code 189) (name "Net-(C38-Pad2)")
      (node (ref U15) (pin 4))
      (node (ref R70) (pin 2))
      (node (ref R60) (pin 2))
      (node (ref C38) (pin 2))
      (node (ref U18) (pin 3))
      (node (ref P4) (pin 1)))
    (net (code 190) (name "Net-(P4-Pad2)")
      (node (ref R26) (pin 2))
      (node (ref P4) (pin 2)))
    (net (code 191) (name "Net-(P3-Pad2)")
      (node (ref R27) (pin 2))
      (node (ref P3) (pin 2)))))