(module Footprints:RJ12_Amphenol_54601 (layer F.Cu) (tedit 5BDB3E4C)
  (descr "RJ12 connector  https://cdn.amphenol-icc.com/media/wysiwyg/files/drawing/c-bmj-0082.pdf")
  (tags "RJ12 connector")
  (fp_text reference J1 (at -1.67 -2.16) (layer F.SilkS)
    (effects (font (size 1 1) (thickness 0.15)))
  )
  (fp_text value RJ11 (at 3.54 18.3) (layer F.Fab)
    (effects (font (size 1 1) (thickness 0.15)))
  )
  (fp_line (start -3.43 -0.48) (end -3.43 -1.23) (layer F.Fab) (width 0.1))
  (fp_line (start -2.93 0.02) (end -3.43 -0.48) (layer F.Fab) (width 0.1))
  (fp_line (start -3.43 0.52) (end -2.93 0.02) (layer F.Fab) (width 0.1))
  (fp_line (start -3.93 7.79) (end -3.93 -1.23) (layer F.SilkS) (width 0.12))
  (fp_line (start -3.93 16.77) (end -3.93 9.99) (layer F.SilkS) (width 0.12))
  (fp_line (start 10.27 16.77) (end -3.93 16.77) (layer F.SilkS) (width 0.12))
  (fp_line (start 9.77 16.76) (end 9.77 16.77) (layer F.SilkS) (width 0.1))
  (fp_line (start 10.27 16.77) (end 10.27 9.99) (layer F.SilkS) (width 0.12))
  (fp_line (start 10.27 -1.23) (end 10.27 7.79) (layer F.SilkS) (width 0.12))
  (fp_line (start -3.93 -1.23) (end 10.27 -1.23) (layer F.SilkS) (width 0.12))
  (fp_line (start -4.04 17.27) (end -4.04 -1.73) (layer F.CrtYd) (width 0.05))
  (fp_line (start 10.38 17.27) (end -4.04 17.27) (layer F.CrtYd) (width 0.05))
  (fp_line (start 10.38 -1.73) (end 10.38 17.27) (layer F.CrtYd) (width 0.05))
  (fp_line (start -4.04 -1.73) (end 10.38 -1.73) (layer F.CrtYd) (width 0.05))
  (fp_line (start 9.77 16.77) (end -3.43 16.77) (layer F.Fab) (width 0.1))
  (fp_line (start 9.77 -1.23) (end 9.77 16.77) (layer F.Fab) (width 0.1))
  (fp_line (start -3.43 -1.23) (end 9.77 -1.23) (layer F.Fab) (width 0.1))
  (fp_line (start -3.43 16.77) (end -3.43 0.52) (layer F.Fab) (width 0.1))
  (fp_text user %R (at 3.16 7.76) (layer F.Fab)
    (effects (font (size 1 1) (thickness 0.15)))
  )
  (pad "" np_thru_hole circle (at 8.25 8.89) (size 3.25 3.25) (drill 3.25) (layers *.Cu *.Mask))
  (pad 6 thru_hole circle (at 6.35 2.54) (size 1.52 1.52) (drill 0.76) (layers *.Cu *.Mask))
  (pad 5 thru_hole circle (at 5.08 0) (size 1.52 1.52) (drill 0.76) (layers *.Cu *.Mask))
  (pad 4 thru_hole circle (at 3.81 2.54) (size 1.52 1.52) (drill 0.76) (layers *.Cu *.Mask))
  (pad 3 thru_hole circle (at 2.54 0) (size 1.52 1.52) (drill 0.76) (layers *.Cu *.Mask))
  (pad 2 thru_hole circle (at 1.27 2.54) (size 1.52 1.52) (drill 0.76) (layers *.Cu *.Mask))
  (pad "" np_thru_hole circle (at -1.91 8.89) (size 3.25 3.25) (drill 3.25) (layers *.Cu *.Mask))
  (pad 1 thru_hole rect (at 0 0) (size 1.52 1.52) (drill 0.76) (layers *.Cu *.Mask))
  (model ${KISYS3DMOD}/Connector_RJ.3dshapes/RJ12_Amphenol_54601.wrl
    (at (xyz 0 0 0))
    (scale (xyz 1 1 1))
    (rotate (xyz 0 0 0))
  )
)
