{
  "UniqueId": "0TT0ULdj57Fgn7pRt9knwl",
  "Dictionary": {
    "ReferenceUuid": "4254acc3-8d68-4a2d-afae-9ef0bca28537",
    "ReferenceSchema": "https://schemas.infopack.io/ivl/xtddictionary.1.schema.json"
  },
  "Names": [
    {
      "UniqueId": "54091e0a-c442-4837-9d5f-b422a6ee9f30",
      "Texts": [
        {
          "UniqueId": "cda1489f-6ea1-440b-aa8c-0dbb81a98682",
          "Text": "core PCR",
          "Language": {
            "ReferenceUuid": "ff868415-0cbd-49fc-8789-9abf07263274",
            "ReferenceSchema": "https://schemas.infopack.io/ivl/xtdlanguage.1.schema.json"
          }
        }
      ]
    }
  ],
  "Definition": {
    "UniqueId": "02a50773-afaa-44f7-b4b0-f4d19fccfe1e",
    "Texts": [
      {
        "UniqueId": "3a2c7537-2183-484e-bff1-8d062f9565b1",
        "Text": "set of specific rules, requirements and guidelines for developing EPDs for the entire product category, construction products, i.e. ISO 21930 or EN 15804",
        "Language": {
          "ReferenceUuid": "ff868415-0cbd-49fc-8789-9abf07263274",
          "ReferenceSchema": "https://schemas.infopack.io/ivl/xtdlanguage.1.schema.json"
        }
      }
    ]
  },
  "LanguageOfCreator": {
    "ReferenceUuid": "156648a5-939a-4b16-b091-61eb8df3a074",
    "ReferenceSchema": "https://schemas.infopack.io/ivl/xtdlanguage.1.schema.json"
  },
  "MajorVersion": 1,
  "MinorVersion": 0,
  "DateOfCreation": "2024-10-22T22:28:45.521Z",
  "Status": "XTD_ACTIVE",
  "PossibleValues": [
    {
      "UniqueId": "bf57d990-1ff2-482b-ac52-ebb024ac59f8",
      "Values": [
        {
          "UniqueId": "fed54ce8-612a-413f-8e9d-9acc3072d260",
          "OrderedValue": {
            "UniqueId": "b817b727-c903-428f-bd12-1dcf989555b5",
            "NominalValue": "ISO 21930:2017"
          },
          "Order": 1
        },
        {
          "UniqueId": "fed54ce8-612a-413f-8e9d-9acc3072d260",
          "OrderedValue": {
            "UniqueId": "b817b727-c903-428f-bd12-1dcf989555b5",
            "NominalValue": "EN 15804:2012+A1:2013"
          },
          "Order": 2
        },
        {
          "UniqueId": "fed54ce8-612a-413f-8e9d-9acc3072d260",
          "OrderedValue": {
            "UniqueId": "b817b727-c903-428f-bd12-1dcf989555b5",
            "NominalValue": "EN 15804:2012+A2:2019"
          },
          "Order": 3
        }
      ],
      "Language": {
        "ReferenceUuid": "ff868415-0cbd-49fc-8789-9abf07263274",
        "ReferenceSchema": "https://schemas.infopack.io/ivl/xtdlanguage.1.schema.json"
      }
    }
  ]
}