{
  "UniqueId": "3FB6yzOMj9wx7XG8TLq2Fs",
  "Dictionary": {
    "ReferenceUuid": "4254acc3-8d68-4a2d-afae-9ef0bca28537",
    "ReferenceSchema": "https://schemas.infopack.io/ivl/xtddictionary.1.schema.json"
  },
  "Names": [
    {
      "UniqueId": "bba73062-8478-4261-beaa-0e0cc55c01a1",
      "Texts": [
        {
          "UniqueId": "7e454bb8-134a-4147-939b-afb4a54b07a6",
          "Text": "freshwater ecotoxicity potential for seawater emissions",
          "Language": {
            "ReferenceUuid": "ff868415-0cbd-49fc-8789-9abf07263274",
            "ReferenceSchema": "https://schemas.infopack.io/ivl/xtdlanguage.1.schema.json"
          }
        }
      ]
    }
  ],
  "Definition": {
    "UniqueId": "d958744d-900a-4335-8a93-bf08fc408b8c",
    "Texts": [
      {
        "UniqueId": "faa227ae-5bfb-48ee-8f60-c63e55fd5db4",
        "Text": "the potential toxic effects of seawater emissions on freshwater aquatic ecosystems",
        "Language": {
          "ReferenceUuid": "ff868415-0cbd-49fc-8789-9abf07263274",
          "ReferenceSchema": "https://schemas.infopack.io/ivl/xtdlanguage.1.schema.json"
        }
      }
    ]
  },
  "LanguageOfCreator": {
    "ReferenceUuid": "156648a5-939a-4b16-b091-61eb8df3a074",
    "ReferenceSchema": "https://schemas.infopack.io/ivl/xtdlanguage.1.schema.json"
  },
  "MajorVersion": 1,
  "MinorVersion": 0,
  "DateOfCreation": "2024-10-22T22:28:45.528Z",
  "Status": "XTD_ACTIVE"
}