{
  "UniqueId": "3HRWYEBbbDzhUdMvoAK5Sx",
  "Dictionary": {
    "ReferenceUuid": "4254acc3-8d68-4a2d-afae-9ef0bca28537",
    "ReferenceSchema": "https://schemas.infopack.io/ivl/xtddictionary.1.schema.json"
  },
  "Names": [
    {
      "UniqueId": "891909a4-9f22-4e06-b250-eb4b7bef50ea",
      "Texts": [
        {
          "UniqueId": "461111a9-219c-4918-9b80-b8f9ed331da4",
          "Text": "publication date of EPD",
          "Language": {
            "ReferenceUuid": "ff868415-0cbd-49fc-8789-9abf07263274",
            "ReferenceSchema": "https://schemas.infopack.io/ivl/xtdlanguage.1.schema.json"
          }
        }
      ]
    }
  ],
  "Definition": {
    "UniqueId": "a40e599f-980e-4441-8172-f33f88d5fa29",
    "Texts": [
      {
        "UniqueId": "de9d0e22-b6ec-4abb-a29d-369478f5da45",
        "Text": "start date of the time period for which the data set is valid",
        "Language": {
          "ReferenceUuid": "ff868415-0cbd-49fc-8789-9abf07263274",
          "ReferenceSchema": "https://schemas.infopack.io/ivl/xtdlanguage.1.schema.json"
        }
      }
    ]
  },
  "LanguageOfCreator": {
    "ReferenceUuid": "156648a5-939a-4b16-b091-61eb8df3a074",
    "ReferenceSchema": "https://schemas.infopack.io/ivl/xtdlanguage.1.schema.json"
  },
  "MajorVersion": 1,
  "MinorVersion": 0,
  "DateOfCreation": "2024-10-22T22:28:45.517Z",
  "Status": "XTD_ACTIVE"
}