{
  "UniqueId": "2yact9jwPAkg4KRsNJjH66",
  "Dictionary": {
    "ReferenceUuid": "4254acc3-8d68-4a2d-afae-9ef0bca28537",
    "ReferenceSchema": "https://schemas.infopack.io/ivl/xtddictionary.1.schema.json"
  },
  "Names": [
    {
      "UniqueId": "a3edec92-ea04-44ca-bec2-69cc99725a2f",
      "Texts": [
        {
          "UniqueId": "853aaed4-5a6e-47b7-9f98-bde3f241fa0f",
          "Text": "eutrophication potential",
          "Language": {
            "ReferenceUuid": "ff868415-0cbd-49fc-8789-9abf07263274",
            "ReferenceSchema": "https://schemas.infopack.io/ivl/xtdlanguage.1.schema.json"
          }
        }
      ]
    }
  ],
  "Definition": {
    "UniqueId": "b562072d-79d2-4b40-b9b4-d6ca8d5b8bc2",
    "Texts": [
      {
        "UniqueId": "9d632895-4ce1-490b-b439-66785b9af9a7",
        "Text": "enrichment of water, both fresh and saline, by nutrients, especially compounds of nitrogen and phosphorus, that will accelerate the growth of algae and higher forms of plant life",
        "Language": {
          "ReferenceUuid": "ff868415-0cbd-49fc-8789-9abf07263274",
          "ReferenceSchema": "https://schemas.infopack.io/ivl/xtdlanguage.1.schema.json"
        }
      }
    ]
  },
  "LanguageOfCreator": {
    "ReferenceUuid": "156648a5-939a-4b16-b091-61eb8df3a074",
    "ReferenceSchema": "https://schemas.infopack.io/ivl/xtdlanguage.1.schema.json"
  },
  "MajorVersion": 1,
  "MinorVersion": 0,
  "DateOfCreation": "2024-10-22T22:28:45.526Z",
  "Status": "XTD_ACTIVE"
}