{
  "UniqueId": "1cVHyaZyz2LwY$sgcus0_K",
  "Dictionary": {
    "ReferenceUuid": "4254acc3-8d68-4a2d-afae-9ef0bca28537",
    "ReferenceSchema": "https://schemas.infopack.io/ivl/xtddictionary.1.schema.json"
  },
  "Names": [
    {
      "UniqueId": "6687d3d4-0bbd-40f5-b30a-69df2eb8ac72",
      "Texts": [
        {
          "UniqueId": "67757c90-cb51-4d4a-93fa-96d9fd13f333",
          "Text": "renewable primary resources used as an energy carrier (fuel)",
          "Language": {
            "ReferenceUuid": "ff868415-0cbd-49fc-8789-9abf07263274",
            "ReferenceSchema": "https://schemas.infopack.io/ivl/xtdlanguage.1.schema.json"
          }
        }
      ]
    }
  ],
  "Definition": {
    "UniqueId": "27a4f040-2e6b-4fd8-8abc-192a37135f88",
    "Texts": [
      {
        "UniqueId": "effca67e-57f1-45dc-9669-29fb4d61b14d",
        "Text": "Bio-based materials used (first use) as an energy source and hydropower, solar and wind power used in the technosphere are included.",
        "Language": {
          "ReferenceUuid": "ff868415-0cbd-49fc-8789-9abf07263274",
          "ReferenceSchema": "https://schemas.infopack.io/ivl/xtdlanguage.1.schema.json"
        }
      }
    ]
  },
  "LanguageOfCreator": {
    "ReferenceUuid": "156648a5-939a-4b16-b091-61eb8df3a074",
    "ReferenceSchema": "https://schemas.infopack.io/ivl/xtdlanguage.1.schema.json"
  },
  "MajorVersion": 1,
  "MinorVersion": 0,
  "DateOfCreation": "2024-10-22T22:28:45.530Z",
  "Status": "XTD_ACTIVE"
}