{
  "UniqueId": "2uLicla5H9yvoo3J7xZwcv",
  "Dictionary": {
    "ReferenceUuid": "4254acc3-8d68-4a2d-afae-9ef0bca28537",
    "ReferenceSchema": "https://schemas.infopack.io/ivl/xtddictionary.1.schema.json"
  },
  "Names": [
    {
      "UniqueId": "0da5b510-576b-4528-bca2-f3b6853649f1",
      "Texts": [
        {
          "UniqueId": "6de87d36-f952-4f2a-a544-cc74830e9991",
          "Text": "renewable secondary fuels",
          "Language": {
            "ReferenceUuid": "ff868415-0cbd-49fc-8789-9abf07263274",
            "ReferenceSchema": "https://schemas.infopack.io/ivl/xtdlanguage.1.schema.json"
          }
        }
      ]
    }
  ],
  "Definition": {
    "UniqueId": "9bbb0825-d862-484a-bb09-df8263957e78",
    "Texts": [
      {
        "UniqueId": "a498bffc-13e6-4475-95a1-2104aa0a1da2",
        "Text": "renewable materials with energy content that have crossed the system boundary between product systems and are used as fuel input (energy source) in another product system (e.g. biomass residue pellets, chipped waste wood)",
        "Language": {
          "ReferenceUuid": "ff868415-0cbd-49fc-8789-9abf07263274",
          "ReferenceSchema": "https://schemas.infopack.io/ivl/xtdlanguage.1.schema.json"
        }
      }
    ]
  },
  "LanguageOfCreator": {
    "ReferenceUuid": "156648a5-939a-4b16-b091-61eb8df3a074",
    "ReferenceSchema": "https://schemas.infopack.io/ivl/xtdlanguage.1.schema.json"
  },
  "MajorVersion": 1,
  "MinorVersion": 0,
  "DateOfCreation": "2024-10-22T22:28:45.530Z",
  "Status": "XTD_ACTIVE"
}