{
  "UniqueId": "0QNBV8ynHENfYTcYrCakpA",
  "Dictionary": {
    "ReferenceUuid": "4254acc3-8d68-4a2d-afae-9ef0bca28537",
    "ReferenceSchema": "https://schemas.infopack.io/ivl/xtddictionary.1.schema.json"
  },
  "Names": [
    {
      "UniqueId": "efbfbfa9-0a52-4a50-9709-92d9ee47dd88",
      "Texts": [
        {
          "UniqueId": "cc91a138-c3d6-40c7-994c-327368471347",
          "Text": "freshwater ecotoxicity potential for rural air emissions",
          "Language": {
            "ReferenceUuid": "ff868415-0cbd-49fc-8789-9abf07263274",
            "ReferenceSchema": "https://schemas.infopack.io/ivl/xtdlanguage.1.schema.json"
          }
        }
      ]
    }
  ],
  "Definition": {
    "UniqueId": "3cd543ac-9039-43e5-ac74-f59f7e5f7b17",
    "Texts": [
      {
        "UniqueId": "a487dc09-1533-4dc7-b6bb-4a49d3c555ad",
        "Text": "the potential toxic effects of rural air emissions on freshwater aquatic ecosystems",
        "Language": {
          "ReferenceUuid": "ff868415-0cbd-49fc-8789-9abf07263274",
          "ReferenceSchema": "https://schemas.infopack.io/ivl/xtdlanguage.1.schema.json"
        }
      }
    ]
  },
  "LanguageOfCreator": {
    "ReferenceUuid": "156648a5-939a-4b16-b091-61eb8df3a074",
    "ReferenceSchema": "https://schemas.infopack.io/ivl/xtdlanguage.1.schema.json"
  },
  "MajorVersion": 1,
  "MinorVersion": 0,
  "DateOfCreation": "2024-10-22T22:28:45.528Z",
  "Status": "XTD_ACTIVE"
}