{
  "UniqueId": "01xxJuSQX0CeB3mbCi7L_Y",
  "Dictionary": {
    "ReferenceUuid": "4254acc3-8d68-4a2d-afae-9ef0bca28537",
    "ReferenceSchema": "https://schemas.infopack.io/ivl/xtddictionary.1.schema.json"
  },
  "Names": [
    {
      "UniqueId": "20a49dc2-52de-4fc2-b101-ff01ee7b82e8",
      "Texts": [
        {
          "UniqueId": "7f1ff7c3-1713-417a-8c80-9e9b23c41032",
          "Text": "web domain",
          "Language": {
            "ReferenceUuid": "ff868415-0cbd-49fc-8789-9abf07263274",
            "ReferenceSchema": "https://schemas.infopack.io/ivl/xtdlanguage.1.schema.json"
          }
        }
      ]
    }
  ],
  "Definition": {
    "UniqueId": "ee2d7bbd-9c17-4125-83aa-357487d7073d",
    "Texts": [
      {
        "UniqueId": "9a395db3-ef12-4e5d-a1ac-8796a511a1ea",
        "Text": "TBD",
        "Language": {
          "ReferenceUuid": "ff868415-0cbd-49fc-8789-9abf07263274",
          "ReferenceSchema": "https://schemas.infopack.io/ivl/xtdlanguage.1.schema.json"
        }
      }
    ]
  },
  "LanguageOfCreator": {
    "ReferenceUuid": "156648a5-939a-4b16-b091-61eb8df3a074",
    "ReferenceSchema": "https://schemas.infopack.io/ivl/xtdlanguage.1.schema.json"
  },
  "MajorVersion": 1,
  "MinorVersion": 0,
  "DateOfCreation": "2024-10-22T22:28:45.518Z",
  "Status": "XTD_ACTIVE"
}