{
    "$id": "https://schemas.infopack.io/ivl/xtddictionary.1.schema.json",
    "$schema": "https://json-schema.org/draft/2020-12/schema",
    "title": "xtd Dictionary Schema",
    "description": "xtdDictionary is a specialization of xtdRoot used to represent a data dictionary.; According to SS-EN ISO 12006-3:2022.",
    "type": "object",
    "allOf": [
        { "$ref": "/ivl/xtdroot.1.schema.json" },
        { "$ref": "#/$defs/Dictionary" }
    ],
    "$defs": {
        "Dictionary": {
            "type": "object",
            "properties": {
                "Name": { "$ref": "/ivl/xtdmultilanguagetext.1.schema.json" }
            },
            "required": [
                "Name"
            ]
        }
    }
}
