{
  "UniqueId": "0R6QcQZJnBqO_cgaZRe09x",
  "Dictionary": {
    "ReferenceUuid": "4254acc3-8d68-4a2d-afae-9ef0bca28537",
    "ReferenceSchema": "https://schemas.infopack.io/ivl/xtddictionary.1.schema.json"
  },
  "Names": [
    {
      "UniqueId": "329912ec-5466-4118-9399-b09f2bee84ae",
      "Texts": [
        {
          "UniqueId": "326589d6-a4ad-4aa2-ab1f-702ea18ff507",
          "Text": "depletion potential of the stratospheric ozone layer",
          "Language": {
            "ReferenceUuid": "ff868415-0cbd-49fc-8789-9abf07263274",
            "ReferenceSchema": "https://schemas.infopack.io/ivl/xtdlanguage.1.schema.json"
          }
        }
      ]
    }
  ],
  "Definition": {
    "UniqueId": "17c85f70-9b6a-4745-99ed-dea473a235b7",
    "Texts": [
      {
        "UniqueId": "20026600-69d3-4ec2-97e8-6d766797af6e",
        "Text": "the relative amount of degradation to the ozone layer a product can cause",
        "Language": {
          "ReferenceUuid": "ff868415-0cbd-49fc-8789-9abf07263274",
          "ReferenceSchema": "https://schemas.infopack.io/ivl/xtdlanguage.1.schema.json"
        }
      }
    ]
  },
  "LanguageOfCreator": {
    "ReferenceUuid": "156648a5-939a-4b16-b091-61eb8df3a074",
    "ReferenceSchema": "https://schemas.infopack.io/ivl/xtdlanguage.1.schema.json"
  },
  "MajorVersion": 1,
  "MinorVersion": 0,
  "DateOfCreation": "2024-10-22T22:28:45.526Z",
  "Status": "XTD_ACTIVE"
}