{
  "UniqueId": "3lHA992CDCZRVCvZuu9qQr",
  "Dictionary": {
    "ReferenceUuid": "4254acc3-8d68-4a2d-afae-9ef0bca28537",
    "ReferenceSchema": "https://schemas.infopack.io/ivl/xtddictionary.1.schema.json"
  },
  "Names": [
    {
      "UniqueId": "4a3f10fd-c733-4dde-8c7f-890c1ac9ac88",
      "Texts": [
        {
          "UniqueId": "e604aeb5-77fa-48f0-b625-7feb0c718364",
          "Text": "EPD type - product representativeness according to ISO 21930",
          "Language": {
            "ReferenceUuid": "ff868415-0cbd-49fc-8789-9abf07263274",
            "ReferenceSchema": "https://schemas.infopack.io/ivl/xtdlanguage.1.schema.json"
          }
        }
      ]
    }
  ],
  "Definition": {
    "UniqueId": "7b86be1f-510b-49bf-b8b5-a08d20d7e39e",
    "Texts": [
      {
        "UniqueId": "e1e6da5f-471a-46a7-82fa-4d92e068edb9",
        "Text": "for declarations representing similar products or a group of products, a description of what the average represents",
        "Language": {
          "ReferenceUuid": "ff868415-0cbd-49fc-8789-9abf07263274",
          "ReferenceSchema": "https://schemas.infopack.io/ivl/xtdlanguage.1.schema.json"
        }
      }
    ]
  },
  "LanguageOfCreator": {
    "ReferenceUuid": "156648a5-939a-4b16-b091-61eb8df3a074",
    "ReferenceSchema": "https://schemas.infopack.io/ivl/xtdlanguage.1.schema.json"
  },
  "MajorVersion": 1,
  "MinorVersion": 0,
  "DateOfCreation": "2024-10-22T22:28:45.520Z",
  "Status": "XTD_ACTIVE",
  "PossibleValues": [
    {
      "UniqueId": "bf57d990-1ff2-482b-ac52-ebb024ac59f8",
      "Values": [
        {
          "UniqueId": "fed54ce8-612a-413f-8e9d-9acc3072d260",
          "OrderedValue": {
            "UniqueId": "b817b727-c903-428f-bd12-1dcf989555b5",
            "NominalValue": "valid for a single product"
          },
          "Order": 1
        },
        {
          "UniqueId": "fed54ce8-612a-413f-8e9d-9acc3072d260",
          "OrderedValue": {
            "UniqueId": "b817b727-c903-428f-bd12-1dcf989555b5",
            "NominalValue": "valid for several products with variation below 10 %"
          },
          "Order": 2
        },
        {
          "UniqueId": "fed54ce8-612a-413f-8e9d-9acc3072d260",
          "OrderedValue": {
            "UniqueId": "b817b727-c903-428f-bd12-1dcf989555b5",
            "NominalValue": "valid for products with variation above 10 %"
          },
          "Order": 3
        }
      ],
      "Language": {
        "ReferenceUuid": "ff868415-0cbd-49fc-8789-9abf07263274",
        "ReferenceSchema": "https://schemas.infopack.io/ivl/xtdlanguage.1.schema.json"
      }
    }
  ]
}