{
    "$id": "https://schemas.infopack.io/ivl/xtddimension.1.schema.json",
    "$schema": "https://json-schema.org/draft/2020-12/schema",
    "title": "xtd Dimension Schema",
    "description": "According to SS-EN ISO 12006-3:2022",
    "allOf": [
        { "$ref": "/ivl/xtdroot.1.schema.json" },
        { "$ref": "/ivl/xtdobject.1.schema.json" },
        { "$ref": "/ivl/xtdconcept.1.schema.json" },
        { "$ref": "#/$defs/Dimension" }
    ],
    "$defs": {
        "Dimension": {
            "type": "object",
            "properties": {
                "LengthExponent": {
                    "$ref": "/ivl/xtdrational.1.schema.json"
                },
                "MassExponent": {
                    "$ref": "/ivl/xtdrational.1.schema.json"
                },
                "TimeExponent": {
                    "$ref": "/ivl/xtdrational.1.schema.json"
                },
                "ElectricCurrentExponent": {
                    "$ref": "/ivl/xtdrational.1.schema.json"
                },
                "ThermodynamicTemperatureExponent": {
                    "$ref": "/ivl/xtdrational.1.schema.json"
                },
                "AmountOfSubstanceExponent": {
                    "$ref": "/ivl/xtdrational.1.schema.json"
                },
                "LuminousIntensityExponent": {
                    "$ref": "/ivl/xtdrational.1.schema.json"
                }
            },
            "required": [
                "LengthExponent",
                "MassExponent",
                "TimeExponent",
                "ElectricCurrentExponent",
                "ThermodynamicTemperatureExponent",
                "AmountOfSubstanceExponent",
                "LuminousIntensityExponent"
            ]
        }
    }
}
