{
    "$id": "https://schemas.infopack.io/ivl/xtdsubject.1.schema.json",
    "$schema": "https://json-schema.org/draft/2020-12/schema",
    "title": "xtd Subject Schema",
    "description": "xtdSubject is a specialization of xtdConcept.; It contains a list of properties that can be associated to filters with other subjects. An xtdSubject can be physical or logical.; According to SS-EN ISO 12006-3:2022.; Abstract entity.",
    "allOf": [
        { "$ref": "/ivl/xtdroot.1.schema.json" },
        { "$ref": "/ivl/xtdobject.1.schema.json" },
        { "$ref": "/ivl/xtdconcept.1.schema.json" },
        { "$ref": "#/$defs/Subject" }
    ],
    "$defs": {
        "Subject": {
            "type": "object",
            "properties": {
                "Properties": {
                    "title": "Properties",
                    "description": "List of the properties attached to the subject.",
                    "type": "array",
                    "items": {
                        "oneOf": [
                            {
                                "$ref": "/ivl/xtdproperty.1.schema.json"
                            },
                            {
                                "$ref": "/ivl/entityref.1.schema.json"
                            }
                        ]
                    }
                },
                "ConnectedSubjects": {
                    "title": "Connected subjects",
                    "description": "List of subjects connected with a qualified relationship.",
                    "type": "array",
                    "items": {
                        "$ref": "/ivl/xtdrelationshiptosubject.1.schema.json"
                    }
                },
                "Filters": {
                    "title": "Filters",
                    "description": "List of filters used for mapping or automatic classification purpose.",
                    "type": "array",
                    "items": {
                        "$ref": "/ivl/entityref.1.schema.json"
                    }
                }
            }
        }
    },
    "unevaluatedProperties": false
}
