{
  "UniqueId": "1wqjU$0UjDEgkW3VssnbAz",
  "Dictionary": {
    "ReferenceUuid": "4254acc3-8d68-4a2d-afae-9ef0bca28537",
    "ReferenceSchema": "https://schemas.infopack.io/ivl/xtddictionary.1.schema.json"
  },
  "Names": [
    {
      "UniqueId": "1b62c07d-77f2-4e6f-9f3c-d9c72d00a8cd",
      "Texts": [
        {
          "UniqueId": "c08dc370-dba4-42df-af99-8265909e6a47",
          "Text": "plus code(s) according to Open Location Code (OLC)",
          "Language": {
            "ReferenceUuid": "ff868415-0cbd-49fc-8789-9abf07263274",
            "ReferenceSchema": "https://schemas.infopack.io/ivl/xtdlanguage.1.schema.json"
          }
        }
      ]
    }
  ],
  "Definition": {
    "UniqueId": "d6e4fef5-db95-411f-bd22-27e498ed98bd",
    "Texts": [
      {
        "UniqueId": "859e0450-e378-4574-b6fd-cbfa29aed3cf",
        "Text": "TBD",
        "Language": {
          "ReferenceUuid": "ff868415-0cbd-49fc-8789-9abf07263274",
          "ReferenceSchema": "https://schemas.infopack.io/ivl/xtdlanguage.1.schema.json"
        }
      }
    ]
  },
  "LanguageOfCreator": {
    "ReferenceUuid": "156648a5-939a-4b16-b091-61eb8df3a074",
    "ReferenceSchema": "https://schemas.infopack.io/ivl/xtdlanguage.1.schema.json"
  },
  "MajorVersion": 1,
  "MinorVersion": 0,
  "DateOfCreation": "2024-10-22T22:28:45.516Z",
  "Status": "XTD_ACTIVE"
}