{
  "UniqueId": "17VehiRo91dfTN6M4YkhgG",
  "Dictionary": {
    "ReferenceUuid": "4254acc3-8d68-4a2d-afae-9ef0bca28537",
    "ReferenceSchema": "https://schemas.infopack.io/ivl/xtddictionary.1.schema.json"
  },
  "Names": [
    {
      "UniqueId": "e60f22a2-8e28-4879-8f8c-940f7759a305",
      "Texts": [
        {
          "UniqueId": "433cb9fc-ace3-4d4d-bf32-70a90717ec53",
          "Text": "human health non-cancer potential for freshwater emissions",
          "Language": {
            "ReferenceUuid": "ff868415-0cbd-49fc-8789-9abf07263274",
            "ReferenceSchema": "https://schemas.infopack.io/ivl/xtdlanguage.1.schema.json"
          }
        }
      ]
    }
  ],
  "Definition": {
    "UniqueId": "e976b294-e38c-4473-897e-bc4b5028f4d9",
    "Texts": [
      {
        "UniqueId": "2e12f221-e0bc-4021-9da9-21c38a0e64a2",
        "Text": "a calculated index that reflects the potential harm (in terms of non-cancer effects) of emissions released into freshwater, and it is based on both the inherent toxicity of a compound and its potential dose",
        "Language": {
          "ReferenceUuid": "ff868415-0cbd-49fc-8789-9abf07263274",
          "ReferenceSchema": "https://schemas.infopack.io/ivl/xtdlanguage.1.schema.json"
        }
      }
    ]
  },
  "LanguageOfCreator": {
    "ReferenceUuid": "156648a5-939a-4b16-b091-61eb8df3a074",
    "ReferenceSchema": "https://schemas.infopack.io/ivl/xtdlanguage.1.schema.json"
  },
  "MajorVersion": 1,
  "MinorVersion": 0,
  "DateOfCreation": "2024-10-22T22:28:45.528Z",
  "Status": "XTD_ACTIVE"
}