{
  "UniqueId": "1VuTNpq795DfPt7dqfztsB",
  "Dictionary": {
    "ReferenceUuid": "4254acc3-8d68-4a2d-afae-9ef0bca28537",
    "ReferenceSchema": "https://schemas.infopack.io/ivl/xtddictionary.1.schema.json"
  },
  "Names": [
    {
      "UniqueId": "0c853857-05e6-4fa2-ac09-c17231f42d71",
      "Texts": [
        {
          "UniqueId": "fe307d78-0429-44f7-9354-0c6ec1c65457",
          "Text": "name of verifier",
          "Language": {
            "ReferenceUuid": "ff868415-0cbd-49fc-8789-9abf07263274",
            "ReferenceSchema": "https://schemas.infopack.io/ivl/xtdlanguage.1.schema.json"
          }
        }
      ]
    }
  ],
  "Definition": {
    "UniqueId": "a27bef42-4660-4287-b4c3-f010312274fb",
    "Texts": [
      {
        "UniqueId": "89c4d131-ba7d-4dc5-9be3-3c3ce0405646",
        "Text": "name of the person that carries out verification",
        "Language": {
          "ReferenceUuid": "ff868415-0cbd-49fc-8789-9abf07263274",
          "ReferenceSchema": "https://schemas.infopack.io/ivl/xtdlanguage.1.schema.json"
        }
      }
    ]
  },
  "LanguageOfCreator": {
    "ReferenceUuid": "156648a5-939a-4b16-b091-61eb8df3a074",
    "ReferenceSchema": "https://schemas.infopack.io/ivl/xtdlanguage.1.schema.json"
  },
  "MajorVersion": 1,
  "MinorVersion": 0,
  "DateOfCreation": "2024-10-22T22:28:45.515Z",
  "Status": "XTD_ACTIVE"
}