{
  "UniqueId": "1t0HZSBeP9Q9kIRHXmlvdE",
  "Dictionary": {
    "ReferenceUuid": "4254acc3-8d68-4a2d-afae-9ef0bca28537",
    "ReferenceSchema": "https://schemas.infopack.io/ivl/xtddictionary.1.schema.json"
  },
  "Names": [
    {
      "UniqueId": "4410ebcb-72a0-4bd9-94fa-c44308daa9c7",
      "Texts": [
        {
          "UniqueId": "811645c0-8e1d-4859-8c30-d9acc6d04767",
          "Text": "human health non-cancer potential for natural soil emissions",
          "Language": {
            "ReferenceUuid": "ff868415-0cbd-49fc-8789-9abf07263274",
            "ReferenceSchema": "https://schemas.infopack.io/ivl/xtdlanguage.1.schema.json"
          }
        }
      ]
    }
  ],
  "Definition": {
    "UniqueId": "4c37af81-6205-4992-8767-605c9f7e3187",
    "Texts": [
      {
        "UniqueId": "88a8e6f0-ab69-478c-90b1-4215817ed53c",
        "Text": "a calculated index that reflects the potential harm (in terms of non-cancer effects) of emissions released into the natural soil, and it is based on both the inherent toxicity of a compound and its potential dose",
        "Language": {
          "ReferenceUuid": "ff868415-0cbd-49fc-8789-9abf07263274",
          "ReferenceSchema": "https://schemas.infopack.io/ivl/xtdlanguage.1.schema.json"
        }
      }
    ]
  },
  "LanguageOfCreator": {
    "ReferenceUuid": "156648a5-939a-4b16-b091-61eb8df3a074",
    "ReferenceSchema": "https://schemas.infopack.io/ivl/xtdlanguage.1.schema.json"
  },
  "MajorVersion": 1,
  "MinorVersion": 0,
  "DateOfCreation": "2024-10-22T22:28:45.528Z",
  "Status": "XTD_ACTIVE"
}