{
  "UniqueId": "04JOWJlvj49ebQ1ftBh3$_",
  "Dictionary": {
    "ReferenceUuid": "4254acc3-8d68-4a2d-afae-9ef0bca28537",
    "ReferenceSchema": "https://schemas.infopack.io/ivl/xtddictionary.1.schema.json"
  },
  "Names": [
    {
      "UniqueId": "97c481c1-ea0f-4f12-8c66-4e13765bdca0",
      "Texts": [
        {
          "UniqueId": "05346fdb-de14-4706-9499-112ec8592b92",
          "Text": "EPD programme operator",
          "Language": {
            "ReferenceUuid": "ff868415-0cbd-49fc-8789-9abf07263274",
            "ReferenceSchema": "https://schemas.infopack.io/ivl/xtdlanguage.1.schema.json"
          }
        }
      ]
    }
  ],
  "Definition": {
    "UniqueId": "ce6f4b8b-2a40-4f8e-ad44-1faf5930468a",
    "Texts": [
      {
        "UniqueId": "ec27a9ee-7d28-4356-97b0-905b6f802785",
        "Text": "нame of the program operator that publishes the EPD",
        "Language": {
          "ReferenceUuid": "ff868415-0cbd-49fc-8789-9abf07263274",
          "ReferenceSchema": "https://schemas.infopack.io/ivl/xtdlanguage.1.schema.json"
        }
      }
    ]
  },
  "LanguageOfCreator": {
    "ReferenceUuid": "156648a5-939a-4b16-b091-61eb8df3a074",
    "ReferenceSchema": "https://schemas.infopack.io/ivl/xtdlanguage.1.schema.json"
  },
  "MajorVersion": 1,
  "MinorVersion": 0,
  "DateOfCreation": "2024-10-22T22:28:45.514Z",
  "Status": "XTD_ACTIVE"
}