<svg width="50" height="50" viewBox="0 0 50 50" fill="none" xmlns="http://www.w3.org/2000/svg">
<g id="&#240;&#159;&#166;&#134; icon &#34;circle dribble&#34;">
<path id="Vector" d="M24.9701 0C28.4349 0 31.6806 0.657109 34.7073 1.97133C37.734 3.28554 40.3823 5.0677 42.6523 7.3178C44.9223 9.5679 46.7145 12.2063 48.0287 15.233C49.3429 18.2597 50 21.5054 50 24.9701C50 28.4349 49.3429 31.6806 48.0287 34.7073C46.7145 37.734 44.9223 40.3823 42.6523 42.6523C40.3823 44.9223 37.734 46.7145 34.7073 48.0287C31.6806 49.3429 28.4349 50 24.9701 50C21.5054 50 18.2597 49.3429 15.233 48.0287C12.2063 46.7145 9.5679 44.9223 7.3178 42.6523C5.0677 40.3823 3.28554 37.734 1.97133 34.7073C0.657109 31.6806 0 28.4349 0 24.9701C0 21.5054 0.657109 18.2597 1.97133 15.233C3.28554 12.2063 5.0677 9.5679 7.3178 7.3178C9.5679 5.0677 12.2063 3.28554 15.233 1.97133C18.2597 0.657109 21.5054 0 24.9701 0ZM24.9701 39.0681C26.9215 39.0681 28.7535 38.6997 30.466 37.963C32.1784 37.2262 33.6718 36.2206 34.9462 34.9462C36.2206 33.6718 37.2262 32.1784 37.963 30.466C38.6997 28.7535 39.0681 26.9215 39.0681 24.9701C39.0681 23.0187 38.6997 21.1967 37.963 19.5042C37.2262 17.8116 36.2206 16.3282 34.9462 15.0538C33.6718 13.7794 32.1784 12.7738 30.466 12.037C28.7535 11.3003 26.9215 10.9319 24.9701 10.9319C23.0585 10.9319 21.2465 11.3003 19.534 12.037C17.8216 12.7738 16.3282 13.7794 15.0538 15.0538C13.7794 16.3282 12.7738 17.8116 12.037 19.5042C11.3003 21.1967 10.9319 23.0187 10.9319 24.9701C10.9319 26.9215 11.3003 28.7535 12.037 30.466C12.7738 32.1784 13.7794 33.6718 15.0538 34.9462C16.3282 36.2206 17.8216 37.2262 19.534 37.963C21.2465 38.6997 23.0585 39.0681 24.9701 39.0681ZM26.1649 25.3883C24.1338 26.0653 22.2919 27.041 20.6392 28.3154C18.9865 29.5898 17.5627 31.1231 16.368 32.9152C14.4962 30.8443 13.4608 28.3751 13.2616 25.5078C13.5802 25.5476 13.869 25.5675 14.1278 25.5675H14.9343C18.5982 25.5675 22.1027 24.9502 25.448 23.7157L25.8065 24.552L26.1649 25.3883ZM27.6583 22.8196C30.1673 21.7045 32.497 20.231 34.6476 18.399C36.0016 20.3505 36.6786 22.5209 36.6786 24.9104C35.1653 24.552 33.6918 24.3728 32.2581 24.3728C30.9438 24.3728 29.6695 24.5121 28.4349 24.7909C28.3154 24.4723 28.1959 24.1438 28.0765 23.8053C27.957 23.4667 27.8176 23.1382 27.6583 22.8196ZM18.1601 34.5281C19.1955 32.8554 20.4699 31.4317 21.9833 30.2569C23.4966 29.082 25.1493 28.1959 26.9415 27.5986C27.3795 28.9526 27.738 30.3365 28.0167 31.7503C28.2955 33.1641 28.5145 34.6077 28.6738 36.0812C27.5189 36.4795 26.2843 36.6786 24.9701 36.6786C22.4612 36.6786 20.1912 35.9618 18.1601 34.5281ZM29.2115 27.0012C30.3266 26.8021 31.3421 26.7025 32.2581 26.7025C33.7316 26.7025 35.1255 26.9016 36.4397 27.2999C36.1211 28.9327 35.4839 30.4261 34.5281 31.7802C33.5723 33.1342 32.3775 34.2294 30.9438 35.0657C30.6651 32.3576 30.0876 29.6695 29.2115 27.0012ZM33.1541 16.6069C32.1187 17.4433 31.0633 18.2099 29.9881 18.9068C28.9128 19.6037 27.7977 20.2111 26.6428 20.7288C25.9658 19.4942 25.2389 18.2895 24.4624 17.1147C23.6858 15.9399 22.8395 14.7949 21.9235 13.6798C22.8793 13.401 23.8949 13.2616 24.9701 13.2616C26.5233 13.2616 27.9968 13.5504 29.3907 14.1278C30.7845 14.7053 32.039 15.5317 33.1541 16.6069ZM24.4325 21.6249C21.366 22.7001 18.1999 23.2378 14.9343 23.2378H14.1278L13.4409 23.178C13.7196 21.3461 14.3967 19.6734 15.4719 18.1601C16.5472 16.6468 17.9211 15.452 19.5938 14.5759C21.4656 16.7264 23.0785 19.0761 24.4325 21.6249Z" fill="#252525"/>
</g>
</svg>
