{
"repositories" :
[
{ "url" : "https://github.com/billyzelsnack/simple_onshape_exportstls.git", "tag" : "" },
{ "url" : "https://gitlab.com/telemotor/users/billy/headtest", "tag" : "" },
{ "url" : "c:/repos/headtest", "tag" : "" }
]
}