[gd_resource type="SpatialMaterial" format=2]

[resource]
emission_enabled = true
emission = Color( 0.854902, 0.701961, 0.105882, 1 )
emission_energy = 0.5
emission_operator = 0
emission_on_uv2 = false
