[gd_resource type="ParticlesMaterial" load_steps=5 format=2]

[sub_resource type="Gradient" id=6]
colors = PoolColorArray( 0.805907, 0.952235, 1, 1, 0.706191, 0.799267, 0.867188, 1 )

[sub_resource type="GradientTexture" id=7]
gradient = SubResource( 6 )

[sub_resource type="Curve" id=4]
_data = [ Vector2( 0, 0 ), 0.0, 0.0, 0, 0, Vector2( 0.242268, 0.761261 ), 0.0, 0.0, 0, 0, Vector2( 0.492268, 0.488739 ), 0.0, 0.0, 0, 0, Vector2( 0.744845, 1 ), 0.0, 0.0, 0, 0, Vector2( 1, 0 ), 0.0, 0.0, 0, 0 ]

[sub_resource type="CurveTexture" id=5]
curve = SubResource( 4 )

[resource]
lifetime_randomness = 0.3
emission_shape = 5
emission_ring_radius = 500.0
emission_ring_inner_radius = 30.0
emission_ring_height = 5.0
emission_ring_axis = Vector3( 0, 1, 0 )
gravity = Vector3( 0, 0, 0 )
initial_velocity = 1.5
initial_velocity_random = 1.0
linear_accel = 0.97
linear_accel_random = 1.0
scale = 20.0
scale_random = 0.98
scale_curve = SubResource( 5 )
color_ramp = SubResource( 7 )
