[gd_scene load_steps=15 format=2]

[ext_resource path="res://src/AlienShip/AlienShipController.gd" type="Script" id=1]
[ext_resource path="res://assets/AlienShip/AlienShipParticleMesh.tres" type="CylinderMesh" id=2]
[ext_resource path="res://assets/AlienShip/sounds/underwater_wakeup.wav" type="AudioStream" id=3]

[sub_resource type="ArrayMesh" id=1]
resource_name = "alien_ship_Cone"
surfaces/0 = {
"aabb": AABB( -0.951056, -1.10361, -3.6871, 1.90211, 1.68226, 5.56571 ),
"array_data": PoolByteArray( 112, 120, 115, 191, 64, 136, 11, 191, 53, 149, 51, 190, 149, 0, 127, 193, 145, 37, 104, 57, 112, 120, 115, 191, 64, 136, 11, 191, 53, 149, 51, 190, 129, 27, 0, 126, 145, 37, 104, 57, 112, 120, 115, 191, 64, 136, 11, 191, 53, 149, 51, 190, 177, 33, 44, 110, 145, 37, 104, 57, 112, 120, 115, 191, 64, 136, 11, 191, 53, 149, 51, 190, 165, 55, 70, 108, 145, 37, 104, 57, 113, 120, 115, 63, 64, 136, 11, 191, 43, 149, 51, 190, 91, 55, 36, 35, 166, 55, 104, 57, 113, 120, 115, 63, 64, 136, 11, 191, 43, 149, 51, 190, 79, 33, 33, 22, 166, 55, 104, 57, 113, 120, 115, 63, 64, 136, 11, 191, 43, 149, 51, 190, 126, 229, 127, 63, 166, 55, 104, 57, 113, 120, 115, 63, 64, 136, 11, 191, 43, 149, 51, 190, 107, 0, 127, 193, 166, 55, 104, 57, 8, 48, 37, 59, 174, 63, 239, 62, 168, 16, 234, 191, 70, 127, 127, 63, 2, 52, 3, 57, 8, 48, 37, 59, 174, 63, 239, 62, 168, 16, 234, 191, 43, 127, 127, 63, 2, 52, 3, 57, 8, 48, 37, 59, 174, 63, 239, 62, 168, 16, 234, 191, 90, 55, 37, 36, 2, 52, 3, 57, 8, 48, 37, 59, 174, 63, 239, 62, 168, 16, 234, 191, 99, 208, 17, 54, 2, 52, 3, 57, 154, 153, 89, 50, 231, 6, 237, 62, 36, 131, 234, 191, 157, 208, 108, 118, 0, 52, 1, 57, 154, 153, 89, 50, 231, 6, 237, 62, 36, 131, 234, 191, 251, 137, 246, 64, 0, 52, 1, 57, 154, 153, 89, 50, 231, 6, 237, 62, 36, 131, 234, 191, 70, 127, 127, 63, 0, 52, 1, 57, 154, 153, 89, 50, 231, 6, 237, 62, 36, 131, 234, 191, 5, 137, 125, 3, 0, 52, 1, 57, 154, 153, 89, 50, 231, 6, 237, 62, 36, 131, 234, 191, 99, 208, 17, 54, 0, 52, 1, 57, 93, 47, 37, 187, 174, 63, 239, 62, 168, 16, 234, 191, 157, 208, 108, 118, 251, 51, 3, 57, 93, 47, 37, 187, 174, 63, 239, 62, 168, 16, 234, 191, 166, 55, 72, 108, 251, 51, 3, 57, 93, 47, 37, 187, 174, 63, 239, 62, 168, 16, 234, 191, 70, 127, 127, 63, 251, 51, 3, 57, 93, 47, 37, 187, 174, 63, 239, 62, 168, 16, 234, 191, 43, 127, 126, 63, 251, 51, 3, 57, 169, 229, 250, 62, 238, 63, 239, 62, 121, 137, 209, 188, 90, 55, 37, 36, 225, 53, 177, 57, 169, 229, 250, 62, 238, 63, 239, 62, 121, 137, 209, 188, 78, 35, 34, 22, 225, 53, 177, 57, 169, 229, 250, 62, 238, 63, 239, 62, 121, 137, 209, 188, 99, 208, 251, 33, 225, 53, 177, 57, 169, 229, 250, 62, 238, 63, 239, 62, 121, 137, 209, 188, 82, 226, 225, 26, 225, 53, 177, 57, 144, 16, 250, 62, 153, 6, 237, 62, 12, 155, 212, 188, 250, 135, 147, 66, 228, 53, 177, 57, 144, 16, 250, 62, 153, 6, 237, 62, 12, 155, 212, 188, 251, 137, 171, 65, 228, 53, 177, 57, 144, 16, 250, 62, 153, 6, 237, 62, 12, 155, 212, 188, 99, 208, 251, 33, 228, 53, 177, 57, 144, 16, 250, 62, 153, 6, 237, 62, 12, 155, 212, 188, 82, 226, 225, 26, 228, 53, 177, 57, 247, 157, 155, 62, 48, 64, 239, 62, 50, 104, 131, 63, 39, 46, 61, 34, 42, 53, 203, 58, 247, 157, 155, 62, 48, 64, 239, 62, 50, 104, 131, 63, 64, 4, 105, 25, 42, 53, 203, 58, 247, 157, 155, 62, 48, 64, 239, 62, 50, 104, 131, 63, 78, 35, 34, 22, 42, 53, 203, 58, 247, 157, 155, 62, 48, 64, 239, 62, 50, 104, 131, 63, 82, 226, 173, 1, 42, 53, 203, 58, 245, 141, 152, 62, 246, 220, 238, 62, 119, 70, 132, 63, 0, 188, 126, 63, 36, 53, 205, 58, 245, 141, 152, 62, 246, 220, 238, 62, 119, 70, 132, 63, 0, 59, 126, 63, 36, 53, 205, 58, 245, 141, 152, 62, 246, 220, 238, 62, 119, 70, 132, 63, 39, 46, 61, 34, 36, 53, 205, 58, 245, 141, 152, 62, 246, 220, 238, 62, 119, 70, 132, 63, 64, 4, 105, 25, 36, 53, 205, 58, 76, 153, 154, 62, 156, 5, 237, 62, 92, 188, 131, 63, 250, 135, 132, 114, 43, 53, 206, 58, 76, 153, 154, 62, 156, 5, 237, 62, 92, 188, 131, 63, 0, 188, 126, 63, 43, 53, 206, 58, 76, 153, 154, 62, 156, 5, 237, 62, 92, 188, 131, 63, 2, 130, 126, 63, 43, 53, 206, 58, 76, 153, 154, 62, 156, 5, 237, 62, 92, 188, 131, 63, 64, 4, 105, 25, 43, 53, 206, 58, 76, 153, 154, 62, 156, 5, 237, 62, 92, 188, 131, 63, 82, 226, 174, 1, 43, 53, 206, 58, 248, 141, 152, 190, 246, 220, 238, 62, 118, 70, 132, 63, 192, 4, 50, 74, 182, 49, 205, 58, 248, 141, 152, 190, 246, 220, 238, 62, 118, 70, 132, 63, 217, 46, 68, 96, 182, 49, 205, 58, 248, 141, 152, 190, 246, 220, 238, 62, 118, 70, 132, 63, 0, 188, 126, 63, 182, 49, 205, 58, 248, 141, 152, 190, 246, 220, 238, 62, 118, 70, 132, 63, 0, 59, 126, 63, 182, 49, 205, 58, 251, 157, 155, 190, 48, 64, 239, 62, 49, 104, 131, 63, 174, 226, 254, 85, 170, 49, 203, 58, 251, 157, 155, 190, 48, 64, 239, 62, 49, 104, 131, 63, 178, 35, 45, 109, 170, 49, 203, 58, 251, 157, 155, 190, 48, 64, 239, 62, 49, 104, 131, 63, 192, 4, 50, 74, 170, 49, 203, 58, 251, 157, 155, 190, 48, 64, 239, 62, 49, 104, 131, 63, 217, 46, 68, 96, 170, 49, 203, 58, 79, 153, 154, 190, 156, 5, 237, 62, 91, 188, 131, 63, 174, 226, 254, 85, 169, 49, 206, 58, 79, 153, 154, 190, 156, 5, 237, 62, 91, 188, 131, 63, 192, 4, 50, 74, 169, 49, 206, 58, 79, 153, 154, 190, 156, 5, 237, 62, 91, 188, 131, 63, 0, 188, 126, 63, 169, 49, 206, 58, 79, 153, 154, 190, 156, 5, 237, 62, 91, 188, 131, 63, 2, 130, 126, 63, 169, 49, 206, 58, 79, 153, 154, 190, 156, 5, 237, 62, 91, 188, 131, 63, 6, 135, 219, 62, 169, 49, 206, 58, 167, 229, 250, 190, 242, 63, 239, 62, 145, 137, 209, 188, 174, 226, 203, 111, 60, 48, 177, 57, 167, 229, 250, 190, 242, 63, 239, 62, 145, 137, 209, 188, 157, 208, 190, 124, 60, 48, 177, 57, 167, 229, 250, 190, 242, 63, 239, 62, 145, 137, 209, 188, 178, 35, 45, 109, 60, 48, 177, 57, 167, 229, 250, 190, 242, 63, 239, 62, 145, 137, 209, 188, 166, 55, 72, 108, 60, 48, 177, 57, 142, 16, 250, 190, 157, 6, 237, 62, 35, 155, 212, 188, 174, 226, 203, 111, 54, 48, 177, 57, 142, 16, 250, 190, 157, 6, 237, 62, 35, 155, 212, 188, 157, 208, 190, 124, 54, 48, 177, 57, 142, 16, 250, 190, 157, 6, 237, 62, 35, 155, 212, 188, 5, 137, 134, 43, 54, 48, 177, 57, 142, 16, 250, 190, 157, 6, 237, 62, 35, 155, 212, 188, 6, 135, 134, 51, 54, 48, 177, 57, 231, 224, 135, 59, 71, 111, 40, 191, 64, 89, 106, 192, 19, 129, 125, 189, 4, 52, 21, 56, 231, 224, 135, 59, 71, 111, 40, 191, 64, 89, 106, 192, 30, 129, 126, 193, 4, 52, 21, 56, 231, 224, 135, 59, 71, 111, 40, 191, 64, 89, 106, 192, 59, 176, 0, 53, 4, 52, 21, 56, 231, 224, 135, 59, 71, 111, 40, 191, 64, 89, 106, 192, 89, 200, 84, 130, 4, 52, 21, 56, 168, 224, 135, 187, 71, 111, 40, 191, 64, 89, 106, 192, 167, 200, 0, 214, 247, 51, 21, 56, 168, 224, 135, 187, 71, 111, 40, 191, 64, 89, 106, 192, 197, 176, 0, 203, 247, 51, 21, 56, 168, 224, 135, 187, 71, 111, 40, 191, 64, 89, 106, 192, 19, 129, 125, 189, 247, 51, 21, 56, 168, 224, 135, 187, 71, 111, 40, 191, 64, 89, 106, 192, 30, 129, 126, 193, 247, 51, 21, 56, 36, 1, 203, 186, 214, 103, 38, 191, 110, 249, 107, 192, 129, 27, 0, 126, 252, 51, 21, 56, 36, 1, 203, 186, 214, 103, 38, 191, 110, 249, 107, 192, 167, 200, 0, 214, 252, 51, 21, 56, 36, 1, 203, 186, 214, 103, 38, 191, 110, 249, 107, 192, 30, 129, 126, 193, 252, 51, 21, 56, 36, 1, 203, 186, 214, 103, 38, 191, 110, 249, 107, 192, 126, 127, 127, 63, 252, 51, 21, 56, 111, 1, 203, 58, 214, 103, 38, 191, 110, 249, 107, 192, 30, 129, 127, 193, 1, 52, 21, 56, 111, 1, 203, 58, 214, 103, 38, 191, 110, 249, 107, 192, 126, 127, 127, 63, 1, 52, 21, 56, 111, 1, 203, 58, 214, 103, 38, 191, 110, 249, 107, 192, 89, 200, 84, 130, 1, 52, 21, 56, 111, 1, 203, 58, 214, 103, 38, 191, 110, 249, 107, 192, 126, 229, 0, 1, 1, 52, 21, 56, 113, 120, 115, 63, 214, 103, 38, 191, 43, 149, 51, 190, 89, 200, 215, 23, 166, 55, 104, 57, 113, 120, 115, 63, 214, 103, 38, 191, 43, 149, 51, 190, 75, 218, 183, 8, 166, 55, 104, 57, 113, 120, 115, 63, 214, 103, 38, 191, 43, 149, 51, 190, 126, 229, 0, 1, 166, 55, 104, 57, 113, 120, 115, 63, 214, 103, 38, 191, 43, 149, 51, 190, 107, 0, 127, 193, 166, 55, 104, 57, 142, 105, 114, 63, 92, 111, 40, 191, 157, 14, 51, 190, 59, 176, 77, 164, 166, 55, 104, 57, 142, 105, 114, 63, 92, 111, 40, 191, 157, 14, 51, 190, 49, 188, 187, 38, 166, 55, 104, 57, 142, 105, 114, 63, 92, 111, 40, 191, 157, 14, 51, 190, 89, 200, 84, 130, 166, 55, 104, 57, 142, 105, 114, 63, 92, 111, 40, 191, 157, 14, 51, 190, 75, 218, 127, 193, 166, 55, 104, 57, 160, 60, 22, 63, 115, 111, 40, 191, 251, 51, 238, 63, 26, 176, 23, 180, 67, 54, 139, 59, 160, 60, 22, 63, 115, 111, 40, 191, 251, 51, 238, 63, 49, 188, 23, 180, 67, 54, 139, 59, 160, 60, 22, 63, 115, 111, 40, 191, 251, 51, 238, 63, 45, 208, 26, 165, 67, 54, 139, 59, 160, 60, 22, 63, 115, 111, 40, 191, 251, 51, 238, 63, 75, 218, 183, 8, 67, 54, 139, 59, 37, 183, 22, 63, 214, 103, 38, 191, 243, 198, 239, 63, 45, 208, 29, 165, 66, 54, 140, 59, 37, 183, 22, 63, 214, 103, 38, 191, 243, 198, 239, 63, 60, 0, 0, 130, 66, 54, 140, 59, 37, 183, 22, 63, 214, 103, 38, 191, 243, 198, 239, 63, 75, 218, 183, 8, 66, 54, 140, 59, 37, 183, 22, 63, 214, 103, 38, 191, 243, 198, 239, 63, 107, 0, 127, 193, 66, 54, 140, 59, 105, 49, 21, 63, 214, 103, 38, 191, 99, 118, 240, 63, 0, 0, 127, 193, 60, 54, 141, 59, 105, 49, 21, 63, 214, 103, 38, 191, 99, 118, 240, 63, 0, 204, 15, 96, 60, 54, 141, 59, 105, 49, 21, 63, 214, 103, 38, 191, 99, 118, 240, 63, 45, 208, 26, 165, 60, 54, 141, 59, 105, 49, 21, 63, 214, 103, 38, 191, 99, 118, 240, 63, 60, 0, 0, 130, 60, 54, 141, 59, 60, 202, 20, 63, 50, 27, 40, 191, 165, 219, 239, 63, 0, 204, 15, 96, 60, 54, 141, 59, 60, 202, 20, 63, 50, 27, 40, 191, 165, 219, 239, 63, 0, 162, 23, 76, 60, 54, 141, 59, 60, 202, 20, 63, 50, 27, 40, 191, 165, 219, 239, 63, 26, 176, 23, 180, 60, 54, 141, 59, 60, 202, 20, 63, 50, 27, 40, 191, 165, 219, 239, 63, 45, 208, 22, 166, 60, 54, 141, 59, 63, 202, 20, 191, 50, 27, 40, 191, 163, 219, 239, 63, 211, 208, 72, 244, 14, 47, 141, 59, 63, 202, 20, 191, 50, 27, 40, 191, 163, 219, 239, 63, 230, 176, 100, 245, 14, 47, 141, 59, 63, 202, 20, 191, 50, 27, 40, 191, 163, 219, 239, 63, 0, 204, 15, 96, 14, 47, 141, 59, 63, 202, 20, 191, 50, 27, 40, 191, 163, 219, 239, 63, 0, 162, 100, 245, 14, 47, 141, 59, 108, 49, 21, 191, 214, 103, 38, 191, 97, 118, 240, 63, 196, 0, 0, 126, 12, 47, 141, 59, 108, 49, 21, 191, 214, 103, 38, 191, 97, 118, 240, 63, 211, 208, 72, 245, 12, 47, 141, 59, 108, 49, 21, 191, 214, 103, 38, 191, 97, 118, 240, 63, 0, 0, 127, 193, 12, 47, 141, 59, 108, 49, 21, 191, 214, 103, 38, 191, 97, 118, 240, 63, 0, 204, 126, 193, 12, 47, 141, 59, 40, 183, 22, 191, 214, 103, 38, 191, 241, 198, 239, 63, 149, 0, 0, 126, 245, 46, 140, 59, 40, 183, 22, 191, 214, 103, 38, 191, 241, 198, 239, 63, 181, 218, 239, 90, 245, 46, 140, 59, 40, 183, 22, 191, 214, 103, 38, 191, 241, 198, 239, 63, 196, 0, 0, 126, 245, 46, 140, 59, 40, 183, 22, 191, 214, 103, 38, 191, 241, 198, 239, 63, 211, 208, 72, 244, 245, 46, 140, 59, 163, 60, 22, 191, 115, 111, 40, 191, 249, 51, 238, 63, 181, 218, 239, 90, 242, 46, 139, 59, 163, 60, 22, 191, 115, 111, 40, 191, 249, 51, 238, 63, 211, 208, 71, 243, 242, 46, 139, 59, 163, 60, 22, 191, 115, 111, 40, 191, 249, 51, 238, 63, 207, 188, 100, 245, 242, 46, 139, 59, 163, 60, 22, 191, 115, 111, 40, 191, 249, 51, 238, 63, 230, 176, 100, 245, 242, 46, 139, 59, 112, 120, 115, 191, 214, 103, 38, 191, 53, 149, 51, 190, 149, 0, 0, 126, 145, 37, 104, 57, 112, 120, 115, 191, 214, 103, 38, 191, 53, 149, 51, 190, 129, 27, 127, 63, 145, 37, 104, 57, 112, 120, 115, 191, 214, 103, 38, 191, 53, 149, 51, 190, 181, 218, 127, 193, 145, 37, 104, 57, 112, 120, 115, 191, 214, 103, 38, 191, 53, 149, 51, 190, 167, 200, 0, 214, 145, 37, 104, 57, 141, 105, 114, 191, 92, 111, 40, 191, 167, 14, 51, 190, 181, 218, 239, 90, 145, 37, 104, 57, 141, 105, 114, 191, 92, 111, 40, 191, 167, 14, 51, 190, 167, 200, 127, 63, 145, 37, 104, 57, 141, 105, 114, 191, 92, 111, 40, 191, 167, 14, 51, 190, 207, 188, 127, 193, 145, 37, 104, 57, 141, 105, 114, 191, 92, 111, 40, 191, 167, 14, 51, 190, 197, 176, 47, 213, 145, 37, 104, 57, 187, 71, 204, 186, 64, 136, 11, 191, 215, 248, 107, 192, 129, 27, 0, 126, 252, 51, 21, 56, 187, 71, 204, 186, 64, 136, 11, 191, 215, 248, 107, 192, 165, 55, 70, 108, 252, 51, 21, 56, 187, 71, 204, 186, 64, 136, 11, 191, 215, 248, 107, 192, 126, 127, 127, 63, 252, 51, 21, 56, 187, 71, 204, 186, 64, 136, 11, 191, 215, 248, 107, 192, 44, 127, 126, 63, 252, 51, 21, 56, 150, 72, 204, 58, 64, 136, 11, 191, 215, 248, 107, 192, 126, 127, 127, 63, 1, 52, 21, 56, 150, 72, 204, 58, 64, 136, 11, 191, 215, 248, 107, 192, 44, 127, 127, 63, 1, 52, 21, 56, 150, 72, 204, 58, 64, 136, 11, 191, 215, 248, 107, 192, 91, 55, 36, 35, 1, 52, 21, 56, 150, 72, 204, 58, 64, 136, 11, 191, 215, 248, 107, 192, 126, 229, 0, 1, 1, 52, 21, 56, 108, 49, 21, 191, 238, 207, 12, 191, 97, 118, 240, 63, 196, 0, 127, 193, 12, 47, 141, 59, 108, 49, 21, 191, 238, 207, 12, 191, 97, 118, 240, 63, 222, 28, 54, 102, 12, 47, 141, 59, 108, 49, 21, 191, 238, 207, 12, 191, 97, 118, 240, 63, 0, 0, 127, 193, 12, 47, 141, 59, 108, 49, 21, 191, 238, 207, 12, 191, 97, 118, 240, 63, 0, 33, 126, 63, 12, 47, 141, 59, 26, 227, 20, 191, 198, 140, 10, 191, 86, 13, 240, 63, 219, 46, 69, 95, 17, 47, 140, 59, 26, 227, 20, 191, 198, 140, 10, 191, 86, 13, 240, 63, 222, 28, 54, 102, 17, 47, 140, 59, 26, 227, 20, 191, 198, 140, 10, 191, 86, 13, 240, 63, 0, 57, 126, 63, 17, 47, 140, 59, 26, 227, 20, 191, 198, 140, 10, 191, 86, 13, 240, 63, 0, 33, 126, 63, 17, 47, 140, 59, 91, 183, 22, 191, 64, 136, 11, 191, 97, 198, 239, 63, 149, 0, 0, 126, 244, 46, 140, 59, 91, 183, 22, 191, 64, 136, 11, 191, 97, 198, 239, 63, 177, 33, 44, 110, 244, 46, 140, 59, 91, 183, 22, 191, 64, 136, 11, 191, 97, 198, 239, 63, 196, 0, 0, 126, 244, 46, 140, 59, 91, 183, 22, 191, 64, 136, 11, 191, 97, 198, 239, 63, 219, 46, 69, 95, 244, 46, 140, 59, 91, 183, 22, 191, 64, 136, 11, 191, 97, 198, 239, 63, 222, 28, 54, 102, 244, 46, 140, 59, 105, 49, 21, 63, 238, 207, 12, 191, 99, 118, 240, 63, 0, 0, 127, 193, 60, 54, 141, 59, 105, 49, 21, 63, 238, 207, 12, 191, 99, 118, 240, 63, 0, 33, 126, 63, 60, 54, 141, 59, 105, 49, 21, 63, 238, 207, 12, 191, 99, 118, 240, 63, 34, 28, 48, 27, 60, 54, 141, 59, 105, 49, 21, 63, 238, 207, 12, 191, 99, 118, 240, 63, 60, 0, 0, 130, 60, 54, 141, 59, 88, 183, 22, 63, 64, 136, 11, 191, 99, 198, 239, 63, 34, 28, 48, 27, 66, 54, 140, 59, 88, 183, 22, 63, 64, 136, 11, 191, 99, 198, 239, 63, 37, 46, 62, 34, 66, 54, 140, 59, 88, 183, 22, 63, 64, 136, 11, 191, 99, 198, 239, 63, 60, 0, 0, 1, 66, 54, 140, 59, 88, 183, 22, 63, 64, 136, 11, 191, 99, 198, 239, 63, 79, 33, 33, 22, 66, 54, 140, 59, 88, 183, 22, 63, 64, 136, 11, 191, 99, 198, 239, 63, 107, 0, 127, 193, 66, 54, 140, 59, 23, 227, 20, 63, 198, 140, 10, 191, 88, 13, 240, 63, 0, 57, 126, 63, 59, 54, 140, 59, 23, 227, 20, 63, 198, 140, 10, 191, 88, 13, 240, 63, 0, 33, 126, 63, 59, 54, 140, 59, 23, 227, 20, 63, 198, 140, 10, 191, 88, 13, 240, 63, 34, 28, 48, 27, 59, 54, 140, 59, 23, 227, 20, 63, 198, 140, 10, 191, 88, 13, 240, 63, 37, 46, 62, 34, 59, 54, 140, 59, 16, 42, 6, 191, 115, 17, 201, 62, 89, 20, 22, 189, 177, 33, 44, 110, 243, 47, 172, 57, 16, 42, 6, 191, 115, 17, 201, 62, 89, 20, 22, 189, 165, 55, 70, 108, 243, 47, 172, 57, 16, 42, 6, 191, 115, 17, 201, 62, 89, 20, 22, 189, 204, 64, 70, 92, 243, 47, 172, 57, 16, 42, 6, 191, 115, 17, 201, 62, 89, 20, 22, 189, 195, 78, 85, 95, 243, 47, 172, 57, 184, 166, 4, 191, 122, 108, 203, 62, 118, 40, 17, 189, 204, 64, 70, 92, 252, 47, 172, 57, 184, 166, 4, 191, 122, 108, 203, 62, 118, 40, 17, 189, 195, 78, 85, 95, 252, 47, 172, 57, 184, 166, 4, 191, 122, 108, 203, 62, 118, 40, 17, 189, 255, 125, 123, 64, 252, 47, 172, 57, 184, 166, 4, 191, 122, 108, 203, 62, 118, 40, 17, 189, 255, 125, 122, 64, 252, 47, 172, 57, 14, 29, 163, 190, 207, 111, 201, 62, 17, 28, 140, 63, 219, 46, 69, 95, 141, 49, 218, 58, 14, 29, 163, 190, 207, 111, 201, 62, 17, 28, 140, 63, 226, 67, 88, 116, 141, 49, 218, 58, 14, 29, 163, 190, 207, 111, 201, 62, 17, 28, 140, 63, 0, 57, 126, 63, 141, 49, 218, 58, 14, 29, 163, 190, 207, 111, 201, 62, 17, 28, 140, 63, 0, 93, 126, 63, 141, 49, 218, 58, 186, 3, 164, 190, 60, 108, 203, 62, 11, 191, 138, 63, 204, 64, 91, 110, 134, 49, 218, 58, 186, 3, 164, 190, 60, 108, 203, 62, 11, 191, 138, 63, 226, 67, 88, 116, 134, 49, 218, 58, 186, 3, 164, 190, 60, 108, 203, 62, 11, 191, 138, 63, 255, 125, 126, 111, 134, 49, 218, 58, 186, 3, 164, 190, 60, 108, 203, 62, 11, 191, 138, 63, 0, 93, 126, 63, 134, 49, 218, 58, 186, 3, 164, 190, 60, 108, 203, 62, 11, 191, 138, 63, 0, 126, 126, 63, 134, 49, 218, 58, 67, 83, 166, 190, 49, 17, 201, 62, 250, 126, 139, 63, 177, 33, 44, 110, 129, 49, 217, 58, 67, 83, 166, 190, 49, 17, 201, 62, 250, 126, 139, 63, 204, 64, 91, 110, 129, 49, 217, 58, 67, 83, 166, 190, 49, 17, 201, 62, 250, 126, 139, 63, 219, 46, 69, 95, 129, 49, 217, 58, 67, 83, 166, 190, 49, 17, 201, 62, 250, 126, 139, 63, 226, 67, 88, 116, 129, 49, 217, 58, 64, 83, 166, 62, 47, 17, 201, 62, 252, 126, 139, 63, 30, 67, 20, 44, 63, 53, 217, 58, 64, 83, 166, 62, 47, 17, 201, 62, 252, 126, 139, 63, 37, 46, 62, 34, 63, 53, 217, 58, 64, 83, 166, 62, 47, 17, 201, 62, 252, 126, 139, 63, 52, 64, 32, 45, 63, 53, 217, 58, 64, 83, 166, 62, 47, 17, 201, 62, 252, 126, 139, 63, 79, 33, 33, 22, 63, 53, 217, 58, 183, 3, 164, 62, 58, 108, 203, 62, 13, 191, 138, 63, 0, 93, 126, 63, 60, 53, 218, 58, 183, 3, 164, 62, 58, 108, 203, 62, 13, 191, 138, 63, 0, 126, 127, 63, 60, 53, 218, 58, 183, 3, 164, 62, 58, 108, 203, 62, 13, 191, 138, 63, 1, 125, 46, 63, 60, 53, 218, 58, 183, 3, 164, 62, 58, 108, 203, 62, 13, 191, 138, 63, 30, 67, 20, 44, 60, 53, 218, 58, 183, 3, 164, 62, 58, 108, 203, 62, 13, 191, 138, 63, 52, 64, 32, 45, 60, 53, 218, 58, 11, 29, 163, 62, 207, 111, 201, 62, 19, 28, 140, 63, 0, 57, 126, 63, 57, 53, 218, 58, 11, 29, 163, 62, 207, 111, 201, 62, 19, 28, 140, 63, 0, 93, 126, 63, 57, 53, 218, 58, 11, 29, 163, 62, 207, 111, 201, 62, 19, 28, 140, 63, 30, 67, 20, 44, 57, 53, 218, 58, 11, 29, 163, 62, 207, 111, 201, 62, 19, 28, 140, 63, 37, 46, 62, 34, 57, 53, 218, 58, 17, 42, 6, 63, 109, 17, 201, 62, 77, 20, 22, 189, 61, 78, 62, 42, 3, 54, 172, 57, 17, 42, 6, 63, 109, 17, 201, 62, 77, 20, 22, 189, 52, 64, 68, 35, 3, 54, 172, 57, 17, 42, 6, 63, 109, 17, 201, 62, 77, 20, 22, 189, 91, 55, 36, 35, 3, 54, 172, 57, 17, 42, 6, 63, 109, 17, 201, 62, 77, 20, 22, 189, 79, 33, 33, 22, 3, 54, 172, 57, 185, 166, 4, 63, 116, 108, 203, 62, 106, 40, 17, 189, 1, 125, 125, 57, 0, 54, 172, 57, 185, 166, 4, 63, 116, 108, 203, 62, 106, 40, 17, 189, 1, 125, 125, 57, 0, 54, 172, 57, 185, 166, 4, 63, 116, 108, 203, 62, 106, 40, 17, 189, 61, 78, 62, 42, 0, 54, 172, 57, 185, 166, 4, 63, 116, 108, 203, 62, 106, 40, 17, 189, 52, 64, 68, 35, 0, 54, 172, 57, 90, 208, 208, 58, 169, 17, 201, 62, 102, 9, 252, 191, 44, 127, 126, 63, 1, 52, 241, 56, 90, 208, 208, 58, 169, 17, 201, 62, 102, 9, 252, 191, 26, 127, 126, 63, 1, 52, 241, 56, 90, 208, 208, 58, 169, 17, 201, 62, 102, 9, 252, 191, 61, 78, 95, 11, 1, 52, 241, 56, 90, 208, 208, 58, 169, 17, 201, 62, 102, 9, 252, 191, 91, 55, 36, 35, 1, 52, 241, 56, 159, 207, 208, 186, 169, 17, 201, 62, 102, 9, 252, 191, 165, 55, 70, 108, 252, 51, 241, 56, 159, 207, 208, 186, 169, 17, 201, 62, 102, 9, 252, 191, 195, 78, 23, 79, 252, 51, 241, 56, 159, 207, 208, 186, 169, 17, 201, 62, 102, 9, 252, 191, 44, 127, 126, 63, 252, 51, 241, 56, 159, 207, 208, 186, 169, 17, 201, 62, 102, 9, 252, 191, 26, 127, 126, 63, 252, 51, 241, 56, 13, 39, 89, 50, 133, 108, 203, 62, 81, 209, 249, 191, 195, 78, 22, 79, 0, 52, 242, 56, 13, 39, 89, 50, 133, 108, 203, 62, 81, 209, 249, 191, 255, 125, 27, 63, 0, 52, 242, 56, 13, 39, 89, 50, 133, 108, 203, 62, 81, 209, 249, 191, 26, 127, 126, 63, 0, 52, 242, 56, 13, 39, 89, 50, 133, 108, 203, 62, 81, 209, 249, 191, 1, 125, 126, 1, 0, 52, 242, 56, 13, 39, 89, 50, 133, 108, 203, 62, 81, 209, 249, 191, 61, 78, 95, 11, 0, 52, 242, 56, 229, 244, 213, 190, 188, 188, 238, 62, 117, 2, 163, 188, 193, 204, 192, 100, 28, 48, 175, 57, 229, 244, 213, 190, 188, 188, 238, 62, 117, 2, 163, 188, 181, 189, 188, 104, 28, 48, 175, 57, 229, 244, 213, 190, 188, 188, 238, 62, 117, 2, 163, 188, 5, 137, 134, 44, 28, 48, 175, 57, 229, 244, 213, 190, 188, 188, 238, 62, 117, 2, 163, 188, 6, 135, 134, 52, 28, 48, 175, 57, 210, 217, 211, 190, 58, 70, 236, 62, 133, 233, 160, 188, 155, 249, 243, 122, 25, 48, 174, 57, 210, 217, 211, 190, 58, 70, 236, 62, 133, 233, 160, 188, 136, 225, 238, 125, 25, 48, 174, 57, 210, 217, 211, 190, 58, 70, 236, 62, 133, 233, 160, 188, 193, 204, 192, 100, 25, 48, 174, 57, 210, 217, 211, 190, 58, 70, 236, 62, 133, 233, 160, 188, 181, 189, 188, 104, 25, 48, 174, 57, 194, 97, 131, 190, 56, 70, 236, 62, 145, 118, 94, 63, 155, 249, 255, 112, 149, 49, 210, 58, 194, 97, 131, 190, 56, 70, 236, 62, 145, 118, 94, 63, 193, 204, 240, 81, 149, 49, 210, 58, 194, 97, 131, 190, 56, 70, 236, 62, 145, 118, 94, 63, 204, 244, 10, 108, 149, 49, 210, 58, 194, 97, 131, 190, 56, 70, 236, 62, 145, 118, 94, 63, 235, 177, 96, 239, 149, 49, 210, 58, 186, 94, 128, 190, 251, 76, 236, 62, 89, 189, 95, 63, 204, 244, 10, 108, 163, 49, 212, 58, 186, 94, 128, 190, 251, 76, 236, 62, 89, 189, 95, 63, 235, 177, 96, 239, 163, 49, 212, 58, 186, 94, 128, 190, 251, 76, 236, 62, 89, 189, 95, 63, 0, 239, 126, 63, 163, 49, 212, 58, 186, 94, 128, 190, 251, 76, 236, 62, 89, 189, 95, 63, 0, 176, 126, 63, 163, 49, 212, 58, 163, 46, 132, 190, 182, 189, 238, 62, 134, 220, 97, 63, 193, 204, 239, 81, 152, 49, 211, 58, 163, 46, 132, 190, 182, 189, 238, 62, 134, 220, 97, 63, 235, 177, 96, 239, 152, 49, 211, 58, 163, 46, 132, 190, 182, 189, 238, 62, 134, 220, 97, 63, 0, 176, 126, 63, 152, 49, 211, 58, 163, 46, 132, 190, 182, 189, 238, 62, 134, 220, 97, 63, 2, 130, 126, 63, 152, 49, 211, 58, 163, 46, 132, 190, 182, 189, 238, 62, 134, 220, 97, 63, 6, 135, 232, 62, 152, 49, 211, 58, 184, 94, 128, 62, 250, 76, 236, 62, 91, 189, 95, 63, 0, 239, 126, 63, 46, 53, 212, 58, 184, 94, 128, 62, 250, 76, 236, 62, 91, 189, 95, 63, 0, 176, 126, 63, 46, 53, 212, 58, 184, 94, 128, 62, 250, 76, 236, 62, 91, 189, 95, 63, 21, 177, 35, 178, 46, 53, 212, 58, 184, 94, 128, 62, 250, 76, 236, 62, 91, 189, 95, 63, 52, 244, 37, 5, 46, 53, 212, 58, 193, 97, 131, 62, 55, 70, 236, 62, 147, 118, 94, 63, 21, 177, 35, 178, 53, 53, 210, 58, 193, 97, 131, 62, 55, 70, 236, 62, 147, 118, 94, 63, 52, 244, 37, 5, 53, 53, 210, 58, 193, 97, 131, 62, 55, 70, 236, 62, 147, 118, 94, 63, 63, 204, 166, 8, 53, 53, 210, 58, 193, 97, 131, 62, 55, 70, 236, 62, 147, 118, 94, 63, 101, 249, 226, 1, 53, 53, 210, 58, 161, 46, 132, 62, 181, 189, 238, 62, 136, 220, 97, 63, 250, 135, 132, 113, 51, 53, 211, 58, 161, 46, 132, 62, 181, 189, 238, 62, 136, 220, 97, 63, 0, 176, 126, 63, 51, 53, 211, 58, 161, 46, 132, 62, 181, 189, 238, 62, 136, 220, 97, 63, 2, 130, 126, 63, 51, 53, 211, 58, 161, 46, 132, 62, 181, 189, 238, 62, 136, 220, 97, 63, 21, 177, 35, 178, 51, 53, 211, 58, 161, 46, 132, 62, 181, 189, 238, 62, 136, 220, 97, 63, 63, 204, 166, 8, 51, 53, 211, 58, 230, 244, 213, 62, 184, 188, 238, 62, 108, 2, 163, 188, 250, 135, 153, 65, 241, 53, 175, 57, 230, 244, 213, 62, 184, 188, 238, 62, 108, 2, 163, 188, 251, 137, 173, 65, 241, 53, 175, 57, 230, 244, 213, 62, 184, 188, 238, 62, 108, 2, 163, 188, 75, 189, 212, 34, 241, 53, 175, 57, 230, 244, 213, 62, 184, 188, 238, 62, 108, 2, 163, 188, 63, 204, 203, 32, 241, 53, 175, 57, 211, 217, 211, 62, 54, 70, 236, 62, 124, 233, 160, 188, 75, 189, 212, 34, 243, 53, 174, 57, 211, 217, 211, 62, 54, 70, 236, 62, 124, 233, 160, 188, 63, 204, 203, 32, 243, 53, 174, 57, 211, 217, 211, 62, 54, 70, 236, 62, 124, 233, 160, 188, 120, 225, 254, 8, 243, 53, 174, 57, 211, 217, 211, 62, 54, 70, 236, 62, 124, 233, 160, 188, 101, 249, 248, 5, 243, 53, 174, 57, 236, 104, 175, 58, 52, 70, 236, 62, 1, 195, 197, 191, 24, 129, 127, 63, 1, 52, 250, 56, 236, 104, 175, 58, 52, 70, 236, 62, 1, 195, 197, 191, 102, 129, 127, 63, 1, 52, 250, 56, 236, 104, 175, 58, 52, 70, 236, 62, 1, 195, 197, 191, 75, 189, 6, 52, 1, 52, 250, 56, 236, 104, 175, 58, 52, 70, 236, 62, 1, 195, 197, 191, 120, 225, 8, 28, 1, 52, 250, 56, 95, 104, 175, 186, 52, 70, 236, 62, 1, 195, 197, 191, 136, 225, 58, 122, 252, 51, 250, 56, 95, 104, 175, 186, 52, 70, 236, 62, 1, 195, 197, 191, 181, 189, 104, 123, 252, 51, 250, 56, 95, 104, 175, 186, 52, 70, 236, 62, 1, 195, 197, 191, 24, 129, 127, 63, 252, 51, 250, 56, 95, 104, 175, 186, 52, 70, 236, 62, 1, 195, 197, 191, 102, 129, 127, 63, 252, 51, 250, 56, 154, 153, 89, 50, 106, 188, 238, 62, 31, 102, 200, 191, 181, 189, 104, 123, 0, 52, 250, 56, 154, 153, 89, 50, 106, 188, 238, 62, 31, 102, 200, 191, 251, 137, 5, 64, 0, 52, 250, 56, 154, 153, 89, 50, 106, 188, 238, 62, 31, 102, 200, 191, 24, 129, 127, 63, 0, 52, 250, 56, 154, 153, 89, 50, 106, 188, 238, 62, 31, 102, 200, 191, 5, 137, 125, 2, 0, 52, 250, 56, 154, 153, 89, 50, 106, 188, 238, 62, 31, 102, 200, 191, 75, 189, 6, 51, 0, 52, 250, 56, 179, 47, 37, 59, 194, 249, 18, 63, 127, 230, 207, 191, 43, 127, 126, 63, 2, 52, 29, 57, 179, 47, 37, 59, 194, 249, 18, 63, 127, 230, 207, 191, 24, 127, 126, 63, 2, 52, 29, 57, 179, 47, 37, 59, 194, 249, 18, 63, 127, 230, 207, 191, 55, 83, 66, 45, 2, 52, 29, 57, 179, 47, 37, 59, 194, 249, 18, 63, 127, 230, 207, 191, 90, 55, 37, 36, 2, 52, 29, 57, 158, 47, 37, 187, 194, 249, 18, 63, 127, 230, 207, 191, 166, 55, 72, 108, 251, 51, 29, 57, 158, 47, 37, 187, 194, 249, 18, 63, 127, 230, 207, 191, 201, 83, 91, 93, 251, 51, 29, 57, 158, 47, 37, 187, 194, 249, 18, 63, 127, 230, 207, 191, 43, 127, 126, 63, 251, 51, 29, 57, 158, 47, 37, 187, 194, 249, 18, 63, 127, 230, 207, 191, 24, 127, 126, 63, 251, 51, 29, 57, 0, 0, 88, 50, 8, 34, 20, 63, 211, 136, 205, 191, 201, 83, 90, 93, 0, 52, 31, 57, 0, 0, 88, 50, 8, 34, 20, 63, 211, 136, 205, 191, 24, 127, 126, 63, 0, 52, 31, 57, 0, 0, 88, 50, 8, 34, 20, 63, 211, 136, 205, 191, 0, 126, 87, 63, 0, 52, 31, 57, 0, 0, 88, 50, 8, 34, 20, 63, 211, 136, 205, 191, 55, 83, 66, 45, 0, 52, 31, 57, 249, 41, 221, 62, 8, 34, 20, 63, 116, 111, 5, 188, 0, 126, 67, 63, 168, 53, 186, 57, 249, 41, 221, 62, 8, 34, 20, 63, 116, 111, 5, 188, 55, 83, 52, 52, 168, 53, 186, 57, 249, 41, 221, 62, 8, 34, 20, 63, 116, 111, 5, 188, 46, 72, 58, 43, 168, 53, 186, 57, 174, 226, 224, 62, 163, 249, 18, 63, 157, 158, 20, 188, 55, 83, 52, 52, 175, 53, 185, 57, 174, 226, 224, 62, 163, 249, 18, 63, 157, 158, 20, 188, 46, 72, 58, 43, 175, 53, 185, 57, 174, 226, 224, 62, 163, 249, 18, 63, 157, 158, 20, 188, 90, 55, 37, 36, 175, 53, 185, 57, 174, 226, 224, 62, 163, 249, 18, 63, 157, 158, 20, 188, 78, 35, 34, 22, 175, 53, 185, 57, 164, 138, 139, 62, 129, 249, 18, 63, 197, 243, 110, 63, 32, 65, 77, 42, 11, 53, 182, 58, 164, 138, 139, 62, 129, 249, 18, 63, 197, 243, 110, 63, 46, 72, 71, 40, 11, 53, 182, 58, 164, 138, 139, 62, 129, 249, 18, 63, 197, 243, 110, 63, 39, 46, 61, 34, 11, 53, 182, 58, 164, 138, 139, 62, 129, 249, 18, 63, 197, 243, 110, 63, 78, 35, 34, 22, 11, 53, 182, 58, 203, 40, 136, 62, 8, 34, 20, 63, 161, 58, 110, 63, 0, 87, 126, 63, 5, 53, 181, 58, 203, 40, 136, 62, 8, 34, 20, 63, 161, 58, 110, 63, 0, 126, 126, 63, 5, 53, 181, 58, 203, 40, 136, 62, 8, 34, 20, 63, 161, 58, 110, 63, 32, 65, 77, 42, 5, 53, 181, 58, 203, 40, 136, 62, 8, 34, 20, 63, 161, 58, 110, 63, 46, 72, 71, 40, 5, 53, 181, 58, 78, 64, 136, 62, 31, 43, 19, 63, 188, 89, 112, 63, 0, 59, 126, 63, 5, 53, 183, 58, 78, 64, 136, 62, 31, 43, 19, 63, 188, 89, 112, 63, 0, 87, 126, 63, 5, 53, 183, 58, 78, 64, 136, 62, 31, 43, 19, 63, 188, 89, 112, 63, 32, 65, 77, 42, 5, 53, 183, 58, 78, 64, 136, 62, 31, 43, 19, 63, 188, 89, 112, 63, 39, 46, 61, 34, 5, 53, 183, 58, 81, 64, 136, 190, 31, 43, 19, 63, 186, 89, 112, 63, 217, 46, 68, 96, 244, 49, 183, 58, 81, 64, 136, 190, 31, 43, 19, 63, 186, 89, 112, 63, 224, 65, 85, 88, 244, 49, 183, 58, 81, 64, 136, 190, 31, 43, 19, 63, 186, 89, 112, 63, 0, 59, 126, 63, 244, 49, 183, 58, 81, 64, 136, 190, 31, 43, 19, 63, 186, 89, 112, 63, 0, 87, 126, 63, 244, 49, 183, 58, 206, 40, 136, 190, 8, 34, 20, 63, 159, 58, 110, 63, 210, 72, 80, 91, 245, 49, 181, 58, 206, 40, 136, 190, 8, 34, 20, 63, 159, 58, 110, 63, 224, 65, 85, 88, 245, 49, 181, 58, 206, 40, 136, 190, 8, 34, 20, 63, 159, 58, 110, 63, 0, 87, 126, 63, 245, 49, 181, 58, 206, 40, 136, 190, 8, 34, 20, 63, 159, 58, 110, 63, 0, 126, 114, 63, 245, 49, 181, 58, 167, 138, 139, 190, 129, 249, 18, 63, 195, 243, 110, 63, 178, 35, 45, 109, 232, 49, 182, 58, 167, 138, 139, 190, 129, 249, 18, 63, 195, 243, 110, 63, 217, 46, 68, 96, 232, 49, 182, 58, 167, 138, 139, 190, 129, 249, 18, 63, 195, 243, 110, 63, 210, 72, 80, 91, 232, 49, 182, 58, 167, 138, 139, 190, 129, 249, 18, 63, 195, 243, 110, 63, 224, 65, 85, 88, 232, 49, 182, 58, 247, 41, 221, 190, 10, 34, 20, 63, 148, 111, 5, 188, 210, 72, 86, 97, 174, 48, 186, 57, 247, 41, 221, 190, 10, 34, 20, 63, 148, 111, 5, 188, 201, 83, 104, 100, 174, 48, 186, 57, 247, 41, 221, 190, 10, 34, 20, 63, 148, 111, 5, 188, 0, 126, 126, 21, 174, 48, 186, 57, 172, 226, 224, 190, 165, 249, 18, 63, 190, 158, 20, 188, 178, 35, 45, 109, 160, 48, 185, 57, 172, 226, 224, 190, 165, 249, 18, 63, 190, 158, 20, 188, 166, 55, 72, 108, 160, 48, 185, 57, 172, 226, 224, 190, 165, 249, 18, 63, 190, 158, 20, 188, 210, 72, 86, 97, 160, 48, 185, 57, 172, 226, 224, 190, 165, 249, 18, 63, 190, 158, 20, 188, 201, 83, 104, 100, 160, 48, 185, 57, 198, 224, 135, 59, 62, 227, 140, 191, 253, 207, 162, 191, 16, 129, 117, 157, 5, 52, 22, 56, 198, 224, 135, 59, 62, 227, 140, 191, 253, 207, 162, 191, 19, 129, 127, 193, 5, 52, 22, 56, 198, 224, 135, 59, 62, 227, 140, 191, 253, 207, 162, 191, 35, 158, 107, 153, 5, 52, 22, 56, 198, 224, 135, 59, 62, 227, 140, 191, 253, 207, 162, 191, 59, 176, 0, 53, 5, 52, 22, 56, 0, 0, 128, 48, 31, 67, 141, 191, 74, 77, 160, 191, 221, 158, 149, 103, 227, 51, 25, 56, 0, 0, 128, 48, 31, 67, 141, 191, 74, 77, 160, 191, 0, 129, 127, 193, 0, 58, 26, 56, 0, 0, 128, 48, 31, 67, 141, 191, 74, 77, 160, 191, 16, 129, 117, 157, 14, 52, 25, 56, 0, 0, 128, 48, 31, 67, 141, 191, 74, 77, 160, 191, 35, 158, 107, 153, 14, 52, 25, 56, 8, 225, 135, 187, 62, 227, 140, 191, 253, 207, 162, 191, 197, 176, 15, 206, 244, 51, 22, 56, 8, 225, 135, 187, 62, 227, 140, 191, 253, 207, 162, 191, 221, 158, 149, 103, 244, 51, 22, 56, 8, 225, 135, 187, 62, 227, 140, 191, 253, 207, 162, 191, 16, 129, 117, 157, 0, 52, 20, 56, 8, 225, 135, 187, 62, 227, 140, 191, 253, 207, 162, 191, 19, 129, 126, 193, 244, 51, 22, 56, 29, 192, 164, 62, 51, 227, 140, 191, 246, 31, 199, 189, 35, 158, 174, 49, 166, 55, 104, 57, 29, 192, 164, 62, 51, 227, 140, 191, 246, 31, 199, 189, 29, 164, 93, 178, 166, 55, 104, 57, 29, 192, 164, 62, 51, 227, 140, 191, 246, 31, 199, 189, 59, 176, 0, 53, 166, 55, 104, 57, 29, 192, 164, 62, 51, 227, 140, 191, 246, 31, 199, 189, 49, 188, 187, 38, 166, 55, 104, 57, 236, 254, 159, 62, 31, 67, 141, 191, 124, 223, 197, 189, 0, 129, 127, 193, 203, 59, 106, 57, 236, 254, 159, 62, 31, 67, 141, 191, 124, 223, 197, 189, 35, 158, 107, 153, 165, 55, 103, 57, 236, 254, 159, 62, 31, 67, 141, 191, 124, 223, 197, 189, 29, 164, 93, 178, 166, 55, 104, 57, 248, 80, 77, 62, 40, 227, 140, 191, 191, 166, 22, 63, 29, 164, 153, 33, 68, 54, 137, 59, 248, 80, 77, 62, 40, 227, 140, 191, 191, 166, 22, 63, 26, 176, 23, 180, 68, 54, 137, 59, 248, 80, 77, 62, 40, 227, 140, 191, 191, 166, 22, 63, 49, 188, 187, 38, 68, 54, 137, 59, 245, 195, 67, 62, 31, 67, 141, 191, 70, 220, 22, 63, 0, 162, 23, 76, 50, 54, 141, 59, 245, 195, 67, 62, 31, 67, 141, 191, 70, 220, 22, 63, 0, 129, 127, 193, 25, 59, 141, 59, 245, 195, 67, 62, 31, 67, 141, 191, 70, 220, 22, 63, 29, 164, 93, 178, 65, 54, 141, 59, 245, 195, 67, 62, 31, 67, 141, 191, 70, 220, 22, 63, 26, 176, 23, 180, 50, 54, 141, 59, 253, 80, 77, 190, 40, 227, 140, 191, 191, 166, 22, 63, 207, 188, 100, 245, 237, 46, 137, 59, 253, 80, 77, 190, 40, 227, 140, 191, 191, 166, 22, 63, 230, 176, 100, 245, 237, 46, 137, 59, 253, 80, 77, 190, 40, 227, 140, 191, 191, 166, 22, 63, 227, 164, 103, 223, 237, 46, 137, 59, 251, 195, 67, 190, 31, 67, 141, 191, 70, 220, 22, 63, 230, 176, 100, 245, 53, 47, 141, 59, 251, 195, 67, 190, 31, 67, 141, 191, 70, 220, 22, 63, 227, 164, 103, 223, 248, 46, 141, 59, 251, 195, 67, 190, 31, 67, 141, 191, 70, 220, 22, 63, 0, 162, 23, 76, 53, 47, 141, 59, 251, 195, 67, 190, 31, 67, 141, 191, 70, 220, 22, 63, 0, 129, 127, 193, 230, 56, 141, 59, 30, 192, 164, 190, 51, 227, 140, 191, 250, 31, 199, 189, 207, 188, 100, 245, 145, 37, 104, 57, 30, 192, 164, 190, 51, 227, 140, 191, 250, 31, 199, 189, 197, 176, 69, 218, 145, 37, 104, 57, 30, 192, 164, 190, 51, 227, 140, 191, 250, 31, 199, 189, 227, 164, 163, 78, 145, 37, 104, 57, 30, 192, 164, 190, 51, 227, 140, 191, 250, 31, 199, 189, 221, 158, 157, 85, 145, 37, 104, 57, 237, 254, 159, 190, 31, 67, 141, 191, 128, 223, 197, 189, 227, 164, 103, 223, 153, 37, 104, 57, 237, 254, 159, 190, 31, 67, 141, 191, 128, 223, 197, 189, 221, 158, 157, 85, 160, 37, 103, 57, 237, 254, 159, 190, 31, 67, 141, 191, 128, 223, 197, 189, 0, 129, 127, 193, 52, 56, 106, 57, 42, 104, 175, 186, 204, 155, 206, 62, 149, 3, 196, 191, 136, 225, 57, 122, 252, 51, 246, 56, 42, 104, 175, 186, 204, 155, 206, 62, 149, 3, 196, 191, 176, 63, 7, 83, 252, 51, 246, 56, 42, 104, 175, 186, 204, 155, 206, 62, 149, 3, 196, 191, 102, 129, 127, 63, 252, 51, 246, 56, 42, 104, 175, 186, 204, 155, 206, 62, 149, 3, 196, 191, 26, 127, 127, 63, 252, 51, 246, 56, 52, 105, 175, 58, 204, 155, 206, 62, 149, 3, 196, 191, 102, 129, 127, 63, 1, 52, 246, 56, 52, 105, 175, 58, 204, 155, 206, 62, 149, 3, 196, 191, 26, 127, 127, 63, 1, 52, 246, 56, 52, 105, 175, 58, 204, 155, 206, 62, 149, 3, 196, 191, 80, 63, 87, 3, 1, 52, 246, 56, 52, 105, 175, 58, 204, 155, 206, 62, 149, 3, 196, 191, 120, 225, 8, 28, 1, 52, 246, 56, 117, 19, 77, 50, 15, 8, 204, 62, 239, 102, 198, 191, 176, 63, 7, 83, 0, 52, 245, 56, 117, 19, 77, 50, 15, 8, 204, 62, 239, 102, 198, 191, 255, 125, 2, 63, 0, 52, 245, 56, 117, 19, 77, 50, 15, 8, 204, 62, 239, 102, 198, 191, 26, 127, 127, 63, 0, 52, 245, 56, 117, 19, 77, 50, 15, 8, 204, 62, 239, 102, 198, 191, 1, 125, 126, 3, 0, 52, 245, 56, 117, 19, 77, 50, 15, 8, 204, 62, 239, 102, 198, 191, 80, 63, 87, 3, 0, 52, 245, 56, 221, 217, 209, 190, 207, 155, 206, 62, 163, 101, 167, 188, 155, 249, 245, 122, 13, 48, 173, 57, 221, 217, 209, 190, 207, 155, 206, 62, 163, 101, 167, 188, 136, 225, 239, 125, 13, 48, 173, 57, 221, 217, 209, 190, 207, 155, 206, 62, 163, 101, 167, 188, 187, 45, 49, 100, 13, 48, 173, 57, 221, 217, 209, 190, 207, 155, 206, 62, 163, 101, 167, 188, 176, 63, 58, 100, 13, 48, 173, 57, 125, 164, 211, 190, 37, 8, 204, 62, 117, 70, 172, 188, 187, 45, 49, 100, 11, 48, 173, 57, 125, 164, 211, 190, 37, 8, 204, 62, 117, 70, 172, 188, 176, 63, 58, 101, 11, 48, 173, 57, 125, 164, 211, 190, 37, 8, 204, 62, 117, 70, 172, 188, 255, 125, 113, 64, 11, 48, 173, 57, 125, 164, 211, 190, 37, 8, 204, 62, 117, 70, 172, 188, 255, 125, 118, 64, 11, 48, 173, 57, 91, 37, 130, 190, 203, 155, 206, 62, 218, 25, 92, 63, 155, 249, 255, 111, 141, 49, 213, 58, 91, 37, 130, 190, 203, 155, 206, 62, 218, 25, 92, 63, 187, 45, 77, 115, 141, 49, 213, 58, 91, 37, 130, 190, 203, 155, 206, 62, 218, 25, 92, 63, 204, 244, 10, 108, 141, 49, 213, 58, 91, 37, 130, 190, 203, 155, 206, 62, 218, 25, 92, 63, 232, 73, 93, 99, 141, 49, 213, 58, 249, 192, 130, 190, 92, 8, 204, 62, 252, 19, 95, 63, 187, 45, 78, 115, 142, 49, 215, 58, 249, 192, 130, 190, 92, 8, 204, 62, 252, 19, 95, 63, 232, 73, 93, 99, 142, 49, 215, 58, 249, 192, 130, 190, 92, 8, 204, 62, 252, 19, 95, 63, 255, 125, 126, 109, 142, 49, 215, 58, 249, 192, 130, 190, 92, 8, 204, 62, 252, 19, 95, 63, 0, 72, 126, 63, 142, 49, 215, 58, 249, 192, 130, 190, 92, 8, 204, 62, 252, 19, 95, 63, 0, 126, 126, 63, 142, 49, 215, 58, 131, 67, 126, 190, 8, 149, 206, 62, 143, 95, 93, 63, 204, 244, 10, 108, 155, 49, 214, 58, 131, 67, 126, 190, 8, 149, 206, 62, 143, 95, 93, 63, 232, 73, 93, 99, 155, 49, 214, 58, 131, 67, 126, 190, 8, 149, 206, 62, 143, 95, 93, 63, 0, 239, 126, 63, 155, 49, 214, 58, 131, 67, 126, 190, 8, 149, 206, 62, 143, 95, 93, 63, 0, 72, 126, 63, 155, 49, 214, 58, 125, 67, 126, 62, 6, 149, 206, 62, 144, 95, 93, 63, 0, 239, 126, 63, 50, 53, 214, 58, 125, 67, 126, 62, 6, 149, 206, 62, 144, 95, 93, 63, 0, 72, 126, 63, 50, 53, 214, 58, 125, 67, 126, 62, 6, 149, 206, 62, 144, 95, 93, 63, 24, 73, 55, 46, 50, 53, 214, 58, 125, 67, 126, 62, 6, 149, 206, 62, 144, 95, 93, 63, 52, 244, 37, 5, 50, 53, 214, 58, 246, 192, 130, 62, 90, 8, 204, 62, 254, 19, 95, 63, 0, 72, 126, 63, 56, 53, 215, 58, 246, 192, 130, 62, 90, 8, 204, 62, 254, 19, 95, 63, 0, 126, 126, 63, 56, 53, 215, 58, 246, 192, 130, 62, 90, 8, 204, 62, 254, 19, 95, 63, 1, 125, 31, 63, 56, 53, 215, 58, 246, 192, 130, 62, 90, 8, 204, 62, 254, 19, 95, 63, 24, 73, 55, 46, 56, 53, 215, 58, 246, 192, 130, 62, 90, 8, 204, 62, 254, 19, 95, 63, 69, 45, 22, 38, 56, 53, 215, 58, 88, 37, 130, 62, 201, 155, 206, 62, 220, 25, 92, 63, 24, 73, 55, 46, 57, 53, 213, 58, 88, 37, 130, 62, 201, 155, 206, 62, 220, 25, 92, 63, 52, 244, 37, 5, 57, 53, 213, 58, 88, 37, 130, 62, 201, 155, 206, 62, 220, 25, 92, 63, 69, 45, 22, 39, 57, 53, 213, 58, 88, 37, 130, 62, 201, 155, 206, 62, 220, 25, 92, 63, 101, 249, 227, 1, 57, 53, 213, 58, 223, 217, 209, 62, 202, 155, 206, 62, 148, 101, 167, 188, 80, 63, 51, 29, 249, 53, 173, 57, 223, 217, 209, 62, 202, 155, 206, 62, 148, 101, 167, 188, 69, 45, 52, 24, 249, 53, 173, 57, 223, 217, 209, 62, 202, 155, 206, 62, 148, 101, 167, 188, 120, 225, 254, 9, 249, 53, 173, 57, 223, 217, 209, 62, 202, 155, 206, 62, 148, 101, 167, 188, 101, 249, 248, 6, 249, 53, 173, 57, 127, 164, 211, 62, 32, 8, 204, 62, 100, 70, 172, 188, 1, 125, 125, 59, 250, 53, 173, 57, 127, 164, 211, 62, 32, 8, 204, 62, 100, 70, 172, 188, 1, 125, 125, 59, 250, 53, 173, 57, 127, 164, 211, 62, 32, 8, 204, 62, 100, 70, 172, 188, 80, 63, 52, 29, 250, 53, 173, 57, 127, 164, 211, 62, 32, 8, 204, 62, 100, 70, 172, 188, 69, 45, 52, 24, 250, 53, 173, 57 ),
"array_index_data": PoolByteArray( 134, 0, 81, 0, 6, 0, 134, 0, 78, 0, 81, 0, 104, 1, 81, 1, 70, 1, 81, 1, 97, 1, 88, 1, 81, 1, 104, 1, 97, 1, 84, 0, 86, 1, 88, 0, 84, 0, 80, 1, 86, 1, 162, 0, 128, 0, 207, 0, 162, 0, 3, 0, 128, 0, 117, 0, 98, 1, 125, 0, 117, 0, 91, 1, 98, 1, 100, 0, 96, 1, 106, 0, 100, 0, 87, 1, 96, 1, 126, 0, 73, 1, 68, 0, 126, 0, 99, 1, 73, 1, 191, 0, 141, 0, 171, 0, 191, 0, 157, 0, 141, 0, 125, 1, 212, 0, 114, 1, 125, 1, 168, 0, 212, 0, 178, 0, 2, 0, 161, 0, 178, 0, 144, 0, 2, 0, 198, 0, 155, 0, 185, 0, 198, 0, 5, 0, 155, 0, 206, 0, 4, 0, 197, 0, 206, 0, 133, 0, 4, 0, 132, 1, 167, 0, 124, 1, 132, 1, 175, 0, 167, 0, 144, 1, 177, 0, 134, 1, 144, 1, 187, 0, 177, 0, 157, 1, 188, 0, 145, 1, 157, 1, 200, 0, 188, 0, 116, 1, 199, 0, 156, 1, 116, 1, 214, 0, 199, 0, 221, 0, 105, 1, 6, 1, 221, 0, 119, 1, 105, 1, 58, 0, 19, 1, 62, 1, 58, 0, 18, 0, 19, 1, 34, 0, 48, 1, 42, 1, 34, 0, 45, 0, 48, 1, 47, 0, 61, 1, 54, 1, 47, 0, 57, 0, 61, 1, 65, 0, 79, 1, 83, 0, 65, 0, 68, 1, 79, 1, 22, 0, 37, 1, 33, 1, 22, 0, 31, 0, 37, 1, 61, 0, 13, 1, 15, 0, 61, 0, 218, 0, 13, 1, 54, 0, 219, 0, 62, 0, 54, 0, 236, 0, 219, 0, 39, 0, 235, 0, 53, 0, 39, 0, 247, 0, 235, 0, 25, 0, 245, 0, 37, 0, 25, 0, 250, 0, 245, 0, 13, 0, 251, 0, 26, 0, 13, 0, 11, 1, 251, 0, 148, 0, 109, 0, 137, 0, 148, 0, 95, 0, 109, 0, 1, 0, 71, 0, 127, 0, 1, 0, 120, 0, 71, 0, 143, 0, 119, 0, 0, 0, 143, 0, 111, 0, 119, 0, 7, 0, 94, 0, 156, 0, 7, 0, 82, 0, 94, 0, 25, 1, 53, 1, 60, 1, 53, 1, 27, 1, 39, 1, 53, 1, 25, 1, 27, 1, 5, 1, 154, 1, 0, 1, 5, 1, 112, 1, 154, 1, 1, 1, 151, 1, 244, 0, 1, 1, 155, 1, 151, 1, 237, 0, 137, 1, 230, 0, 237, 0, 139, 1, 137, 1, 224, 0, 118, 1, 220, 0, 224, 0, 126, 1, 118, 1, 8, 0, 19, 0, 14, 0, 30, 0, 40, 0, 36, 0, 42, 0, 51, 0, 48, 0, 64, 0, 73, 0, 70, 0, 64, 0, 75, 0, 73, 0, 89, 0, 97, 0, 91, 0, 89, 0, 102, 0, 97, 0, 103, 0, 114, 0, 108, 0, 103, 0, 116, 0, 114, 0, 136, 0, 147, 0, 140, 0, 150, 0, 159, 0, 152, 0, 170, 0, 181, 0, 174, 0, 182, 0, 193, 0, 189, 0, 204, 0, 213, 0, 210, 0, 227, 0, 233, 0, 229, 0, 239, 0, 248, 0, 241, 0, 2, 1, 12, 1, 8, 1, 16, 1, 24, 1, 22, 1, 34, 1, 44, 1, 40, 1, 47, 1, 57, 1, 51, 1, 65, 1, 75, 1, 71, 1, 108, 1, 115, 1, 110, 1, 129, 1, 136, 1, 131, 1, 141, 1, 148, 1, 146, 1, 11, 0, 27, 0, 23, 0, 11, 0, 16, 0, 27, 0, 24, 0, 41, 0, 32, 0, 24, 0, 28, 0, 41, 0, 45, 1, 29, 0, 35, 0, 45, 1, 36, 1, 29, 0, 33, 0, 52, 0, 44, 0, 33, 0, 38, 0, 52, 0, 55, 1, 43, 0, 49, 0, 55, 1, 46, 1, 43, 0, 46, 0, 59, 0, 55, 0, 46, 0, 50, 0, 59, 0, 56, 0, 12, 0, 17, 0, 56, 0, 60, 0, 12, 0, 77, 0, 85, 0, 79, 0, 77, 0, 66, 0, 85, 0, 80, 0, 90, 0, 93, 0, 80, 0, 86, 0, 90, 0, 96, 0, 105, 0, 110, 0, 96, 0, 99, 0, 105, 0, 112, 0, 123, 0, 121, 0, 112, 0, 115, 0, 123, 0, 122, 0, 67, 0, 72, 0, 122, 0, 124, 0, 67, 0, 131, 0, 74, 0, 76, 0, 131, 0, 129, 0, 74, 0, 203, 0, 130, 0, 132, 0, 203, 0, 209, 0, 130, 0, 107, 0, 145, 0, 135, 0, 107, 0, 113, 0, 145, 0, 92, 0, 151, 0, 154, 0, 92, 0, 98, 0, 151, 0, 138, 0, 158, 0, 149, 0, 138, 0, 142, 0, 158, 0, 139, 0, 180, 0, 169, 0, 139, 0, 146, 0, 180, 0, 153, 0, 194, 0, 183, 0, 153, 0, 160, 0, 194, 0, 208, 0, 166, 0, 164, 0, 208, 0, 211, 0, 166, 0, 163, 0, 173, 0, 179, 0, 163, 0, 165, 0, 173, 0, 172, 0, 186, 0, 192, 0, 172, 0, 176, 0, 186, 0, 184, 0, 202, 0, 196, 0, 184, 0, 190, 0, 202, 0, 195, 0, 215, 0, 205, 0, 195, 0, 201, 0, 215, 0, 135, 1, 226, 0, 228, 0, 135, 1, 128, 1, 226, 0, 149, 1, 240, 0, 242, 0, 149, 1, 142, 1, 240, 0, 254, 0, 14, 1, 4, 1, 254, 0, 252, 0, 14, 1, 243, 0, 253, 0, 255, 0, 243, 0, 249, 0, 253, 0, 231, 0, 246, 0, 238, 0, 231, 0, 234, 0, 246, 0, 222, 0, 232, 0, 225, 0, 222, 0, 216, 0, 232, 0, 7, 1, 217, 0, 223, 0, 7, 1, 10, 1, 217, 0, 20, 0, 15, 1, 21, 1, 20, 0, 9, 0, 15, 1, 59, 1, 20, 1, 23, 1, 59, 1, 64, 1, 20, 1, 50, 1, 63, 1, 58, 1, 50, 1, 56, 1, 63, 1, 38, 1, 49, 1, 52, 1, 38, 1, 43, 1, 49, 1, 29, 1, 35, 1, 41, 1, 29, 1, 31, 1, 35, 1, 26, 1, 30, 1, 28, 1, 26, 1, 17, 1, 30, 1, 67, 1, 82, 1, 77, 1, 67, 1, 72, 1, 82, 1, 78, 1, 89, 1, 84, 1, 78, 1, 83, 1, 89, 1, 93, 1, 102, 1, 100, 1, 93, 1, 95, 1, 102, 1, 101, 1, 69, 1, 74, 1, 101, 1, 103, 1, 69, 1, 63, 0, 76, 1, 66, 1, 63, 0, 69, 0, 76, 1, 118, 0, 94, 1, 92, 1, 118, 0, 104, 0, 94, 1, 85, 1, 101, 0, 87, 0, 85, 1, 90, 1, 101, 0, 3, 1, 107, 1, 109, 1, 3, 1, 9, 1, 107, 1, 158, 1, 111, 1, 117, 1, 158, 1, 152, 1, 111, 1, 147, 1, 153, 1, 159, 1, 147, 1, 150, 1, 153, 1, 133, 1, 140, 1, 143, 1, 133, 1, 138, 1, 140, 1, 122, 1, 127, 1, 130, 1, 122, 1, 120, 1, 127, 1, 113, 1, 121, 1, 123, 1, 113, 1, 106, 1, 121, 1, 10, 0, 32, 1, 18, 1, 10, 0, 21, 0, 32, 1 ),
"blend_shape_data": [  ],
"format": 2194711,
"index_count": 600,
"primitive": 4,
"skeleton_aabb": [  ],
"vertex_count": 416
}

[sub_resource type="Shader" id=10]
code = "/*
	魔法防御シェーダー 4 by あるる（きのもと 結衣）
	Magical Shield Shader 4 by Yui Kinomoto @arlez80

	MIT License
*/

shader_type spatial;
render_mode unshaded, depth_draw_never;

uniform vec2 speed = vec2( 0.2, 0.2 );
uniform vec4 barrier_color : hint_color = vec4( 0.05, 0.8, 1.0, 1.0 );
uniform float barrier_force = 1.0;
uniform float barrier_noise_force = 0.3;
uniform float barrier_fog_noise_force = 0.01;
uniform sampler2D barrier_noise : hint_normal;

void fragment( )
{
	float rim = pow( 1.0 - dot( NORMAL, VIEW ), 4.0 ) * barrier_force;

	vec2 p = texture( barrier_noise, -UV ).xy + TIME * speed;
	float line_noise = clamp( ( sin( texture( barrier_noise, p ).r * 3.1415926535 ) - 0.995 ) * 90.0, 0.0, 1.0 ) * barrier_noise_force - barrier_noise_force * 0.5;
	vec3 line_color = texture( SCREEN_TEXTURE, SCREEN_UV + line_noise ).rgb;
	vec3 fog_color = texture( SCREEN_TEXTURE, SCREEN_UV + texture( barrier_noise, vec2( UV.x * 8.0 - TIME * speed.x, UV.y * 8.0 ) ).r * barrier_fog_noise_force - barrier_fog_noise_force * 0.5 ).rgb;

	ALBEDO = mix( fog_color.rgb, line_color.rgb, ( abs(line_noise) < 0.1 ) ? 1.0 : 0.0 ) + barrier_color.rgb * rim;
	ALPHA = 1.0;
}"

[sub_resource type="OpenSimplexNoise" id=12]

[sub_resource type="NoiseTexture" id=13]
noise = SubResource( 12 )

[sub_resource type="ShaderMaterial" id=11]
shader = SubResource( 10 )
shader_param/speed = Vector2( 0.2, 0.2 )
shader_param/barrier_color = Color( 0.05, 0.8, 1, 1 )
shader_param/barrier_force = 1.0
shader_param/barrier_noise_force = 2.0
shader_param/barrier_fog_noise_force = 0.01
shader_param/barrier_noise = SubResource( 13 )

[sub_resource type="SphereShape" id=2]
radius = 450.0

[sub_resource type="Curve" id=5]
_data = [ Vector2( 0, 0 ), 0.0, -0.00970958, 0, 0, Vector2( 0.631443, 1 ), 0.0, 0.0, 0, 0, Vector2( 1, 0 ), -3.46189, 0.0, 0, 0 ]

[sub_resource type="CurveTexture" id=6]
curve = SubResource( 5 )

[sub_resource type="Curve" id=7]
_data = [ Vector2( 0, 1 ), 0.0, 0.0, 0, 0, Vector2( 0.489691, 0.00225234 ), 0.0, 0.0, 0, 0, Vector2( 1, 1 ), 0.0, 0.0, 0, 0 ]

[sub_resource type="CurveTexture" id=8]
curve = SubResource( 7 )

[sub_resource type="ParticlesMaterial" id=3]
trail_size_modifier = SubResource( 8 )
emission_shape = 1
emission_sphere_radius = 500.0
flag_align_y = true
gravity = Vector3( 0, 0, 0 )
radial_accel = -100.0
scale = 3.0
scale_random = 0.38
scale_curve = SubResource( 6 )

[node name="AlienShip" type="Spatial"]
script = ExtResource( 1 )

[node name="Armature" type="Spatial" parent="."]
transform = Transform( 2.5, 0, 0, 0, 2.5, 0, 0, 0, 2.5, 0, 0, 0 )

[node name="AlienShip" type="MeshInstance" parent="Armature"]
transform = Transform( 20, 0, 0, 0, -8.74228e-07, -20, 0, 20, -8.74228e-07, 0, 0.502212, -0.133643 )
mesh = SubResource( 1 )
material/0 = null

[node name="AlienShipShield" type="MeshInstance" parent="Armature"]
transform = Transform( 21, 0, 0, 0, -9.17939e-07, -21, 0, 21, -9.17939e-07, 0, 0.502212, -0.133643 )
visible = false
mesh = SubResource( 1 )
material/0 = SubResource( 11 )

[node name="DetectRange" type="Area" parent="."]

[node name="CollisionShape" type="CollisionShape" parent="DetectRange"]
shape = SubResource( 2 )

[node name="AbsorbingParticles" type="Particles" parent="."]
emitting = false
lifetime = 2.5
preprocess = 1.0
visibility_aabb = AABB( -452.452, -461.799, -482.63, 904.904, 923.597, 965.261 )
process_material = SubResource( 3 )
draw_pass_1 = ExtResource( 2 )

[node name="RotateTimer" type="Timer" parent="."]
wait_time = 30.0
one_shot = true

[node name="TranslateTimer" type="Timer" parent="."]
wait_time = 30.0
one_shot = true

[node name="DelayTimer" type="Timer" parent="."]
wait_time = 15.0
one_shot = true

[node name="EmissionStopTimer" type="Timer" parent="."]
wait_time = 10.0
one_shot = true

[node name="AlienSounds" type="AudioStreamPlayer3D" parent="."]
stream = ExtResource( 3 )
unit_db = 50.0

[connection signal="wake_up" from="." to="." method="_on_AlienShip_wake_up"]
[connection signal="body_entered" from="DetectRange" to="." method="_on_DetectRange_body_entered"]
[connection signal="timeout" from="TranslateTimer" to="." method="_on_TranslateTimer_timeout"]
[connection signal="timeout" from="DelayTimer" to="." method="_on_DelayTimer_timeout"]
[connection signal="timeout" from="EmissionStopTimer" to="." method="_on_EmissionStopTimer_timeout"]
[connection signal="finished" from="AlienSounds" to="." method="_on_AlienSounds_finished"]
