{
  $schema: 'https://docs.renovatebot.com/renovate-schema.json',
  extends: [
    'config:recommended',
  ],
  automerge: true,
  customManagers: [
    {
      customType: 'regex',
      fileMatch: [
        '^Containerfile$',
      ],
      matchStrings: [
        'FROM docker.io/library/node:(?<currentValue>.*?)-alpine\\n',
      ],
      depNameTemplate: 'node',
      datasourceTemplate: 'node',
      versioningTemplate: 'node',
    },
  ],
  packageRules: [
    {
      groupName: 'angular with cli monorepo',
      matchUpdateTypes: [
        'digest',
        'patch',
        'minor',
        'major',
      ],
      matchSourceUrls: [
        'https://github.com/angular/angular',
        'https://github.com/angular/angular-cli',
      ],
    },
    {
      matchPackageNames: [
        'node',
      ],
      matchManagers: [
        'dockerfile',
      ],
      enabled: false,
    },
  ],
}
