#
# There is insufficient memory for the Java Runtime Environment to continue.
# Native memory allocation (malloc) failed to allocate 1048576 bytes for AllocateHeap
# Possible reasons:
#   The system is out of physical RAM or swap space
#   The process is running with CompressedOops enabled, and the Java Heap may be blocking the growth of the native heap
# Possible solutions:
#   Reduce memory load on the system
#   Increase physical memory or swap space
#   Check if swap backing store is full
#   Decrease Java heap size (-Xmx/-Xms)
#   Decrease number of Java threads
#   Decrease Java thread stack sizes (-Xss)
#   Set larger code cache with -XX:ReservedCodeCacheSize=
#   JVM is running with Unscaled Compressed Oops mode in which the Java heap is
#     placed in the first 4GB address space. The Java Heap base address is the
#     maximum limit for the native heap growth. Please use -XX:HeapBaseMinAddress
#     to set the Java Heap base and to place the Java Heap above 4GB virtual address.
# This output file may be truncated or incomplete.
#
#  Out of Memory Error (t:/workspace/open/src/hotspot/share/memory/allocation.cpp:45), pid=7380, tid=5032
#
# JRE version: Java(TM) SE Runtime Environment (13.0+33) (build 13+33)
# Java VM: Java HotSpot(TM) 64-Bit Server VM (13+33, mixed mode, sharing, tiered, compressed oops, g1 gc, windows-amd64)
# No core dump will be written. Minidumps are not enabled by default on client versions of Windows
#

---------------  S U M M A R Y ------------

Command Line: -ea -Dfile.encoding=UTF-8 org.eclipse.jdt.internal.junit.runner.RemoteTestRunner -version 3 -port 55682 -testLoaderClass org.eclipse.jdt.internal.junit5.runner.JUnit5TestLoader -loaderpluginname org.eclipse.jdt.junit5.runtime -test com.fr.adaming.controller.impl.ReviewControllerImplTest:saveValidReviewExample_shouldReturnEntityWithNotNullId

Host: Intel(R) Core(TM) i5-6200U CPU @ 2.30GHz, 4 cores, 7G,  Windows 10 , 64 bit Build 17763 (10.0.17763.475)
Time: Mon Nov 25 14:04:07 2019 Paris, Madrid elapsed time: 12 seconds (0d 0h 0m 12s)

---------------  T H R E A D  ---------------

Current thread (0x000001bddcb30800):  VMThread "VM Thread" [stack: 0x000000b14e700000,0x000000b14e800000] [id=5032]

Stack: [0x000000b14e700000,0x000000b14e800000]
[error occurred during error reporting (printing stack bounds), id 0xc0000005, EXCEPTION_ACCESS_VIOLATION (0xc0000005) at pc=0x000001bdc69f10ad]

Native frames: (J=compiled Java code, j=interpreted, Vv=VM code, C=native code)
V  [jvm.dll+0x626eaa]
V  [jvm.dll+0x772c4a]
V  [jvm.dll+0x7743ff]
V  [jvm.dll+0x774965]
V  [jvm.dll+0x77491b]
V  [jvm.dll+0x6266df]
C  [ntdll.dll+0x66b26]
C  [ntdll.dll+0x4849]
C  [ntdll.dll+0xa34ee]
C  0x000001bdc69f10ad

VM_Operation (0x000000b14e1f9170): CollectForMetadataAllocation, mode: safepoint, requested by thread 0x000001bdbe502800


---------------  P R O C E S S  ---------------

Threads class SMR info:
_java_thread_list=0x000001bde34da9a0, length=14, elements={
0x000001bdbe502800, 0x000001bddcb34000, 0x000001bddcb37000, 0x000001bddcb4f800,
0x000001bddcb51800, 0x000001bddcb54000, 0x000001bddcb58000, 0x000001bddcb5b000,
0x000001bddd5a8800, 0x000001bddd5c2000, 0x000001bdddfa1800, 0x000001bddfd79800,
0x000001bddfd78800, 0x000001bddfd7a000
}

Java Threads: ( => current thread )
  0x000001bdbe502800 JavaThread "main" [_thread_blocked, id=3100, stack(0x000000b14e100000,0x000000b14e200000)]
  0x000001bddcb34000 JavaThread "Reference Handler" daemon [_thread_blocked, id=5232, stack(0x000000b14e800000,0x000000b14e900000)]
  0x000001bddcb37000 JavaThread "Finalizer" daemon [_thread_blocked, id=10976, stack(0x000000b14e900000,0x000000b14ea00000)]
  0x000001bddcb4f800 JavaThread "Signal Dispatcher" daemon [_thread_blocked, id=5664, stack(0x000000b14ea00000,0x000000b14eb00000)]
  0x000001bddcb51800 JavaThread "Attach Listener" daemon [_thread_blocked, id=12504, stack(0x000000b14eb00000,0x000000b14ec00000)]
  0x000001bddcb54000 JavaThread "C2 CompilerThread0" daemon [_thread_blocked, id=9972, stack(0x000000b14ec00000,0x000000b14ed00000)]
  0x000001bddcb58000 JavaThread "C1 CompilerThread0" daemon [_thread_blocked, id=13964, stack(0x000000b14ed00000,0x000000b14ee00000)]
  0x000001bddcb5b000 JavaThread "Sweeper thread" daemon [_thread_blocked, id=13072, stack(0x000000b14ee00000,0x000000b14ef00000)]
  0x000001bddd5a8800 JavaThread "Service Thread" daemon [_thread_blocked, id=8632, stack(0x000000b14ef00000,0x000000b14f000000)]
  0x000001bddd5c2000 JavaThread "Common-Cleaner" daemon [_thread_blocked, id=9476, stack(0x000000b14f100000,0x000000b14f200000)]
  0x000001bdddfa1800 JavaThread "ReaderThread" [_thread_in_native, id=7480, stack(0x000000b14f200000,0x000000b14f300000)]
  0x000001bddfd79800 JavaThread "mysql-cj-abandoned-connection-cleanup" daemon [_thread_blocked, id=412, stack(0x000000b14f700000,0x000000b14f800000)]
  0x000001bddfd78800 JavaThread "HikariPool-1 housekeeper" daemon [_thread_blocked, id=8684, stack(0x000000b14f800000,0x000000b14f900000)]
  0x000001bddfd7a000 JavaThread "HikariPool-1 connection adder" daemon [_thread_blocked, id=10412, stack(0x000000b14f900000,0x000000b14fa00000)]

Other Threads:
=>0x000001bddcb30800 VMThread "VM Thread" [stack: 0x000000b14e700000,0x000000b14e800000] [id=5032]
  0x000001bddd5aa800 WatcherThread [stack: 0x000000b14f000000,0x000000b14f100000] [id=4412]
  0x000001bdbe545800 GCTaskThread "GC Thread#0" [stack: 0x000000b14e200000,0x000000b14e300000] [id=10440]
  0x000001bdddfcf800 GCTaskThread "GC Thread#1" [stack: 0x000000b14f300000,0x000000b14f400000] [id=13956]
  0x000001bdde085800 GCTaskThread "GC Thread#2" [stack: 0x000000b14f400000,0x000000b14f500000] [id=6656]
  0x000001bdde086000 GCTaskThread "GC Thread#3" [stack: 0x000000b14f500000,0x000000b14f600000] [id=7512]
  0x000001bdbe559800 ConcurrentGCThread "G1 Main Marker" [stack: 0x000000b14e300000,0x000000b14e400000] [id=9988]
  0x000001bdbe55b000 ConcurrentGCThread "G1 Conc#0" [stack: 0x000000b14e400000,0x000000b14e500000] [id=14312]
  0x000001bddc9af800 ConcurrentGCThread "G1 Refine#0" [stack: 0x000000b14e500000,0x000000b14e600000] [id=6276]
  0x000001bddc9b0800 ConcurrentGCThread "G1 Young RemSet Sampling" [stack: 0x000000b14e600000,0x000000b14e700000] [id=5144]

Threads with active compile tasks:
C2 CompilerThread0    12294 5795       4       java.util.regex.Pattern$BmpCharProperty::match (55 bytes)

VM state:at safepoint (normal execution)

VM Mutex/Monitor currently owned by a thread:  ([mutex/lock_event])
[0x000001bdbe4fd340] Threads_lock - owner thread: 0x000001bddcb30800
[0x000001bdbe4fcec0] Heap_lock - owner thread: 0x000001bdbe502800

Heap address: 0x0000000081800000, size: 2024 MB, Compressed Oops mode: 32-bit
Narrow klass base: 0x0000000800000000, Narrow klass shift: 3
Compressed class space size: 1073741824 Address: 0x0000000800b40000

Heap:
 garbage-first heap   total 78848K, used 26112K [0x0000000081800000, 0x0000000100000000)
  region size 1024K, 4 young (4096K), 2 survivors (2048K)
 Metaspace       used 54459K, capacity 55825K, committed 55884K, reserved 1112064K
  class space    used 7270K, capacity 7797K, committed 7808K, reserved 1048576K
Heap Regions: E=young(eden), S=young(survivor), O=old, HS=humongous(starts), HC=humongous(continues), CS=collection set, F=free, A=archive, TAMS=top-at-mark-start (previous, next)
|   0|0x0000000081800000, 0x0000000081900000, 0x0000000081900000|100%|HS|  |TAMS 0x0000000081900000, 0x0000000081900000| Complete 
|   1|0x0000000081900000, 0x0000000081a00000, 0x0000000081a00000|100%| O|  |TAMS 0x0000000081a00000, 0x0000000081a00000| Untracked 
|   2|0x0000000081a00000, 0x0000000081b00000, 0x0000000081b00000|100%| O|  |TAMS 0x0000000081b00000, 0x0000000081b00000| Untracked 
|   3|0x0000000081b00000, 0x0000000081c00000, 0x0000000081c00000|100%| O|  |TAMS 0x0000000081c00000, 0x0000000081c00000| Untracked 
|   4|0x0000000081c00000, 0x0000000081d00000, 0x0000000081d00000|100%| O|  |TAMS 0x0000000081d00000, 0x0000000081d00000| Untracked 
|   5|0x0000000081d00000, 0x0000000081e00000, 0x0000000081e00000|100%| O|  |TAMS 0x0000000081e00000, 0x0000000081e00000| Untracked 
|   6|0x0000000081e00000, 0x0000000081e77200, 0x0000000081f00000| 46%| O|  |TAMS 0x0000000081e77200, 0x0000000081e77200| Untracked 
|   7|0x0000000081f00000, 0x0000000082000000, 0x0000000082000000|100%| O|  |TAMS 0x0000000082000000, 0x0000000082000000| Untracked 
|   8|0x0000000082000000, 0x0000000082100000, 0x0000000082100000|100%| O|  |TAMS 0x0000000082100000, 0x0000000082100000| Untracked 
|   9|0x0000000082100000, 0x0000000082200000, 0x0000000082200000|100%| O|  |TAMS 0x0000000082200000, 0x0000000082200000| Untracked 
|  10|0x0000000082200000, 0x0000000082300000, 0x0000000082300000|100%| O|  |TAMS 0x0000000082300000, 0x0000000082300000| Untracked 
|  11|0x0000000082300000, 0x0000000082400000, 0x0000000082400000|100%| O|  |TAMS 0x0000000082400000, 0x0000000082400000| Untracked 
|  12|0x0000000082400000, 0x0000000082500000, 0x0000000082500000|100%| O|  |TAMS 0x0000000082500000, 0x0000000082500000| Untracked 
|  13|0x0000000082500000, 0x0000000082600000, 0x0000000082600000|100%| O|  |TAMS 0x0000000082600000, 0x0000000082600000| Untracked 
|  14|0x0000000082600000, 0x0000000082700000, 0x0000000082700000|100%| O|  |TAMS 0x0000000082700000, 0x0000000082700000| Untracked 
|  15|0x0000000082700000, 0x0000000082800000, 0x0000000082800000|100%| O|  |TAMS 0x0000000082800000, 0x0000000082800000| Untracked 
|  16|0x0000000082800000, 0x0000000082900000, 0x0000000082900000|100%| O|  |TAMS 0x00000000828d2e00, 0x0000000082900000| Untracked 
|  17|0x0000000082900000, 0x0000000082a00000, 0x0000000082a00000|100%| O|  |TAMS 0x0000000082900000, 0x0000000082a00000| Untracked 
|  18|0x0000000082a00000, 0x0000000082b00000, 0x0000000082b00000|100%| O|  |TAMS 0x0000000082a00000, 0x0000000082b00000| Untracked 
|  19|0x0000000082b00000, 0x0000000082c00000, 0x0000000082c00000|100%| O|  |TAMS 0x0000000082b00000, 0x0000000082c00000| Untracked 
|  20|0x0000000082c00000, 0x0000000082d00000, 0x0000000082d00000|100%| O|  |TAMS 0x0000000082c00000, 0x0000000082d00000| Untracked 
|  21|0x0000000082d00000, 0x0000000082e00000, 0x0000000082e00000|100%| O|  |TAMS 0x0000000082d00000, 0x0000000082d7c600| Untracked 
|  22|0x0000000082e00000, 0x0000000082f00000, 0x0000000082f00000|100%| O|  |TAMS 0x0000000082e00000, 0x0000000082e00000| Untracked 
|  23|0x0000000082f00000, 0x0000000082f29200, 0x0000000083000000| 16%| O|  |TAMS 0x0000000082f00000, 0x0000000082f00000| Untracked 
|  24|0x0000000083000000, 0x0000000083000000, 0x0000000083100000|  0%| F|  |TAMS 0x0000000083000000, 0x0000000083000000| Untracked 
|  25|0x0000000083100000, 0x0000000083100000, 0x0000000083200000|  0%| F|  |TAMS 0x0000000083100000, 0x0000000083100000| Untracked 
|  26|0x0000000083200000, 0x0000000083200000, 0x0000000083300000|  0%| F|  |TAMS 0x0000000083200000, 0x0000000083200000| Untracked 
|  27|0x0000000083300000, 0x0000000083300000, 0x0000000083400000|  0%| F|  |TAMS 0x0000000083300000, 0x0000000083300000| Untracked 
|  28|0x0000000083400000, 0x0000000083400000, 0x0000000083500000|  0%| F|  |TAMS 0x0000000083400000, 0x0000000083400000| Untracked 
|  29|0x0000000083500000, 0x0000000083500000, 0x0000000083600000|  0%| F|  |TAMS 0x0000000083500000, 0x0000000083500000| Untracked 
|  30|0x0000000083600000, 0x0000000083600000, 0x0000000083700000|  0%| F|  |TAMS 0x0000000083600000, 0x0000000083600000| Untracked 
|  31|0x0000000083700000, 0x0000000083700000, 0x0000000083800000|  0%| F|  |TAMS 0x0000000083700000, 0x0000000083700000| Untracked 
|  32|0x0000000083800000, 0x0000000083800000, 0x0000000083900000|  0%| F|  |TAMS 0x0000000083800000, 0x0000000083800000| Untracked 
|  33|0x0000000083900000, 0x0000000083900000, 0x0000000083a00000|  0%| F|  |TAMS 0x0000000083900000, 0x0000000083900000| Untracked 
|  34|0x0000000083a00000, 0x0000000083a00000, 0x0000000083b00000|  0%| F|  |TAMS 0x0000000083a00000, 0x0000000083a00000| Untracked 
|  35|0x0000000083b00000, 0x0000000083b00000, 0x0000000083c00000|  0%| F|  |TAMS 0x0000000083b00000, 0x0000000083b00000| Untracked 
|  36|0x0000000083c00000, 0x0000000083c00000, 0x0000000083d00000|  0%| F|  |TAMS 0x0000000083c00000, 0x0000000083c00000| Untracked 
|  37|0x0000000083d00000, 0x0000000083d00000, 0x0000000083e00000|  0%| F|  |TAMS 0x0000000083d00000, 0x0000000083d00000| Untracked 
|  38|0x0000000083e00000, 0x0000000083e00000, 0x0000000083f00000|  0%| F|  |TAMS 0x0000000083e00000, 0x0000000083e00000| Untracked 
|  39|0x0000000083f00000, 0x0000000083f00000, 0x0000000084000000|  0%| F|  |TAMS 0x0000000083f00000, 0x0000000083f00000| Untracked 
|  40|0x0000000084000000, 0x0000000084000000, 0x0000000084100000|  0%| F|  |TAMS 0x0000000084000000, 0x0000000084000000| Untracked 
|  41|0x0000000084100000, 0x0000000084100000, 0x0000000084200000|  0%| F|  |TAMS 0x0000000084100000, 0x0000000084100000| Untracked 
|  42|0x0000000084200000, 0x0000000084200000, 0x0000000084300000|  0%| F|  |TAMS 0x0000000084200000, 0x0000000084200000| Untracked 
|  43|0x0000000084300000, 0x0000000084300000, 0x0000000084400000|  0%| F|  |TAMS 0x0000000084300000, 0x0000000084300000| Untracked 
|  44|0x0000000084400000, 0x0000000084400000, 0x0000000084500000|  0%| F|  |TAMS 0x0000000084400000, 0x0000000084400000| Untracked 
|  45|0x0000000084500000, 0x0000000084500000, 0x0000000084600000|  0%| F|  |TAMS 0x0000000084500000, 0x0000000084500000| Untracked 
|  46|0x0000000084600000, 0x0000000084600000, 0x0000000084700000|  0%| F|  |TAMS 0x0000000084600000, 0x0000000084600000| Untracked 
|  47|0x0000000084700000, 0x0000000084700000, 0x0000000084800000|  0%| F|  |TAMS 0x0000000084700000, 0x0000000084700000| Untracked 
|  48|0x0000000084800000, 0x0000000084800000, 0x0000000084900000|  0%| F|  |TAMS 0x0000000084800000, 0x0000000084800000| Untracked 
|  49|0x0000000084900000, 0x0000000084900000, 0x0000000084a00000|  0%| F|  |TAMS 0x0000000084900000, 0x0000000084900000| Untracked 
|  50|0x0000000084a00000, 0x0000000084a00000, 0x0000000084b00000|  0%| F|  |TAMS 0x0000000084a00000, 0x0000000084a00000| Untracked 
|  51|0x0000000084b00000, 0x0000000084b00000, 0x0000000084c00000|  0%| F|  |TAMS 0x0000000084b00000, 0x0000000084b00000| Untracked 
|  52|0x0000000084c00000, 0x0000000084c00000, 0x0000000084d00000|  0%| F|  |TAMS 0x0000000084c00000, 0x0000000084c00000| Untracked 
|  53|0x0000000084d00000, 0x0000000084d00000, 0x0000000084e00000|  0%| F|  |TAMS 0x0000000084d00000, 0x0000000084d00000| Untracked 
|  54|0x0000000084e00000, 0x0000000084e00000, 0x0000000084f00000|  0%| F|  |TAMS 0x0000000084e00000, 0x0000000084e00000| Untracked 
|  55|0x0000000084f00000, 0x0000000084f00000, 0x0000000085000000|  0%| F|  |TAMS 0x0000000084f00000, 0x0000000084f00000| Untracked 
|  56|0x0000000085000000, 0x0000000085000000, 0x0000000085100000|  0%| F|  |TAMS 0x0000000085000000, 0x0000000085000000| Untracked 
|  57|0x0000000085100000, 0x0000000085100000, 0x0000000085200000|  0%| F|  |TAMS 0x0000000085100000, 0x0000000085100000| Untracked 
|  58|0x0000000085200000, 0x0000000085200000, 0x0000000085300000|  0%| F|  |TAMS 0x0000000085200000, 0x0000000085200000| Untracked 
|  59|0x0000000085300000, 0x0000000085300000, 0x0000000085400000|  0%| F|  |TAMS 0x0000000085300000, 0x0000000085300000| Untracked 
|  60|0x0000000085400000, 0x0000000085400000, 0x0000000085500000|  0%| F|  |TAMS 0x0000000085400000, 0x0000000085400000| Untracked 
|  61|0x0000000085500000, 0x0000000085500000, 0x0000000085600000|  0%| F|  |TAMS 0x0000000085500000, 0x0000000085500000| Untracked 
|  62|0x0000000085600000, 0x0000000085600000, 0x0000000085700000|  0%| F|  |TAMS 0x0000000085600000, 0x0000000085600000| Untracked 
|  63|0x0000000085700000, 0x0000000085700000, 0x0000000085800000|  0%| F|  |TAMS 0x0000000085700000, 0x0000000085700000| Untracked 
|  64|0x0000000085800000, 0x0000000085800000, 0x0000000085900000|  0%| F|  |TAMS 0x0000000085800000, 0x0000000085800000| Untracked 
|  65|0x0000000085900000, 0x0000000085900000, 0x0000000085a00000|  0%| F|  |TAMS 0x0000000085900000, 0x0000000085900000| Untracked 
|  66|0x0000000085a00000, 0x0000000085a00000, 0x0000000085b00000|  0%| F|  |TAMS 0x0000000085a00000, 0x0000000085a00000| Untracked 
|  67|0x0000000085b00000, 0x0000000085bdfec0, 0x0000000085c00000| 87%| S|CS|TAMS 0x0000000085b00000, 0x0000000085b00000| Complete 
|  68|0x0000000085c00000, 0x0000000085d00000, 0x0000000085d00000|100%| S|CS|TAMS 0x0000000085c00000, 0x0000000085c00000| Complete 
|  69|0x0000000085d00000, 0x0000000085d00000, 0x0000000085e00000|  0%| F|  |TAMS 0x0000000085d00000, 0x0000000085d00000| Untracked 
|  70|0x0000000085e00000, 0x0000000085e00000, 0x0000000085f00000|  0%| F|  |TAMS 0x0000000085e00000, 0x0000000085e00000| Untracked 
|  73|0x0000000086100000, 0x0000000086100000, 0x0000000086200000|  0%| F|  |TAMS 0x0000000086100000, 0x0000000086100000| Untracked 
|  74|0x0000000086200000, 0x0000000086200000, 0x0000000086300000|  0%| F|  |TAMS 0x0000000086200000, 0x0000000086200000| Untracked 
|  75|0x0000000086300000, 0x0000000086300000, 0x0000000086400000|  0%| F|  |TAMS 0x0000000086300000, 0x0000000086300000| Untracked 
|  76|0x0000000086400000, 0x0000000086400000, 0x0000000086500000|  0%| F|  |TAMS 0x0000000086400000, 0x0000000086400000| Untracked 
|  81|0x0000000086900000, 0x0000000086a00000, 0x0000000086a00000|100%| E|  |TAMS 0x0000000086900000, 0x0000000086900000| Complete 
| 127|0x0000000089700000, 0x0000000089800000, 0x0000000089800000|100%| E|CS|TAMS 0x0000000089700000, 0x0000000089700000| Complete 

Card table byte_map: [0x000001bdd5df0000,0x000001bdd61f0000] _byte_map_base: 0x000001bdd59e4000

Marking Bits (Prev, Next): (CMBitMap*) 0x000001bdbe5474e8, (CMBitMap*) 0x000001bdbe5474a8
 Prev Bits: [0x000001bdd8590000, 0x000001bdda530000)
 Next Bits: [0x000001bdd65f0000, 0x000001bdd8590000)

Polling page: 0x000001bdbc4e0000

Metaspace:

Usage:
  Non-class:     46.90 MB capacity,    46.08 MB ( 98%) used,   663.83 KB (  1%) free+waste,   175.19 KB ( <1%) overhead. 
      Class:      7.61 MB capacity,     7.10 MB ( 93%) used,   444.04 KB (  6%) free+waste,    82.88 KB (  1%) overhead. 
       Both:     54.52 MB capacity,    53.18 MB ( 98%) used,     1.08 MB (  2%) free+waste,   258.06 KB ( <1%) overhead. 

Virtual space:
  Non-class space:       62.00 MB reserved,      46.95 MB ( 76%) committed 
      Class space:        1.00 GB reserved,       7.63 MB ( <1%) committed 
             Both:        1.06 GB reserved,      54.57 MB (  5%) committed 

Chunk freelists:
   Non-Class:  48.00 KB
       Class:  11.00 KB
        Both:  59.00 KB

MaxMetaspaceSize: 17179869184.00 GB
CompressedClassSpaceSize: 1.00 GB

CodeHeap 'non-profiled nmethods': size=120064Kb used=3132Kb max_used=3132Kb free=116931Kb
 bounds [0x000001bdce4b0000, 0x000001bdce7c0000, 0x000001bdd59f0000]
CodeHeap 'profiled nmethods': size=120000Kb used=12239Kb max_used=12239Kb free=107760Kb
 bounds [0x000001bdc6f80000, 0x000001bdc7b80000, 0x000001bdce4b0000]
CodeHeap 'non-nmethods': size=5696Kb used=1311Kb max_used=1355Kb free=4384Kb
 bounds [0x000001bdc69f0000, 0x000001bdc6c60000, 0x000001bdc6f80000]
 total_blobs=7998 nmethods=5408 adapters=505
 compilation: enabled
              stopped_count=0, restarted_count=0
 full_count=0

Compilation events (20 events):
Event: 12.200 Thread 0x000001bddcb58000 nmethod 5787 0x000001bdce7be010 code [0x000001bdce7be1a0, 0x000001bdce7be2d8]
Event: 12.200 Thread 0x000001bddcb58000 5788       3       java.lang.Character::isDigit (9 bytes)
Event: 12.201 Thread 0x000001bddcb58000 nmethod 5788 0x000001bdc7b72290 code [0x000001bdc7b72440, 0x000001bdc7b726a0]
Event: 12.201 Thread 0x000001bddcb58000 5789       3       java.lang.CharacterDataLatin1::isDigit (18 bytes)
Event: 12.201 Thread 0x000001bddcb58000 nmethod 5789 0x000001bdc7b72790 code [0x000001bdc7b72940, 0x000001bdc7b72b58]
Event: 12.201 Thread 0x000001bddcb58000 5790       1       antlr.BaseAST::getNextSibling (5 bytes)
Event: 12.201 Thread 0x000001bddcb58000 nmethod 5790 0x000001bdce7be390 code [0x000001bdce7be520, 0x000001bdce7be658]
Event: 12.248 Thread 0x000001bddcb58000 5791       1       antlr.BaseAST::getFirstChild (5 bytes)
Event: 12.248 Thread 0x000001bddcb58000 nmethod 5791 0x000001bdce7be710 code [0x000001bdce7be8a0, 0x000001bdce7be9d8]
Event: 12.260 Thread 0x000001bddcb58000 5792       1       antlr.CommonAST::getType (5 bytes)
Event: 12.260 Thread 0x000001bddcb58000 nmethod 5792 0x000001bdce7bea90 code [0x000001bdce7bec20, 0x000001bdce7bed58]
Event: 12.266 Thread 0x000001bddcb58000 5793       1       org.springframework.data.util.Pair::getSecond (5 bytes)
Event: 12.266 Thread 0x000001bddcb58000 nmethod 5793 0x000001bdce7bee10 code [0x000001bdce7befa0, 0x000001bdce7bf0d8]
Event: 12.267 Thread 0x000001bddcb58000 5794       3       java.util.regex.Matcher::reset (128 bytes)
Event: 12.267 Thread 0x000001bddcb58000 nmethod 5794 0x000001bdc7b72c10 code [0x000001bdc7b72e20, 0x000001bdc7b73650]
Event: 12.267 Thread 0x000001bddcb54000 5795       4       java.util.regex.Pattern$BmpCharProperty::match (55 bytes)
Event: 12.268 Thread 0x000001bddcb58000 5798       3       sun.util.locale.LocaleUtils::isAlphaNumericString (33 bytes)
Event: 12.269 Thread 0x000001bddcb58000 nmethod 5798 0x000001bdc7b73990 code [0x000001bdc7b73be0, 0x000001bdc7b74780]
Event: 12.269 Thread 0x000001bddcb58000 5799       3       java.lang.StringUTF16::charAt (11 bytes)
Event: 12.269 Thread 0x000001bddcb58000 nmethod 5799 0x000001bdc7b74b90 code [0x000001bdc7b74d40, 0x000001bdc7b74f90]

GC Heap History (20 events):
Event: 8.661 GC heap before
{Heap before GC invocations=15 (full 0):
 garbage-first heap   total 45056K, used 35262K [0x0000000081800000, 0x0000000100000000)
  region size 1024K, 21 young (21504K), 3 survivors (3072K)
 Metaspace       used 29649K, capacity 30723K, committed 30976K, reserved 1075200K
  class space    used 3835K, capacity 4274K, committed 4352K, reserved 1048576K
}
Event: 8.666 GC heap after
{Heap after GC invocations=16 (full 0):
 garbage-first heap   total 54272K, used 17797K [0x0000000081800000, 0x0000000100000000)
  region size 1024K, 3 young (3072K), 3 survivors (3072K)
 Metaspace       used 29649K, capacity 30723K, committed 30976K, reserved 1075200K
  class space    used 3835K, capacity 4274K, committed 4352K, reserved 1048576K
}
Event: 9.067 GC heap before
{Heap before GC invocations=16 (full 0):
 garbage-first heap   total 54272K, used 40325K [0x0000000081800000, 0x0000000100000000)
  region size 1024K, 25 young (25600K), 3 survivors (3072K)
 Metaspace       used 32433K, capacity 33546K, committed 33664K, reserved 1079296K
  class space    used 4294K, capacity 4725K, committed 4736K, reserved 1048576K
}
Event: 9.073 GC heap after
{Heap after GC invocations=17 (full 0):
 garbage-first heap   total 54272K, used 18246K [0x0000000081800000, 0x0000000100000000)
  region size 1024K, 2 young (2048K), 2 survivors (2048K)
 Metaspace       used 32433K, capacity 33546K, committed 33664K, reserved 1079296K
  class space    used 4294K, capacity 4725K, committed 4736K, reserved 1048576K
}
Event: 9.532 GC heap before
{Heap before GC invocations=17 (full 0):
 garbage-first heap   total 54272K, used 30534K [0x0000000081800000, 0x0000000100000000)
  region size 1024K, 15 young (15360K), 2 survivors (2048K)
 Metaspace       used 34686K, capacity 35721K, committed 35840K, reserved 1079296K
  class space    used 4706K, capacity 5130K, committed 5248K, reserved 1048576K
}
Event: 9.535 GC heap after
{Heap after GC invocations=18 (full 0):
 garbage-first heap   total 54272K, used 18810K [0x0000000081800000, 0x0000000100000000)
  region size 1024K, 3 young (3072K), 3 survivors (3072K)
 Metaspace       used 34686K, capacity 35721K, committed 35840K, reserved 1079296K
  class space    used 4706K, capacity 5130K, committed 5248K, reserved 1048576K
}
Event: 9.884 GC heap before
{Heap before GC invocations=19 (full 0):
 garbage-first heap   total 54272K, used 38266K [0x0000000081800000, 0x0000000100000000)
  region size 1024K, 23 young (23552K), 3 survivors (3072K)
 Metaspace       used 37989K, capacity 39101K, committed 39244K, reserved 1083392K
  class space    used 5064K, capacity 5489K, committed 5504K, reserved 1048576K
}
Event: 9.891 GC heap after
{Heap after GC invocations=20 (full 0):
 garbage-first heap   total 54272K, used 19864K [0x0000000081800000, 0x0000000100000000)
  region size 1024K, 3 young (3072K), 3 survivors (3072K)
 Metaspace       used 37989K, capacity 39101K, committed 39244K, reserved 1083392K
  class space    used 5064K, capacity 5489K, committed 5504K, reserved 1048576K
}
Event: 10.318 GC heap before
{Heap before GC invocations=21 (full 0):
 garbage-first heap   total 54272K, used 39320K [0x0000000081800000, 0x0000000100000000)
  region size 1024K, 23 young (23552K), 3 survivors (3072K)
 Metaspace       used 41614K, capacity 42649K, committed 42828K, reserved 1085440K
  class space    used 5540K, capacity 5946K, committed 6016K, reserved 1048576K
}
Event: 10.323 GC heap after
{Heap after GC invocations=22 (full 0):
 garbage-first heap   total 65536K, used 20769K [0x0000000081800000, 0x0000000100000000)
  region size 1024K, 3 young (3072K), 3 survivors (3072K)
 Metaspace       used 41614K, capacity 42649K, committed 42828K, reserved 1085440K
  class space    used 5540K, capacity 5946K, committed 6016K, reserved 1048576K
}
Event: 10.736 GC heap before
{Heap before GC invocations=22 (full 0):
 garbage-first heap   total 65536K, used 47393K [0x0000000081800000, 0x0000000100000000)
  region size 1024K, 29 young (29696K), 3 survivors (3072K)
 Metaspace       used 45104K, capacity 46168K, committed 46412K, reserved 1089536K
  class space    used 6010K, capacity 6413K, committed 6528K, reserved 1048576K
}
Event: 10.741 GC heap after
{Heap after GC invocations=23 (full 0):
 garbage-first heap   total 65536K, used 21767K [0x0000000081800000, 0x0000000100000000)
  region size 1024K, 3 young (3072K), 3 survivors (3072K)
 Metaspace       used 45104K, capacity 46168K, committed 46412K, reserved 1089536K
  class space    used 6010K, capacity 6413K, committed 6528K, reserved 1048576K
}
Event: 11.166 GC heap before
{Heap before GC invocations=23 (full 0):
 garbage-first heap   total 65536K, used 49415K [0x0000000081800000, 0x0000000100000000)
  region size 1024K, 30 young (30720K), 3 survivors (3072K)
 Metaspace       used 47123K, capacity 48253K, committed 48460K, reserved 1091584K
  class space    used 6336K, capacity 6780K, committed 6784K, reserved 1048576K
}
Event: 11.171 GC heap after
{Heap after GC invocations=24 (full 0):
 garbage-first heap   total 65536K, used 21965K [0x0000000081800000, 0x0000000100000000)
  region size 1024K, 2 young (2048K), 2 survivors (2048K)
 Metaspace       used 47123K, capacity 48253K, committed 48460K, reserved 1091584K
  class space    used 6336K, capacity 6780K, committed 6784K, reserved 1048576K
}
Event: 11.598 GC heap before
{Heap before GC invocations=24 (full 0):
 garbage-first heap   total 65536K, used 48589K [0x0000000081800000, 0x0000000100000000)
  region size 1024K, 29 young (29696K), 2 survivors (2048K)
 Metaspace       used 49485K, capacity 50628K, committed 50892K, reserved 1093632K
  class space    used 6652K, capacity 7080K, committed 7168K, reserved 1048576K
}
Event: 11.603 GC heap after
{Heap after GC invocations=25 (full 0):
 garbage-first heap   total 65536K, used 23282K [0x0000000081800000, 0x0000000100000000)
  region size 1024K, 4 young (4096K), 4 survivors (4096K)
 Metaspace       used 49485K, capacity 50628K, committed 50892K, reserved 1093632K
  class space    used 6652K, capacity 7080K, committed 7168K, reserved 1048576K
}
Event: 12.103 GC heap before
{Heap before GC invocations=25 (full 0):
 garbage-first heap   total 65536K, used 49906K [0x0000000081800000, 0x0000000100000000)
  region size 1024K, 30 young (30720K), 4 survivors (4096K)
 Metaspace       used 52737K, capacity 54133K, committed 54220K, reserved 1095680K
  class space    used 7073K, capacity 7598K, committed 7680K, reserved 1048576K
}
Event: 12.111 GC heap after
{Heap after GC invocations=26 (full 0):
 garbage-first heap   total 78848K, used 24668K [0x0000000081800000, 0x0000000100000000)
  region size 1024K, 4 young (4096K), 4 survivors (4096K)
 Metaspace       used 52737K, capacity 54133K, committed 54220K, reserved 1095680K
  class space    used 7073K, capacity 7598K, committed 7680K, reserved 1048576K
}
Event: 12.229 GC heap before
{Heap before GC invocations=26 (full 0):
 garbage-first heap   total 78848K, used 31836K [0x0000000081800000, 0x0000000100000000)
  region size 1024K, 12 young (12288K), 4 survivors (4096K)
 Metaspace       used 54173K, capacity 55537K, committed 55628K, reserved 1103872K
  class space    used 7240K, capacity 7765K, committed 7808K, reserved 1048576K
}
Event: 12.238 GC heap after
{Heap after GC invocations=27 (full 0):
 garbage-first heap   total 78848K, used 25088K [0x0000000081800000, 0x0000000100000000)
  region size 1024K, 2 young (2048K), 2 survivors (2048K)
 Metaspace       used 54173K, capacity 55537K, committed 55628K, reserved 1103872K
  class space    used 7240K, capacity 7765K, committed 7808K, reserved 1048576K
}

Deoptimization events (20 events):
Event: 11.806 Thread 0x000001bdbe502800 Uncommon trap: trap_request=0xffffffde fr.pc=0x000001bdce66eef0 relative=0x0000000000000630
Event: 11.806 Thread 0x000001bdbe502800 Uncommon trap: reason=class_check action=maybe_recompile pc=0x000001bdce66eef0 method=org.springframework.util.ConcurrentReferenceHashMap$Segment.findInChain(Lorg/springframework/util/ConcurrentReferenceHashMap$Reference;Ljava/lang/Object;I)Lorg/springfra
Event: 11.806 Thread 0x000001bdbe502800 DEOPT PACKING pc=0x000001bdce66eef0 sp=0x000000b14e1fa1f0
Event: 11.806 Thread 0x000001bdbe502800 DEOPT UNPACKING pc=0x000001bdc6a3912f sp=0x000000b14e1fa198 mode 2
Event: 11.807 Thread 0x000001bdbe502800 Uncommon trap: trap_request=0xffffffde fr.pc=0x000001bdce66eef0 relative=0x0000000000000630
Event: 11.807 Thread 0x000001bdbe502800 Uncommon trap: reason=class_check action=maybe_recompile pc=0x000001bdce66eef0 method=org.springframework.util.ConcurrentReferenceHashMap$Segment.findInChain(Lorg/springframework/util/ConcurrentReferenceHashMap$Reference;Ljava/lang/Object;I)Lorg/springfra
Event: 11.807 Thread 0x000001bdbe502800 DEOPT PACKING pc=0x000001bdce66eef0 sp=0x000000b14e1fa0b0
Event: 11.807 Thread 0x000001bdbe502800 DEOPT UNPACKING pc=0x000001bdc6a3912f sp=0x000000b14e1fa058 mode 2
Event: 12.112 Thread 0x000001bdbe502800 Uncommon trap: trap_request=0xffffff54 fr.pc=0x000001bdce6908a8 relative=0x0000000000000268
Event: 12.112 Thread 0x000001bdbe502800 Uncommon trap: reason=speculate_null_assert action=make_not_entrant pc=0x000001bdce6908a8 method=org.springframework.util.ClassUtils.isAssignable(Ljava/lang/Class;Ljava/lang/Class;)Z @ 66 c2
Event: 12.112 Thread 0x000001bdbe502800 DEOPT PACKING pc=0x000001bdce6908a8 sp=0x000000b14e1fa470
Event: 12.112 Thread 0x000001bdbe502800 DEOPT UNPACKING pc=0x000001bdc6a3912f sp=0x000000b14e1fa418 mode 2
Event: 12.152 Thread 0x000001bdbe502800 Uncommon trap: trap_request=0xffffff45 fr.pc=0x000001bdce54a7f8 relative=0x0000000000000478
Event: 12.152 Thread 0x000001bdbe502800 Uncommon trap: reason=unstable_if action=reinterpret pc=0x000001bdce54a7f8 method=java.util.regex.Matcher.match(II)Z @ 30 c2
Event: 12.152 Thread 0x000001bdbe502800 DEOPT PACKING pc=0x000001bdce54a7f8 sp=0x000000b14e1fa150
Event: 12.152 Thread 0x000001bdbe502800 DEOPT UNPACKING pc=0x000001bdc6a3912f sp=0x000000b14e1fa108 mode 2
Event: 12.200 Thread 0x000001bdbe502800 Uncommon trap: trap_request=0xffffff45 fr.pc=0x000001bdce54b4ec relative=0x000000000000022c
Event: 12.200 Thread 0x000001bdbe502800 Uncommon trap: reason=unstable_if action=reinterpret pc=0x000001bdce54b4ec method=java.util.regex.Matcher.reset()Ljava/util/regex/Matcher; @ 71 c2
Event: 12.200 Thread 0x000001bdbe502800 DEOPT PACKING pc=0x000001bdce54b4ec sp=0x000000b14e1f9030
Event: 12.200 Thread 0x000001bdbe502800 DEOPT UNPACKING pc=0x000001bdc6a3912f sp=0x000000b14e1f8fb8 mode 2

Classes unloaded (0 events):
No events

Classes redefined (0 events):
No events

Internal exceptions (20 events):
Event: 11.846 Thread 0x000001bdbe502800 Exception <a 'java/lang/ClassNotFoundException'{0x0000000084b16d78}: java/lang/ObjectCustomizer> (0x0000000084b16d78) 
thrown [t:/workspace/open/src/hotspot/share/classfile/systemDictionary.cpp, line 232]
Event: 11.847 Thread 0x000001bdbe502800 Exception <a 'java/lang/ClassNotFoundException'{0x0000000084b321a0}: com/fr/adaming/entity/AbstractEntityCustomizer> (0x0000000084b321a0) 
thrown [t:/workspace/open/src/hotspot/share/classfile/systemDictionary.cpp, line 232]
Event: 11.848 Thread 0x000001bdbe502800 Exception <a 'java/lang/ClassNotFoundException'{0x0000000084b4ad40}: com/fr/adaming/entity/CustomerCustomizer> (0x0000000084b4ad40) 
thrown [t:/workspace/open/src/hotspot/share/classfile/systemDictionary.cpp, line 232]
Event: 11.870 Thread 0x000001bdbe502800 Exception <a 'java/lang/ClassNotFoundException'{0x0000000084bc2b48}: java/lang/ObjectCustomizer> (0x0000000084bc2b48) 
thrown [t:/workspace/open/src/hotspot/share/classfile/systemDictionary.cpp, line 232]
Event: 11.872 Thread 0x000001bdbe502800 Exception <a 'java/lang/ClassNotFoundException'{0x0000000084bddf70}: com/fr/adaming/entity/AbstractEntityCustomizer> (0x0000000084bddf70) 
thrown [t:/workspace/open/src/hotspot/share/classfile/systemDictionary.cpp, line 232]
Event: 11.874 Thread 0x000001bdbe502800 Exception <a 'java/lang/ClassNotFoundException'{0x0000000084bf7a40}: com/fr/adaming/entity/SubscriptionCustomizer> (0x0000000084bf7a40) 
thrown [t:/workspace/open/src/hotspot/share/classfile/systemDictionary.cpp, line 232]
Event: 11.891 Thread 0x000001bdbe502800 Exception <a 'java/lang/ClassNotFoundException'{0x0000000084a7c3e0}: java/lang/ObjectCustomizer> (0x0000000084a7c3e0) 
thrown [t:/workspace/open/src/hotspot/share/classfile/systemDictionary.cpp, line 232]
Event: 11.892 Thread 0x000001bdbe502800 Exception <a 'java/lang/ClassNotFoundException'{0x0000000084a97a68}: com/fr/adaming/entity/AbstractEntityCustomizer> (0x0000000084a97a68) 
thrown [t:/workspace/open/src/hotspot/share/classfile/systemDictionary.cpp, line 232]
Event: 11.894 Thread 0x000001bdbe502800 Exception <a 'java/lang/ClassNotFoundException'{0x0000000084ab0518}: com/fr/adaming/entity/LockerCustomizer> (0x0000000084ab0518) 
thrown [t:/workspace/open/src/hotspot/share/classfile/systemDictionary.cpp, line 232]
Event: 11.900 Thread 0x000001bdbe502800 Exception <a 'java/lang/ClassNotFoundException'{0x0000000084afeb78}: java/lang/ObjectCustomizer> (0x0000000084afeb78) 
thrown [t:/workspace/open/src/hotspot/share/classfile/systemDictionary.cpp, line 232]
Event: 11.901 Thread 0x000001bdbe502800 Exception <a 'java/lang/ClassNotFoundException'{0x000000008491a4b0}: com/fr/adaming/entity/AbstractEntityCustomizer> (0x000000008491a4b0) 
thrown [t:/workspace/open/src/hotspot/share/classfile/systemDictionary.cpp, line 232]
Event: 11.903 Thread 0x000001bdbe502800 Exception <a 'java/lang/ClassNotFoundException'{0x00000000849328f0}: com/fr/adaming/entity/SlotCustomizer> (0x00000000849328f0) 
thrown [t:/workspace/open/src/hotspot/share/classfile/systemDictionary.cpp, line 232]
Event: 11.913 Thread 0x000001bdbe502800 Exception <a 'java/lang/ClassNotFoundException'{0x000000008497eaa0}: java/lang/ObjectCustomizer> (0x000000008497eaa0) 
thrown [t:/workspace/open/src/hotspot/share/classfile/systemDictionary.cpp, line 232]
Event: 11.915 Thread 0x000001bdbe502800 Exception <a 'java/lang/ClassNotFoundException'{0x00000000849986b8}: com/fr/adaming/entity/AdminCustomizer> (0x00000000849986b8) 
thrown [t:/workspace/open/src/hotspot/share/classfile/systemDictionary.cpp, line 232]
Event: 11.935 Thread 0x000001bdbe502800 Exception <a 'java/lang/IncompatibleClassChangeError'{0x00000000848939e8}: Found class java.lang.Object, but interface was expected> (0x00000000848939e8) 
thrown [t:/workspace/open/src/hotspot/share/interpreter/linkResolver.cpp, line 833]
Event: 12.040 Thread 0x000001bdbe502800 Exception <a 'java/lang/reflect/InvocationTargetException'{0x000000008403c2e8}> (0x000000008403c2e8) 
thrown [t:/workspace/open/src/hotspot/share/runtime/reflection.cpp, line 1188]
Event: 12.054 Thread 0x000001bdbe502800 Exception <a 'java/lang/NoSuchMethodError'{0x00000000840b61e0}: 'int java.lang.invoke.DirectMethodHandle$Holder.invokeStatic(java.lang.Object, java.lang.Object, int)'> (0x00000000840b61e0) 
thrown [t:/workspace/open/src/hotspot/share/interpreter/linkResolver.cpp, line 767]
Event: 12.058 Thread 0x000001bdbe502800 Exception <a 'java/lang/NoSuchMethodError'{0x00000000840d7e30}: 'java.lang.Object java.lang.invoke.Invokers$Holder.linkToTargetMethod(java.lang.Object, int, java.lang.Object)'> (0x00000000840d7e30) 
thrown [t:/workspace/open/src/hotspot/share/interpreter/linkResolver.cpp, line 767]
Event: 12.064 Thread 0x000001bdbe502800 Exception <a 'java/lang/IncompatibleClassChangeError'{0x0000000083f0ca00}: Found class java.lang.Object, but interface was expected> (0x0000000083f0ca00) 
thrown [t:/workspace/open/src/hotspot/share/interpreter/linkResolver.cpp, line 833]
Event: 12.267 Thread 0x000001bdbe502800 Exception <a 'java/lang/reflect/InvocationTargetException'{0x0000000086993578}> (0x0000000086993578) 
thrown [t:/workspace/open/src/hotspot/share/runtime/reflection.cpp, line 1188]

Events (20 events):
Event: 12.262 loading class org/hibernate/query/QueryParameter
Event: 12.262 loading class org/hibernate/query/QueryParameter done
Event: 12.263 loading class org/hibernate/engine/spi/RowSelection
Event: 12.263 loading class org/hibernate/engine/spi/RowSelection done
Event: 12.263 loading class org/hibernate/query/internal/QueryParameterBindingsImpl
Event: 12.263 loading class org/hibernate/query/internal/QueryParameterBindingsImpl done
Event: 12.264 loading class org/hibernate/query/spi/QueryParameterBinding
Event: 12.264 loading class org/hibernate/query/spi/QueryParameterBinding done
Event: 12.264 loading class org/hibernate/query/spi/QueryParameterListBinding
Event: 12.264 loading class org/hibernate/query/spi/QueryParameterListBinding done
Event: 12.264 loading class org/hibernate/internal/CoreMessageLogger_$logger_fr_FR
Event: 12.264 loading class org/hibernate/internal/CoreMessageLogger_$logger_fr_FR done
Event: 12.265 loading class org/hibernate/internal/CoreMessageLogger_$logger_fr
Event: 12.265 loading class org/hibernate/internal/CoreMessageLogger_$logger_fr done
Event: 12.265 loading class org/hibernate/jpa/internal/util/ConfigurationHelper
Event: 12.265 loading class org/hibernate/jpa/internal/util/ConfigurationHelper done
Event: 12.266 Thread 0x000001bdde09d800 Thread exited: 0x000001bdde09d800
Event: 12.268 loading class org/springframework/data/repository/core/support/RepositoryFragment$ImplementedRepositoryFragment
Event: 12.268 loading class org/springframework/data/repository/core/support/RepositoryFragment$ImplementedRepositoryFragment done
Event: 12.269 Executing VM operation: CollectForMetadataAllocation


Dynamic libraries:
0x00007ff6ae2c0000 - 0x00007ff6ae2cf000 	C:\Program Files\Java\jdk-13\bin\javaw.exe
0x00007ffc4efc0000 - 0x00007ffc4f1ad000 	C:\Windows\SYSTEM32\ntdll.dll
0x00007ffc4ee20000 - 0x00007ffc4eed3000 	C:\Windows\System32\KERNEL32.DLL
0x00007ffc4b540000 - 0x00007ffc4b7d3000 	C:\Windows\System32\KERNELBASE.dll
0x00007ffc4b330000 - 0x00007ffc4b42a000 	C:\Windows\System32\ucrtbase.dll
0x00007ffc3dcc0000 - 0x00007ffc3dcd8000 	C:\Program Files\Java\jdk-13\bin\jli.dll
0x00007ffc4ec60000 - 0x00007ffc4ed03000 	C:\Windows\System32\ADVAPI32.dll
0x00007ffc4eee0000 - 0x00007ffc4ef7e000 	C:\Windows\System32\msvcrt.dll
0x00007ffc4ed10000 - 0x00007ffc4edae000 	C:\Windows\System32\sechost.dll
0x00007ffc4c8d0000 - 0x00007ffc4c9f2000 	C:\Windows\System32\RPCRT4.dll
0x00007ffc4d120000 - 0x00007ffc4d2b7000 	C:\Windows\System32\USER32.dll
0x00007ffc4b7e0000 - 0x00007ffc4b800000 	C:\Windows\System32\win32u.dll
0x00007ffc4d4d0000 - 0x00007ffc4d4f9000 	C:\Windows\System32\GDI32.dll
0x00007ffc4b080000 - 0x00007ffc4b219000 	C:\Windows\System32\gdi32full.dll
0x00007ffc4b4a0000 - 0x00007ffc4b540000 	C:\Windows\System32\msvcp_win.dll
0x00007ffc34d70000 - 0x00007ffc34fe9000 	C:\Windows\WinSxS\amd64_microsoft.windows.common-controls_6595b64144ccf1df_6.0.17763.802_none_05b1445c0722d2cc\COMCTL32.dll
0x00007ffc4cab0000 - 0x00007ffc4cddc000 	C:\Windows\System32\combase.dll
0x00007ffc4bf80000 - 0x00007ffc4bffe000 	C:\Windows\System32\bcryptPrimitives.dll
0x00007ffc3c830000 - 0x00007ffc3c83a000 	C:\Windows\SYSTEM32\VERSION.dll
0x00007ffc3b870000 - 0x00007ffc3b885000 	C:\Program Files\Java\jdk-13\bin\VCRUNTIME140.dll
0x00007ffc4ec30000 - 0x00007ffc4ec5e000 	C:\Windows\System32\IMM32.DLL
0x00007ffc27c90000 - 0x00007ffc27d2b000 	C:\Program Files\Java\jdk-13\bin\msvcp140.dll
0x00007ffc18df0000 - 0x00007ffc19956000 	C:\Program Files\Java\jdk-13\bin\server\jvm.dll
0x00007ffc4ef80000 - 0x00007ffc4ef88000 	C:\Windows\System32\PSAPI.DLL
0x00007ffc457e0000 - 0x00007ffc45804000 	C:\Windows\SYSTEM32\WINMM.dll
0x00007ffc46340000 - 0x00007ffc46349000 	C:\Windows\SYSTEM32\WSOCK32.dll
0x00007ffc4edb0000 - 0x00007ffc4ee1d000 	C:\Windows\System32\WS2_32.dll
0x00007ffc45690000 - 0x00007ffc456bd000 	C:\Windows\SYSTEM32\WINMMBASE.dll
0x00007ffc4b450000 - 0x00007ffc4b49a000 	C:\Windows\System32\cfgmgr32.dll
0x00007ffc4afb0000 - 0x00007ffc4afc1000 	C:\Windows\System32\kernel.appcore.dll
0x00007ffc46330000 - 0x00007ffc46340000 	C:\Program Files\Java\jdk-13\bin\verify.dll
0x00007ffc468a0000 - 0x00007ffc46a8d000 	C:\Windows\SYSTEM32\DBGHELP.DLL
0x00007ffc3cbf0000 - 0x00007ffc3cc1a000 	C:\Windows\SYSTEM32\dbgcore.DLL
0x00007ffc3dce0000 - 0x00007ffc3dd06000 	C:\Program Files\Java\jdk-13\bin\java.dll
0x00007ffc3dca0000 - 0x00007ffc3dcb7000 	C:\Program Files\Java\jdk-13\bin\zip.dll
0x00007ffc44040000 - 0x00007ffc4404a000 	C:\Program Files\Java\jdk-13\bin\jimage.dll
0x00007ffc4d6b0000 - 0x00007ffc4eba4000 	C:\Windows\System32\SHELL32.dll
0x00007ffc4c750000 - 0x00007ffc4c7f8000 	C:\Windows\System32\shcore.dll
0x00007ffc4b800000 - 0x00007ffc4bf4d000 	C:\Windows\System32\windows.storage.dll
0x00007ffc4b050000 - 0x00007ffc4b074000 	C:\Windows\System32\profapi.dll
0x00007ffc4aff0000 - 0x00007ffc4b04d000 	C:\Windows\System32\powrprof.dll
0x00007ffc4c6e0000 - 0x00007ffc4c732000 	C:\Windows\System32\shlwapi.dll
0x00007ffc4b430000 - 0x00007ffc4b447000 	C:\Windows\System32\cryptsp.dll
0x00007ffc3dc80000 - 0x00007ffc3dc99000 	C:\Program Files\Java\jdk-13\bin\net.dll
0x00007ffc3a430000 - 0x00007ffc3a522000 	C:\Windows\SYSTEM32\WINHTTP.dll
0x00007ffc39f90000 - 0x00007ffc3a167000 	C:\Windows\SYSTEM32\urlmon.dll
0x00007ffc37700000 - 0x00007ffc379a8000 	C:\Windows\SYSTEM32\iertutil.dll
0x00007ffc4a9f0000 - 0x00007ffc4a9fc000 	C:\Windows\SYSTEM32\CRYPTBASE.DLL
0x00007ffc4a820000 - 0x00007ffc4a887000 	C:\Windows\system32\mswsock.dll
0x00007ffc3dc60000 - 0x00007ffc3dc73000 	C:\Program Files\Java\jdk-13\bin\nio.dll
0x00007ffc4a540000 - 0x00007ffc4a57d000 	C:\Windows\SYSTEM32\IPHLPAPI.DLL
0x00007ffc4c740000 - 0x00007ffc4c748000 	C:\Windows\System32\NSI.dll
0x00007ffc3cae0000 - 0x00007ffc3caf6000 	C:\Windows\SYSTEM32\dhcpcsvc6.DLL
0x00007ffc3d000000 - 0x00007ffc3d01c000 	C:\Windows\SYSTEM32\dhcpcsvc.DLL
0x00007ffc4a580000 - 0x00007ffc4a646000 	C:\Windows\SYSTEM32\DNSAPI.dll
0x00007ffc3eba0000 - 0x00007ffc3eba9000 	C:\Program Files\Java\jdk-13\bin\management.dll
0x00007ffc3c260000 - 0x00007ffc3c26b000 	C:\Program Files\Java\jdk-13\bin\management_ext.dll
0x00007ffc30260000 - 0x00007ffc30276000 	C:\Windows\system32\napinsp.dll
0x00007ffc30240000 - 0x00007ffc3025a000 	C:\Windows\system32\pnrpnsp.dll
0x00007ffc30230000 - 0x00007ffc3023e000 	C:\Windows\System32\winrnr.dll
0x00007ffc3e9f0000 - 0x00007ffc3ea0b000 	C:\Windows\system32\NLAapi.dll
0x00007ffc30210000 - 0x00007ffc30225000 	C:\Windows\system32\wshbth.dll
0x00007ffc39f80000 - 0x00007ffc39f8a000 	C:\Windows\System32\rasadhlp.dll
0x00007ffc3a340000 - 0x00007ffc3a3b9000 	C:\Windows\System32\fwpuclnt.dll
0x00007ffc4bf50000 - 0x00007ffc4bf76000 	C:\Windows\System32\bcrypt.dll
0x00007ffc4a3a0000 - 0x00007ffc4a3d3000 	C:\Windows\system32\rsaenh.dll
0x00007ffc4aeb0000 - 0x00007ffc4aed8000 	C:\Windows\SYSTEM32\USERENV.dll

dbghelp: loaded successfully - version: 4.0.5 - missing functions: none
symbol engine: initialized successfully - sym options: 0x614 - pdb path: .;C:\Program Files\Java\jdk-13\bin;C:\Windows\SYSTEM32;C:\Windows\WinSxS\amd64_microsoft.windows.common-controls_6595b64144ccf1df_6.0.17763.802_none_05b1445c0722d2cc;C:\Program Files\Java\jdk-13\bin\server

VM Arguments:
jvm_args: -ea -Dfile.encoding=UTF-8 
java_command: org.eclipse.jdt.internal.junit.runner.RemoteTestRunner -version 3 -port 55682 -testLoaderClass org.eclipse.jdt.internal.junit5.runner.JUnit5TestLoader -loaderpluginname org.eclipse.jdt.junit5.runtime -test com.fr.adaming.controller.impl.ReviewControllerImplTest:saveValidReviewExample_shouldReturnEntityWithNotNullId
java_class_path (initial): C:\Users\IN-LY-011\Desktop\Projet Final OuiShare\ouishare\OuiShare_WebService\target\test-classes;C:\Users\IN-LY-011\Desktop\Projet Final OuiShare\ouishare\OuiShare_WebService\target\classes;C:\Users\IN-LY-011\Desktop\Projet Final OuiShare\ouishare\OuiShare_Service\target\classes;C:\Users\IN-LY-011\Desktop\Projet Final OuiShare\ouishare\OuiShare_Persistence\target\classes;C:\Users\IN-LY-011\.m2\repository\mysql\mysql-connector-java\8.0.18\mysql-connector-java-8.0.18.jar;C:\Users\IN-LY-011\.m2\repository\org\springframework\boot\spring-boot-starter-data-jpa\2.2.1.RELEASE\spring-boot-starter-data-jpa-2.2.1.RELEASE.jar;C:\Users\IN-LY-011\.m2\repository\org\springframework\boot\spring-boot-starter-aop\2.2.1.RELEASE\spring-boot-starter-aop-2.2.1.RELEASE.jar;C:\Users\IN-LY-011\.m2\repository\org\aspectj\aspectjweaver\1.9.4\aspectjweaver-1.9.4.jar;C:\Users\IN-LY-011\.m2\repository\org\springframework\boot\spring-boot-starter-jdbc\2.2.1.RELEASE\spring-boot-starter-jdbc-2.2.1.RELEASE.jar;C:\Users\IN-LY-011\.m2\repository\com\zaxxer\HikariCP\3.4.1\HikariCP-3.4.1.jar;C:\Users\IN-LY-011\.m2\repository\org\springframework\spring-jdbc\5.2.1.RELEASE\spring-jdbc-5.2.1.RELEASE.jar;C:\Users\IN-LY-011\.m2\repository\jakarta\persistence\jakarta.persistence-api\2.2.3\jakarta.persistence-api-2.2.3.jar;C:\Users\IN-LY-011\.m2\repository\jakarta\transaction\jakarta.transaction-api\1.3.3\jakarta.transaction-api-1.3.3.jar;C:\Users\IN-LY-011\.m2\repository\org\hibernate\hibernate-core\5.4.8.Final\hibernate-core-5.4.8.Final.jar;C:\Users\IN-LY-011\.m2\repository\org\javassist\javassist\3.24.0-GA\javassist-3.24.0-GA.jar;C:\Users\IN-LY-011\.m2\repository\antlr\antlr\2.7.7\antlr-2.7.7.jar;C:\Users\IN-LY-011\.m2\repository\org\jboss\jandex\2.0.5.Final\jandex-2.0.5.Final.jar;C:\Users\IN-LY-011\.m2\repository\org\dom4j\dom4j\2.1.1\dom4j-2.1.1.jar;C:\Users\IN-LY-011\.m2\repository\org\hibernate\common\hibernate-commons-annotations\5.1.0.Final\hibernate-commons-annotations-5
Launcher Type: SUN_STANDARD

[Global flags]
     intx CICompilerCount                          = 3                                         {product} {ergonomic}
     uint ConcGCThreads                            = 1                                         {product} {ergonomic}
     uint G1ConcRefinementThreads                  = 4                                         {product} {ergonomic}
   size_t G1HeapRegionSize                         = 1048576                                   {product} {ergonomic}
    uintx GCDrainStackTargetSize                   = 64                                        {product} {ergonomic}
   size_t InitialHeapSize                          = 134217728                                 {product} {ergonomic}
   size_t MarkStackSize                            = 4194304                                   {product} {ergonomic}
   size_t MaxHeapSize                              = 2122317824                                {product} {ergonomic}
   size_t MaxNewSize                               = 1272971264                                {product} {ergonomic}
   size_t MinHeapDeltaBytes                        = 1048576                                   {product} {ergonomic}
   size_t MinHeapSize                              = 8388608                                   {product} {ergonomic}
    uintx NonNMethodCodeHeapSize                   = 5830732                                {pd product} {ergonomic}
    uintx NonProfiledCodeHeapSize                  = 122913754                              {pd product} {ergonomic}
    uintx ProfiledCodeHeapSize                     = 122913754                              {pd product} {ergonomic}
    uintx ReservedCodeCacheSize                    = 251658240                              {pd product} {ergonomic}
     bool SegmentedCodeCache                       = true                                      {product} {ergonomic}
   size_t SoftMaxHeapSize                          = 2122317824                             {manageable} {ergonomic}
     bool UseCompressedClassPointers               = true                                 {lp64_product} {ergonomic}
     bool UseCompressedOops                        = true                                 {lp64_product} {ergonomic}
     bool UseG1GC                                  = true                                      {product} {ergonomic}
     bool UseLargePagesIndividualAllocation        = false                                  {pd product} {ergonomic}

Logging:
Log output configuration:
 #0: stdout all=warning uptime,level,tags
 #1: stderr all=off uptime,level,tags

Environment Variables:
JAVA_HOME=C:\Program Files\Java\jdk-13
PATH=C:/Program Files/Java/jdk-13/bin/server;C:/Program Files/Java/jdk-13/bin;C:\Windows\system32;C:\Windows;C:\Windows\System32\Wbem;C:\Windows\System32\WindowsPowerShell\v1.0\;C:\Windows\System32\OpenSSH\;C:\Program Files\Java\jdk-13\bin;C:\Users\IN-LY-011\Desktop\apache-maven-3.6.2-bin\apache-maven-3.6.2\bin;C:\Program Files\Git\cmd;C:\Users\IN-LY-011\AppData\Local\Microsoft\WindowsApps;;C:\Users\IN-LY-011\Desktop\sts-4.4.1.RELEASE;
USERNAME=IN-LY-011
OS=Windows_NT
PROCESSOR_IDENTIFIER=Intel64 Family 6 Model 78 Stepping 3, GenuineIntel



---------------  S Y S T E M  ---------------

OS: Windows 10 , 64 bit Build 17763 (10.0.17763.475)

CPU:total 4 (initial active 4) (2 cores per cpu, 2 threads per core) family 6 model 78 stepping 3, cmov, cx8, fxsr, mmx, sse, sse2, sse3, ssse3, sse4.1, sse4.2, popcnt, avx, avx2, aes, clmul, erms, 3dnowpref, lzcnt, ht, tsc, tscinvbit, bmi1, bmi2, adx, fma

Memory: 4k page, system-wide physical 8088M (1335M free)
TotalPageFile size 10136M (AvailPageFile size 4M)
current process WorkingSet (physical memory assigned to process): 247M, peak: 248M
current process commit charge ("private bytes"): 291M, peak: 292M

vm_info: Java HotSpot(TM) 64-Bit Server VM (13+33) for windows-amd64 JRE (13+33), built on Sep 18 2019 21:38:00 by "mach5one" with unknown MS VC++:1916

END.
