{
  "project_info": {
    "project_number": "935448231064",
    "firebase_url": "https://stockme-c3e5e.firebaseio.com",
    "project_id": "stockme-c3e5e",
    "storage_bucket": "stockme-c3e5e.appspot.com"
  },
  "client": [
    {
      "client_info": {
        "mobilesdk_app_id": "1:935448231064:android:0a484b8cb868316f65e4ed",
        "android_client_info": {
          "package_name": "com.app.login"
        }
      },
      "oauth_client": [
        {
          "client_id": "935448231064-7cen0uku6trpibnpdl72ev600ms8gvo3.apps.googleusercontent.com",
          "client_type": 1,
          "android_info": {
            "package_name": "com.app.login",
            "certificate_hash": "5587cec472ec02a2af937b15a712a513767deb39"
          }
        },
        {
          "client_id": "935448231064-kobtt3fhcqbpdccn6m5a704l46oqmqvr.apps.googleusercontent.com",
          "client_type": 3
        }
      ],
      "api_key": [
        {
          "current_key": "AIzaSyCtsxWLbXYDzunGKdmiK5wFusXheqAN484"
        }
      ],
      "services": {
        "appinvite_service": {
          "other_platform_oauth_client": [
            {
              "client_id": "935448231064-kobtt3fhcqbpdccn6m5a704l46oqmqvr.apps.googleusercontent.com",
              "client_type": 3
            }
          ]
        }
      }
    }
  ],
  "configuration_version": "1"
}