# Note: The below output is actually incorrect. Will be correct once YDBOcto#235 is fixed

-- TCT000 : coerce string to INTEGER

select "hello"::integer from names limit 1;
select * from names where "hello"::integer = names.id
hello

