# Note: The below output is actually incorrect. Will be correct once YDBOcto#235 is fixed

-- TCT003: coerce string to NUMERIC

select "hello"::numeric from names limit 1;
select * from names where "hello"::numeric = names.id

hello

