OCTO> select pastas.id, firstName, lastName, pastaName from names4
OCTO> inner join pastas on pastas.pastaName = names4.favoritePasta
OCTO> order by lastName asc;
Added SET and/or Non-SET trigger on ^pastas named %ydboctoT*
9|Joey||Pappardelle
1|Acid|Burn|Cavatelli
1|Bobby|Buttons|Cavatelli
1|Betty|Buttons|Cavatelli
9|Zero|Cool|Pappardelle
5|Zero|Day|Rotini
7|Acid|House|Orechiette
6|Cereal|Killer|Penne
8|Zero|Lame|Lasagna
5|Lord|Nikon|Rotini
OCTO> 
