 SELECT   nspname AS table_schem,
         NULL    AS table_catalog
FROM     pg_catalog.pg_namespace
WHERE    nspname <> 'pg_toast'
AND      (
                  nspname !~ '^pg_temp_'
         OR       nspname = (pg_catalog.Current_schemas(true))[1])
AND      (
                  nspname !~ '^pg_toast_temp_'
         OR       nspname = replace((pg_catalog.current_schemas(true))[1], 'pg_temp_', 'pg_toast_temp_'))
ORDER BY table_schem
[ WARN] PATH:LINENUM DATE TIME : Feature not implemented: arrays
[ WARN] PATH:LINENUM DATE TIME : Feature not implemented: arrays

information_schema|
pg_catalog|
public|
