<?xml version="1.0" encoding="UTF-8" standalone="no"?>
<!-- Created with Inkscape (http://www.inkscape.org/) -->

<svg
   width="84.635971mm"
   height="8.8809996mm"
   viewBox="0 0 84.635971 8.8809996"
   version="1.1"
   id="svg1683"
   inkscape:version="1.1.1 (c3084ef, 2021-09-22)"
   sodipodi:docname="arnhem-nijmegen-breed.svg"
   xmlns:inkscape="http://www.inkscape.org/namespaces/inkscape"
   xmlns:sodipodi="http://sodipodi.sourceforge.net/DTD/sodipodi-0.dtd"
   xmlns="http://www.w3.org/2000/svg"
   xmlns:svg="http://www.w3.org/2000/svg">
  <sodipodi:namedview
     id="namedview1685"
     pagecolor="#ffffff"
     bordercolor="#666666"
     borderopacity="1.0"
     inkscape:pageshadow="2"
     inkscape:pageopacity="0.0"
     inkscape:pagecheckerboard="0"
     inkscape:document-units="mm"
     showgrid="false"
     fit-margin-top="0"
     fit-margin-left="0"
     fit-margin-right="0"
     fit-margin-bottom="0"
     inkscape:zoom="1.7041198"
     inkscape:cx="157.26594"
     inkscape:cy="15.257143"
     inkscape:window-width="931"
     inkscape:window-height="560"
     inkscape:window-x="989"
     inkscape:window-y="612"
     inkscape:window-maximized="0"
     inkscape:current-layer="layer1" />
  <defs
     id="defs1680" />
  <g
     inkscape:label="Layer 1"
     inkscape:groupmode="layer"
     id="layer1"
     transform="translate(-62.602737,-149.223)">
    <path
       d="m 62.602737,158.104 h 84.635973 v -8.881 H 62.602737 Z"
       style="fill:#ffff00;fill-opacity:1;fill-rule:nonzero;stroke:none;stroke-width:0.352782"
       id="path129" />
    <g
       aria-label="ARNHEM-NIJMEGEN"
       id="text177"
       style="font-weight:800;font-size:5.66873px;letter-spacing:0px;stroke-width:0.352782">
      <path
         d="m 75.686612,155.28106 0.985384,-3.42394 q 0.09411,-0.32108 0.426262,-0.32108 h 0.786094 q 0.332152,0 0.426261,0.32108 l 0.985385,3.42394 q 0.04982,0.17714 -0.02491,0.25188 -0.07473,0.072 -0.218667,0.072 h -0.536979 q -0.146701,0 -0.229739,-0.0747 -0.08027,-0.0747 -0.127325,-0.25465 l -0.135629,-0.55359 H 76.92111 l -0.130093,0.55359 q -0.04152,0.17992 -0.124557,0.25465 -0.08304,0.0747 -0.232506,0.0747 H 75.93019 q -0.143933,0 -0.218667,-0.072 -0.07473,-0.0747 -0.02491,-0.25188 z m 1.444861,-1.45594 h 0.675376 l -0.329384,-1.38396 h -0.01107 z"
         id="path11100" />
      <path
         d="m 79.58073,155.26998 v -3.40179 q 0,-0.16884 0.09134,-0.24911 0.09411,-0.083 0.243578,-0.083 h 1.228963 q 1.660761,0 1.660761,1.22896 0,0.36537 -0.163309,0.63386 -0.163308,0.26572 -0.453941,0.42073 l 0.66984,1.47807 q 0.05813,0.11626 0.03322,0.18546 -0.02491,0.0692 -0.08304,0.0969 -0.05536,0.0249 -0.143933,0.0249 h -0.600642 q -0.152236,0 -0.24081,-0.0664 -0.08857,-0.0692 -0.16054,-0.24634 L 81.20274,154.1379 h -0.517604 v 1.13208 q 0,0.16885 -0.09411,0.25189 -0.09134,0.083 -0.238042,0.083 H 79.91565 q -0.146701,0 -0.24081,-0.083 -0.09411,-0.083 -0.09411,-0.25189 z m 1.104406,-1.99568 h 0.442869 q 0.561891,0 0.561891,-0.42349 0,-0.41519 -0.5093,-0.41519 h -0.49546 z"
         id="path11102" />
      <path
         d="m 83.225719,155.26998 v -3.40179 q 0,-0.16884 0.09134,-0.24911 0.09411,-0.083 0.243578,-0.083 h 0.622785 q 0.274026,0 0.437334,0.2934 l 1.054583,1.93756 h 0.01107 v -1.89881 q 0,-0.20206 0.08581,-0.26572 0.08581,-0.0664 0.249114,-0.0664 h 0.357063 q 0.160541,0 0.246346,0.0664 0.08581,0.0637 0.08581,0.26572 v 3.40179 q 0,0.20206 -0.08581,0.26849 -0.0858,0.0664 -0.246346,0.0664 h -0.48162 q -0.287865,0 -0.44287,-0.2934 l -1.190212,-2.08702 h -0.01107 v 2.0455 q 0,0.20206 -0.08857,0.26849 -0.08581,0.0664 -0.246346,0.0664 h -0.357064 q -0.16054,0 -0.249114,-0.0664 -0.08581,-0.0664 -0.08581,-0.26849 z"
         id="path11104" />
      <path
         d="m 87.244853,155.26998 v -3.40179 q 0,-0.20206 0.08581,-0.26572 0.08581,-0.0664 0.249115,-0.0664 h 0.442869 q 0.16054,0 0.246346,0.0664 0.08581,0.0637 0.08581,0.26572 v 1.16807 h 1.231731 v -1.16807 q 0,-0.20206 0.08581,-0.26572 0.08581,-0.0664 0.249114,-0.0664 h 0.434566 q 0.163308,0 0.249114,0.0664 0.08581,0.0637 0.08581,0.26572 v 3.40179 q 0,0.20206 -0.08857,0.26849 -0.08581,0.0664 -0.246346,0.0664 h -0.434566 q -0.16054,0 -0.249114,-0.0664 -0.08581,-0.0664 -0.08581,-0.26849 v -1.26494 h -1.231731 v 1.26494 q 0,0.20206 -0.08581,0.26849 -0.08581,0.0664 -0.246346,0.0664 h -0.442869 q -0.160541,0 -0.249115,-0.0664 -0.08581,-0.0664 -0.08581,-0.26849 z"
         id="path11106" />
      <path
         d="m 91.224308,155.26998 v -3.40179 q 0,-0.16884 0.09134,-0.24911 0.09411,-0.083 0.243579,-0.083 h 2.186668 q 0.202059,0 0.268489,0.0858 0.06643,0.0858 0.06643,0.24634 v 0.23251 q 0,0.16054 -0.06643,0.24911 -0.06643,0.0858 -0.268489,0.0858 h -1.417183 v 0.65323 h 0.907883 q 0.202059,0 0.26849,0.0886 0.06643,0.0858 0.06643,0.24634 v 0.20206 q 0,0.16054 -0.06643,0.24912 -0.06643,0.0858 -0.26849,0.0858 h -0.907883 v 0.74181 h 1.453166 q 0.204827,0 0.26849,0.0858 0.06366,0.083 0.06366,0.24912 v 0.2325 q 0,0.16331 -0.06643,0.24912 -0.06366,0.0858 -0.265722,0.0858 h -2.222651 q -0.146701,0 -0.240811,-0.083 -0.09411,-0.083 -0.09411,-0.25189 z"
         id="path11108" />
      <path
         d="m 94.432811,155.26998 v -3.40179 q 0,-0.16884 0.09134,-0.24911 0.09411,-0.083 0.243578,-0.083 h 0.822077 q 0.1467,0 0.229738,0.072 0.08581,0.072 0.132861,0.24911 l 0.61725,2.34167 h 0.01107 l 0.647697,-2.34167 q 0.05259,-0.17715 0.135629,-0.24911 0.08581,-0.072 0.232506,-0.072 h 0.805469 q 0.146701,0 0.238043,0.083 0.09411,0.0803 0.09411,0.24911 v 3.40179 q 0,0.20206 -0.08581,0.26849 -0.08581,0.0664 -0.246346,0.0664 h -0.351527 q -0.160541,0 -0.249115,-0.0664 -0.08581,-0.0664 -0.08581,-0.26849 v -2.23925 h -0.01107 l -0.58957,2.25033 q -0.04706,0.17714 -0.132861,0.25188 -0.08304,0.072 -0.229739,0.072 h -0.33492 q -0.1467,0 -0.232506,-0.072 -0.08304,-0.0747 -0.130093,-0.25188 l -0.58957,-2.25033 h -0.01107 v 2.23925 q 0,0.20206 -0.08857,0.26849 -0.08581,0.0664 -0.246346,0.0664 h -0.351528 q -0.16054,0 -0.249114,-0.0664 -0.08581,-0.0664 -0.08581,-0.26849 z"
         id="path11110" />
      <path
         d="m 99.398338,154.51711 q -0.168844,0 -0.251882,-0.0941 -0.08304,-0.0941 -0.08304,-0.24081 v -0.18269 q 0,-0.1467 0.08304,-0.23804 0.08304,-0.0941 0.251882,-0.0941 h 0.974312 q 0.16885,0 0.25188,0.0941 0.083,0.0913 0.083,0.23804 v 0.18269 q 0,0.1467 -0.083,0.24081 -0.083,0.0941 -0.25188,0.0941 z"
         id="path11112" />
      <path
         d="m 101.03688,155.26998 v -3.40179 q 0,-0.16884 0.0913,-0.24911 0.0941,-0.083 0.24358,-0.083 h 0.62278 q 0.27403,0 0.43734,0.2934 l 1.05458,1.93756 h 0.0111 v -1.89881 q 0,-0.20206 0.0858,-0.26572 0.0858,-0.0664 0.24911,-0.0664 h 0.35706 q 0.16054,0 0.24635,0.0664 0.0858,0.0637 0.0858,0.26572 v 3.40179 q 0,0.20206 -0.0858,0.26849 -0.0858,0.0664 -0.24635,0.0664 h -0.48162 q -0.28786,0 -0.44287,-0.2934 l -1.19021,-2.08702 h -0.0111 v 2.0455 q 0,0.20206 -0.0886,0.26849 -0.0858,0.0664 -0.24635,0.0664 h -0.35706 q -0.16054,0 -0.24912,-0.0664 -0.0858,-0.0664 -0.0858,-0.26849 z"
         id="path11114" />
      <path
         d="m 105.05602,155.26998 v -3.40179 q 0,-0.20206 0.0858,-0.26572 0.0858,-0.0664 0.24912,-0.0664 h 0.43733 q 0.16054,0 0.24635,0.0664 0.0858,0.0637 0.0858,0.26572 v 3.40179 q 0,0.20206 -0.0858,0.26849 -0.0858,0.0664 -0.24635,0.0664 h -0.43733 q -0.16054,0 -0.24912,-0.0664 -0.0858,-0.0664 -0.0858,-0.26849 z"
         id="path11116" />
      <path
         d="m 106.42304,155.25891 q -0.2242,-0.26572 0.072,-0.4318 l 0.39305,-0.21866 q 0.072,-0.0443 0.13009,-0.0443 0.0609,0 0.0996,0.0277 0.0415,0.0249 0.0969,0.083 0.0886,0.10241 0.22697,0.10241 0.13563,0 0.19929,-0.0913 0.0637,-0.0913 0.0637,-0.28233 v -2.53543 q 0,-0.20206 0.0858,-0.26572 0.0858,-0.0664 0.24635,-0.0664 h 0.44287 q 0.16331,0 0.24911,0.0664 0.0858,0.0637 0.0858,0.26572 v 2.31953 q 0,1.48638 -1.32031,1.48638 -0.32938,0 -0.59233,-0.0858 -0.26019,-0.0886 -0.47886,-0.32939 z"
         id="path11118" />
      <path
         d="m 109.32458,155.26998 v -3.40179 q 0,-0.16884 0.0913,-0.24911 0.0941,-0.083 0.24358,-0.083 h 0.82208 q 0.1467,0 0.22974,0.072 0.0858,0.072 0.13286,0.24911 l 0.61725,2.34167 h 0.0111 l 0.64769,-2.34167 q 0.0526,-0.17715 0.13563,-0.24911 0.0858,-0.072 0.23251,-0.072 h 0.80547 q 0.1467,0 0.23804,0.083 0.0941,0.0803 0.0941,0.24911 v 3.40179 q 0,0.20206 -0.0858,0.26849 -0.0858,0.0664 -0.24634,0.0664 h -0.35153 q -0.16054,0 -0.24911,-0.0664 -0.0858,-0.0664 -0.0858,-0.26849 v -2.23925 h -0.0111 l -0.58957,2.25033 q -0.0471,0.17714 -0.13286,0.25188 -0.083,0.072 -0.22974,0.072 h -0.33492 q -0.1467,0 -0.23251,-0.072 -0.083,-0.0747 -0.13009,-0.25188 l -0.58957,-2.25033 h -0.0111 v 2.23925 q 0,0.20206 -0.0886,0.26849 -0.0858,0.0664 -0.24634,0.0664 h -0.35153 q -0.16054,0 -0.24911,-0.0664 -0.0858,-0.0664 -0.0858,-0.26849 z"
         id="path11120" />
      <path
         d="m 114.16,155.26998 v -3.40179 q 0,-0.16884 0.0913,-0.24911 0.0941,-0.083 0.24358,-0.083 h 2.18667 q 0.20206,0 0.26849,0.0858 0.0664,0.0858 0.0664,0.24634 v 0.23251 q 0,0.16054 -0.0664,0.24911 -0.0664,0.0858 -0.26849,0.0858 h -1.41718 v 0.65323 h 0.90788 q 0.20206,0 0.26849,0.0886 0.0664,0.0858 0.0664,0.24634 v 0.20206 q 0,0.16054 -0.0664,0.24912 -0.0664,0.0858 -0.26849,0.0858 h -0.90788 v 0.74181 h 1.45316 q 0.20483,0 0.26849,0.0858 0.0637,0.083 0.0637,0.24912 v 0.2325 q 0,0.16331 -0.0664,0.24912 -0.0637,0.0858 -0.26572,0.0858 h -2.22265 q -0.1467,0 -0.24081,-0.083 -0.0941,-0.083 -0.0941,-0.25189 z"
         id="path11122" />
      <path
         d="m 118.76355,155.6741 q -0.50376,0 -0.86083,-0.26849 -0.35429,-0.27125 -0.52867,-0.75288 -0.17438,-0.48162 -0.17438,-1.13485 0,-0.99645 0.47608,-1.52236 0.47609,-0.52868 1.30923,-0.52868 1.14593,0 1.50022,0.88851 0.12733,0.32385 -0.20759,0.38197 l -0.40412,0.072 q -0.0526,0.008 -0.0941,0.0111 -0.0388,0.003 -0.072,-0.008 -0.0332,-0.0111 -0.0554,-0.0194 -0.0194,-0.0111 -0.0471,-0.0415 -0.0249,-0.0304 -0.0415,-0.0498 -0.0138,-0.0221 -0.047,-0.072 -0.0332,-0.0498 -0.0554,-0.0803 -0.15224,-0.21036 -0.47609,-0.21036 -0.32108,0 -0.50099,0.29894 -0.17992,0.29894 -0.17992,0.8802 0,0.65323 0.16885,0.97708 0.16884,0.32108 0.57296,0.32108 0.28786,0 0.46224,-0.14393 0.17438,-0.14393 0.17438,-0.38197 v -0.0526 h -0.3017 q -0.2076,0 -0.27126,-0.0637 -0.0637,-0.0637 -0.0637,-0.21313 V 153.767 q 0,-0.14947 0.0637,-0.21314 0.0637,-0.0637 0.27126,-0.0637 h 0.90788 q 0.16054,0 0.24635,0.0664 0.0886,0.0664 0.0886,0.26849 v 1.44486 q 0,0.21037 -0.0637,0.27403 -0.0637,0.0609 -0.2159,0.0609 h -0.24358 q -0.15777,0 -0.24081,-0.0637 -0.083,-0.0664 -0.083,-0.26572 h -0.0111 q -0.21036,0.21313 -0.45394,0.30724 -0.24081,0.0913 -0.54805,0.0913 z"
         id="path11124" />
      <path
         d="m 121.01918,155.26998 v -3.40179 q 0,-0.16884 0.0913,-0.24911 0.0941,-0.083 0.24358,-0.083 h 2.18666 q 0.20206,0 0.26849,0.0858 0.0664,0.0858 0.0664,0.24634 v 0.23251 q 0,0.16054 -0.0664,0.24911 -0.0664,0.0858 -0.26849,0.0858 h -1.41718 v 0.65323 h 0.90788 q 0.20206,0 0.26849,0.0886 0.0664,0.0858 0.0664,0.24634 v 0.20206 q 0,0.16054 -0.0664,0.24912 -0.0664,0.0858 -0.26849,0.0858 h -0.90788 v 0.74181 h 1.45317 q 0.20482,0 0.26849,0.0858 0.0637,0.083 0.0637,0.24912 v 0.2325 q 0,0.16331 -0.0664,0.24912 -0.0637,0.0858 -0.26572,0.0858 h -2.22265 q -0.1467,0 -0.24081,-0.083 -0.0941,-0.083 -0.0941,-0.25189 z"
         id="path11126" />
      <path
         d="m 124.22766,155.26998 v -3.40179 q 0,-0.16884 0.0914,-0.24911 0.0941,-0.083 0.24357,-0.083 h 0.62279 q 0.27403,0 0.43733,0.2934 l 1.05459,1.93756 h 0.0111 v -1.89881 q 0,-0.20206 0.0858,-0.26572 0.0858,-0.0664 0.24912,-0.0664 h 0.35706 q 0.16054,0 0.24635,0.0664 0.0858,0.0637 0.0858,0.26572 v 3.40179 q 0,0.20206 -0.0858,0.26849 -0.0858,0.0664 -0.24635,0.0664 h -0.48162 q -0.28786,0 -0.44287,-0.2934 l -1.19021,-2.08702 h -0.0111 v 2.0455 q 0,0.20206 -0.0886,0.26849 -0.0858,0.0664 -0.24634,0.0664 h -0.35707 q -0.16054,0 -0.24911,-0.0664 -0.0858,-0.0664 -0.0858,-0.26849 z"
         id="path11128" />
    </g>
    <g
       id="g375"
       transform="matrix(0.35277777,0,0,-0.35278453,144.78514,156.77428)">
      <path
         d="m 0,0 h -42.794 c -0.384,0 -0.698,0.307 -0.698,0.682 v 16.194 c 0,0.375 0.314,0.682 0.698,0.682 H 0 c 0.384,0 0.697,-0.307 0.697,-0.682 V 0.682 C 0.697,0.307 0.384,0 0,0"
         style="fill:#000000;fill-opacity:1;fill-rule:nonzero;stroke:none"
         id="path377" />
    </g>
    <g
       id="g379"
       transform="matrix(0.35277777,0,0,-0.35278453,132.84464,151.99911)">
      <path
         d="m 0,0 c 0,0.663 0.436,0.932 0.953,0.932 h 3.265 c 3.377,0 4.783,-1.011 4.783,-2.875 0,-1.073 -0.582,-2.005 -1.778,-2.463 v -0.032 c 1.261,-0.363 2.149,-1.058 2.149,-2.653 0,-2.622 -2.424,-3.317 -5.106,-3.317 H 0.953 C 0.436,-10.408 0,-10.139 0,-9.476 Z m 4.395,-3.49 c 0.76,0 1.438,0.252 1.438,1.074 0,0.726 -0.646,0.884 -1.535,0.884 H 3.07 V -3.49 Z M 4.363,-7.96 c 1.454,0 1.858,0.49 1.858,1.169 0,0.916 -0.824,1.105 -1.729,1.105 H 3.07 V -7.96 Z"
         style="fill:#ffffff;fill-opacity:1;fill-rule:nonzero;stroke:none"
         id="path381" />
    </g>
    <g
       id="g383"
       transform="matrix(0.35277777,0,0,-0.35278453,136.67552,151.99911)">
      <path
         d="M 0,0 C 0,0.821 0.436,0.932 0.953,0.932 H 2.198 C 2.715,0.932 3.151,0.821 3.151,0 v -9.476 c 0,-0.821 -0.436,-0.932 -0.953,-0.932 H 0.953 C 0.436,-10.408 0,-10.297 0,-9.476 Z"
         style="fill:#ffffff;fill-opacity:1;fill-rule:nonzero;stroke:none"
         id="path385" />
    </g>
    <g
       id="g387"
       transform="matrix(0.35277777,0,0,-0.35278453,138.29449,154.90748)">
      <path
         d="M 0,0 1.115,0.616 C 1.551,0.869 1.777,0.711 2.052,0.426 2.214,0.253 2.424,0.142 2.698,0.142 c 0.518,0 0.744,0.332 0.744,1.043 v 7.059 c 0,0.821 0.436,0.932 0.953,0.932 h 1.261 c 0.517,0 0.953,-0.111 0.953,-0.932 V 1.785 c 0,-2.48 -1.002,-4.138 -3.765,-4.138 -1.083,0 -2.149,0.174 -3.054,1.153 C -0.533,-0.821 -0.663,-0.363 0,0"
         style="fill:#ffffff;fill-opacity:1;fill-rule:nonzero;stroke:none"
         id="path389" />
    </g>
    <g
       id="g391"
       transform="matrix(0.35277777,0,0,-0.35278453,141.5894,155.20835)">
      <path
         d="M 0,0 C 0,0.505 0.113,0.932 0.953,0.932 H 1.778 V 7.47 L 0.533,7.312 C -0.259,7.217 -0.372,7.454 -0.372,7.928 v 0.348 c 0,0.537 0.21,0.821 0.873,1.026 l 1.406,0.442 c 0.517,0.158 0.824,0.285 1.373,0.285 h 0.517 c 0.518,0 0.938,-0.095 0.938,-0.916 V 0.932 H 5.656 C 6.496,0.932 6.609,0.505 6.609,0 v -0.379 c 0,-0.505 -0.113,-0.932 -0.953,-0.932 H 0.953 C 0.113,-1.311 0,-0.884 0,-0.379 Z"
         style="fill:#ffff00;fill-opacity:1;fill-rule:nonzero;stroke:none"
         id="path393" />
    </g>
  </g>
</svg>
