{
  "transactie_id": "id",
  "aanmaakdatum": "createdAt",
  "betalingsdatum": "paidAt",
  "omschrijving": "description",
  "betalingsmethode": "method",
  "betalingsinstrument": "sequenceType",
  "status": "status",
  "mollie_customer_id": "customerId",
  "mandaat": "mandateId",
  "bedrag": "amount.value",
  "munteenheid": "amount.currency",
  "klant": "customer.name",
  "email": "customer.email"
}
