(export (version D)
  (design
    (source /home/v01d/electronica/projects/bicycle-companion/bicycle-companion.sch)
    (date "Sun 11 Sep 2016 10:53:07 PM ART")
    (tool "Eeschema 4.0.3-stable")
    (sheet (number 1) (name /) (tstamps /)
      (title_block
        (title)
        (company)
        (rev)
        (date)
        (source bicycle-companion.sch)
        (comment (number 1) (value ""))
        (comment (number 2) (value ""))
        (comment (number 3) (value ""))
        (comment (number 4) (value "")))))
  (components
    (comp (ref SW5)
      (value MAIN_SWITCH)
      (footprint dpdt_switch:DPDT_ESWITCH_EG2207)
      (libsource (lib switch_dpdt) (part SWITCH_DPDT))
      (sheetpath (names /) (tstamps /))
      (tstamp 57B9DE29))
    (comp (ref R3)
      (value 4k)
      (footprint Resistors_SMD:R_0603_HandSoldering)
      (libsource (lib device) (part R))
      (sheetpath (names /) (tstamps /))
      (tstamp 57B9F30C))
    (comp (ref R4)
      (value 4k)
      (footprint Resistors_SMD:R_0603_HandSoldering)
      (libsource (lib device) (part R))
      (sheetpath (names /) (tstamps /))
      (tstamp 57B9F398))
    (comp (ref R1)
      (value 10k)
      (footprint Resistors_SMD:R_0603_HandSoldering)
      (libsource (lib device) (part R))
      (sheetpath (names /) (tstamps /))
      (tstamp 57C10854))
    (comp (ref R2)
      (value 10k)
      (footprint Resistors_SMD:R_0603_HandSoldering)
      (libsource (lib device) (part R))
      (sheetpath (names /) (tstamps /))
      (tstamp 57C108A3))
    (comp (ref P1)
      (value RTC_BATTERY)
      (footprint wire_pads:SolderWirePad_2x_0-8mmDrill)
      (libsource (lib conn) (part CONN_01X02))
      (sheetpath (names /) (tstamps /))
      (tstamp 57D58219))
    (comp (ref U1)
      (value Teensy_3.1)
      (footprint Teensy:Teensy3.x_LC)
      (libsource (lib teensy_3.1) (part Teensy_3.1))
      (sheetpath (names /) (tstamps /))
      (tstamp 57D5952D))
    (comp (ref P2)
      (value HALL)
      (footprint wire_pads:SolderWirePad_3x_0-8mmDrill)
      (libsource (lib conn) (part CONN_01X03))
      (sheetpath (names /) (tstamps /))
      (tstamp 57D5D363))
    (comp (ref SW1)
      (value SW_PUSH)
      (footprint Buttons_Switches_ThroughHole:SW_Tactile_SPST_Angled)
      (libsource (lib device) (part SW_PUSH))
      (sheetpath (names /) (tstamps /))
      (tstamp 57D62343))
    (comp (ref SW2)
      (value SW_PUSH)
      (footprint Buttons_Switches_ThroughHole:SW_Tactile_SPST_Angled)
      (libsource (lib device) (part SW_PUSH))
      (sheetpath (names /) (tstamps /))
      (tstamp 57D623B6))
    (comp (ref SW3)
      (value SW_PUSH)
      (footprint Buttons_Switches_ThroughHole:SW_Tactile_SPST_Angled)
      (libsource (lib device) (part SW_PUSH))
      (sheetpath (names /) (tstamps /))
      (tstamp 57D623F5))
    (comp (ref SW4)
      (value SW_PUSH)
      (footprint Buttons_Switches_ThroughHole:SW_Tactile_SPST_Angled)
      (libsource (lib device) (part SW_PUSH))
      (sheetpath (names /) (tstamps /))
      (tstamp 57D6244A))
    (comp (ref P6)
      (value CONN_01X02)
      (footprint Pin_Headers:Pin_Header_Straight_1x02)
      (libsource (lib conn) (part CONN_01X02))
      (sheetpath (names /) (tstamps /))
      (tstamp 57D5D854))
    (comp (ref P8)
      (value CONN_01X02)
      (footprint Pin_Headers:Pin_Header_Straight_1x02)
      (libsource (lib conn) (part CONN_01X02))
      (sheetpath (names /) (tstamps /))
      (tstamp 57D5D88D))
    (comp (ref U2)
      (value TMP36)
      (footprint TO_SOT_Packages_THT:TO-92_Inline_Narrow_Oval)
      (libsource (lib tmp36) (part TMP36))
      (sheetpath (names /) (tstamps /))
      (tstamp 57D60872))
    (comp (ref P5)
      (value CONN_DISP)
      (footprint Pin_Headers:Pin_Header_Straight_1x04)
      (libsource (lib conn) (part CONN_01X04))
      (sheetpath (names /) (tstamps /))
      (tstamp 57D625FE))
    (comp (ref P3)
      (value CONN_CHARGE)
      (footprint wire_pads:SolderWirePad_2x_0-8mmDrill)
      (libsource (lib conn) (part CONN_01X02))
      (sheetpath (names /) (tstamps /))
      (tstamp 57D63CD2))
    (comp (ref P4)
      (value CONN_DISCH)
      (footprint wire_pads:SolderWirePad_2x_0-8mmDrill)
      (libsource (lib conn) (part CONN_01X02))
      (sheetpath (names /) (tstamps /))
      (tstamp 57D63D0D))
    (comp (ref P7)
      (value CONN_01X01)
      (footprint Pin_Headers:Pin_Header_Straight_1x01)
      (libsource (lib conn) (part CONN_01X01))
      (sheetpath (names /) (tstamps /))
      (tstamp 57D5F10A))
    (comp (ref P9)
      (value CONN_01X02)
      (footprint Pin_Headers:Pin_Header_Straight_1x02)
      (libsource (lib conn) (part CONN_01X02))
      (sheetpath (names /) (tstamps /))
      (tstamp 57D5F179)))
  (libparts
    (libpart (lib conn) (part CONN_01X01)
      (description "Connector, single row, 01x01")
      (footprints
        (fp Pin_Header_Straight_1X01)
        (fp Pin_Header_Angled_1X01)
        (fp Socket_Strip_Straight_1X01)
        (fp Socket_Strip_Angled_1X01))
      (fields
        (field (name Reference) P)
        (field (name Value) CONN_01X01))
      (pins
        (pin (num 1) (name P1) (type passive))))
    (libpart (lib conn) (part CONN_01X02)
      (description "Connector, single row, 01x02")
      (footprints
        (fp Pin_Header_Straight_1X02)
        (fp Pin_Header_Angled_1X02)
        (fp Socket_Strip_Straight_1X02)
        (fp Socket_Strip_Angled_1X02))
      (fields
        (field (name Reference) P)
        (field (name Value) CONN_01X02))
      (pins
        (pin (num 1) (name P1) (type passive))
        (pin (num 2) (name P2) (type passive))))
    (libpart (lib conn) (part CONN_01X03)
      (description "Connector, single row, 01x03")
      (footprints
        (fp Pin_Header_Straight_1X03)
        (fp Pin_Header_Angled_1X03)
        (fp Socket_Strip_Straight_1X03)
        (fp Socket_Strip_Angled_1X03))
      (fields
        (field (name Reference) P)
        (field (name Value) CONN_01X03))
      (pins
        (pin (num 1) (name P1) (type passive))
        (pin (num 2) (name P2) (type passive))
        (pin (num 3) (name P3) (type passive))))
    (libpart (lib conn) (part CONN_01X04)
      (description "Connector, single row, 01x04")
      (footprints
        (fp Pin_Header_Straight_1X04)
        (fp Pin_Header_Angled_1X04)
        (fp Socket_Strip_Straight_1X04)
        (fp Socket_Strip_Angled_1X04))
      (fields
        (field (name Reference) P)
        (field (name Value) CONN_01X04))
      (pins
        (pin (num 1) (name P1) (type passive))
        (pin (num 2) (name P2) (type passive))
        (pin (num 3) (name P3) (type passive))
        (pin (num 4) (name P4) (type passive))))
    (libpart (lib device) (part R)
      (description Resistor)
      (footprints
        (fp R_*)
        (fp Resistor_*))
      (fields
        (field (name Reference) R)
        (field (name Value) R))
      (pins
        (pin (num 1) (name ~) (type passive))
        (pin (num 2) (name ~) (type passive))))
    (libpart (lib switch_dpdt) (part SWITCH_DPDT)
      (description "Switch double pole double throw (DPDT)")
      (fields
        (field (name Reference) SW)
        (field (name Value) SWITCH_DPDT))
      (pins
        (pin (num 1) (name 1) (type input))
        (pin (num 2) (name 2) (type input))
        (pin (num 3) (name 3) (type input))
        (pin (num 4) (name 4) (type input))
        (pin (num 5) (name 5) (type input))
        (pin (num 6) (name 6) (type input))))
    (libpart (lib device) (part SW_PUSH)
      (description Button)
      (fields
        (field (name Reference) SW)
        (field (name Value) SW_PUSH))
      (pins
        (pin (num 1) (name 1) (type passive))
        (pin (num 2) (name 2) (type passive))))
    (libpart (lib tmp36) (part TMP36)
      (fields
        (field (name Reference) U)
        (field (name Value) TMP36))
      (pins
        (pin (num 1) (name VCC) (type input))
        (pin (num 2) (name Vout) (type input))
        (pin (num 3) (name GND) (type input))))
    (libpart (lib teensy_3.1) (part Teensy_3.1)
      (fields
        (field (name Reference) U)
        (field (name Value) Teensy_3.1))
      (pins
        (pin (num 1) (name GND) (type power_in))
        (pin (num 2) (name "0(RX1)") (type BiDi))
        (pin (num 3) (name "1(TX1)") (type BiDi))
        (pin (num 4) (name 2) (type BiDi))
        (pin (num 5) (name "3(TX)") (type BiDi))
        (pin (num 6) (name "4(RX)") (type BiDi))
        (pin (num 7) (name 5) (type BiDi))
        (pin (num 8) (name 6) (type BiDi))
        (pin (num 9) (name "7(RX3)") (type BiDi))
        (pin (num 10) (name "8(TX3)") (type BiDi))
        (pin (num 11) (name "9(RX2)") (type BiDi))
        (pin (num 12) (name "10(CS)(TX2)") (type BiDi))
        (pin (num 13) (name "11(DOUT)") (type BiDi))
        (pin (num 14) (name "12(DIN)") (type BiDi))
        (pin (num 15) (name VBat) (type power_in))
        (pin (num 16) (name 3.3V) (type power_in))
        (pin (num 17) (name GND) (type power_in))
        (pin (num 18) (name Prog) (type BiDi))
        (pin (num 19) (name A14) (type BiDi))
        (pin (num 20) (name "13(LED)") (type BiDi))
        (pin (num 21) (name 14/A0) (type BiDi))
        (pin (num 22) (name 15/A1) (type BiDi))
        (pin (num 23) (name 16/A2) (type BiDi))
        (pin (num 24) (name 17/A3) (type BiDi))
        (pin (num 25) (name 18/A4) (type BiDi))
        (pin (num 26) (name 19/A5) (type BiDi))
        (pin (num 27) (name 20/A6) (type BiDi))
        (pin (num 28) (name 21/A7) (type BiDi))
        (pin (num 29) (name 22/A8) (type BiDi))
        (pin (num 30) (name 23/A9) (type BiDi))
        (pin (num 31) (name 3.3V) (type power_out))
        (pin (num 32) (name AGND) (type power_in))
        (pin (num 33) (name Vin) (type power_in))
        (pin (num 34) (name Vusb) (type passive))
        (pin (num 35) (name AREF) (type passive))
        (pin (num 36) (name A10) (type passive))
        (pin (num 37) (name A11) (type passive)))))
  (libraries
    (library (logical device)
      (uri /usr/share/kicad/library/device.lib))
    (library (logical tmp36)
      (uri /home/v01d/electronica/components/tmp36.lib))
    (library (logical conn)
      (uri /usr/share/kicad/library/conn.lib))
    (library (logical switch_dpdt)
      (uri /home/v01d/electronica/components/switch/switch_dpdt.lib))
    (library (logical teensy_3.1)
      (uri /home/v01d/electronica/components/teensy/teensy_3.1.lib)))
  (nets
    (net (code 1) (name /BUT4)
      (node (ref SW1) (pin 2))
      (node (ref U1) (pin 20)))
    (net (code 2) (name /BUT3)
      (node (ref SW2) (pin 1))
      (node (ref U1) (pin 2)))
    (net (code 3) (name /BUT2)
      (node (ref U1) (pin 13))
      (node (ref SW3) (pin 1)))
    (net (code 4) (name /BUT1)
      (node (ref U1) (pin 29))
      (node (ref SW4) (pin 2)))
    (net (code 5) (name /HALL)
      (node (ref U1) (pin 4))
      (node (ref P2) (pin 3)))
    (net (code 6) (name "Net-(U1-Pad19)")
      (node (ref U1) (pin 19)))
    (net (code 7) (name "Net-(U1-Pad14)")
      (node (ref U1) (pin 14)))
    (net (code 8) (name "Net-(U1-Pad10)")
      (node (ref U1) (pin 10)))
    (net (code 9) (name /BT_RESET)
      (node (ref U1) (pin 30))
      (node (ref P9) (pin 2)))
    (net (code 10) (name "Net-(U1-Pad11)")
      (node (ref U1) (pin 11)))
    (net (code 11) (name "Net-(U1-Pad21)")
      (node (ref U1) (pin 21)))
    (net (code 12) (name "Net-(U1-Pad12)")
      (node (ref U1) (pin 12)))
    (net (code 13) (name "Net-(U1-Pad22)")
      (node (ref U1) (pin 22)))
    (net (code 14) (name "Net-(U1-Pad32)")
      (node (ref U1) (pin 32)))
    (net (code 15) (name /TEMP)
      (node (ref U2) (pin 2))
      (node (ref U1) (pin 23)))
    (net (code 16) (name "Net-(P1-Pad2)")
      (node (ref P1) (pin 2))
      (node (ref U1) (pin 15)))
    (net (code 17) (name "Net-(U1-Pad35)")
      (node (ref U1) (pin 35)))
    (net (code 18) (name "Net-(U1-Pad17)")
      (node (ref U1) (pin 17)))
    (net (code 19) (name "Net-(U1-Pad27)")
      (node (ref U1) (pin 27)))
    (net (code 20) (name "Net-(U1-Pad37)")
      (node (ref U1) (pin 37)))
    (net (code 21) (name "Net-(U1-Pad18)")
      (node (ref U1) (pin 18)))
    (net (code 22) (name "Net-(U1-Pad28)")
      (node (ref U1) (pin 28)))
    (net (code 23) (name /GND)
      (node (ref P5) (pin 1))
      (node (ref P2) (pin 1))
      (node (ref U2) (pin 3))
      (node (ref R2) (pin 2))
      (node (ref U1) (pin 1))
      (node (ref P1) (pin 1))
      (node (ref SW4) (pin 1))
      (node (ref SW3) (pin 2))
      (node (ref SW2) (pin 2))
      (node (ref P3) (pin 2))
      (node (ref P4) (pin 2))
      (node (ref SW1) (pin 1))
      (node (ref P7) (pin 1)))
    (net (code 24) (name /BT_CTRL)
      (node (ref U1) (pin 9))
      (node (ref P6) (pin 1)))
    (net (code 25) (name /Vin_MEAS)
      (node (ref U1) (pin 36))
      (node (ref R2) (pin 1))
      (node (ref R1) (pin 1)))
    (net (code 26) (name /VCC)
      (node (ref U1) (pin 31))
      (node (ref U1) (pin 16))
      (node (ref P5) (pin 2))
      (node (ref P2) (pin 2))
      (node (ref U2) (pin 1))
      (node (ref P9) (pin 1)))
    (net (code 27) (name "Net-(U1-Pad7)")
      (node (ref U1) (pin 7)))
    (net (code 28) (name /SDA)
      (node (ref R3) (pin 1))
      (node (ref P5) (pin 4))
      (node (ref U1) (pin 25)))
    (net (code 29) (name /SCL)
      (node (ref P5) (pin 3))
      (node (ref U1) (pin 26))
      (node (ref R4) (pin 2)))
    (net (code 30) (name "Net-(R3-Pad2)")
      (node (ref R4) (pin 1))
      (node (ref R3) (pin 2)))
    (net (code 31) (name /TEENSY_TX)
      (node (ref U1) (pin 5))
      (node (ref P8) (pin 2)))
    (net (code 32) (name /L+)
      (node (ref P4) (pin 1))
      (node (ref SW5) (pin 1)))
    (net (code 33) (name "Net-(SW5-Pad4)")
      (node (ref SW5) (pin 4)))
    (net (code 34) (name /Vin)
      (node (ref R1) (pin 2))
      (node (ref SW5) (pin 2))
      (node (ref U1) (pin 33)))
    (net (code 35) (name /Vusb)
      (node (ref U1) (pin 34))
      (node (ref SW5) (pin 5))
      (node (ref SW5) (pin 3)))
    (net (code 36) (name /C+)
      (node (ref U1) (pin 24))
      (node (ref P3) (pin 1))
      (node (ref SW5) (pin 6)))
    (net (code 37) (name /BT_STATUS)
      (node (ref U1) (pin 8))
      (node (ref P6) (pin 2)))
    (net (code 38) (name "Net-(U1-Pad3)")
      (node (ref U1) (pin 3)))
    (net (code 39) (name /TEENSY_RX)
      (node (ref U1) (pin 6))
      (node (ref P8) (pin 1)))))