[
  {
    "id": 1,
    "name":"Prepare",
    "recipe": ["FactoryPreparation", "FactoryFinish"]
  },
  {
    "id": 2,
    "name":"Configure",
    "recipe": ["FactoryConfigure"]
  },
  {
    "id": 3,
    "name":"Visualisation",
    "recipe": ["FactoryVisualize"]
  },
  {
    "id": 4,
    "name":"Build & Visualize",
    "recipe": ["FactoryPreparation", "FactoryBuild", "FactoryConfigure", "FactoryVisualize", "FactoryFinish"]
  },
  {
    "id": 5,
    "name":"Build only",
    "recipe": ["FactoryPreparation", "FactoryBuild", "FactoryConfigure", "FactoryFinish"]
  },
  {
    "id": 7,
    "name":"All Factories",
    "recipe": ["FactoryPreparation", "FactoryBuild", "FactoryConfigure", "FactoryVisualize", "FactoryApprove", "FactoryDeploy", "FactoryUpdate", "FactoryCleanUp", "FactoryFinish"]
  },
  {
    "id": 8,
    "name":"Deploy",
    "recipe": ["FactoryDeploy", "FactoryFinish"]
  },
  {
    "id": 9,
    "name":"Approve",
    "recipe": ["FactoryApprove", "FactoryFinish"]
  },
  {
    "id": 10,
    "name":"Update",
    "recipe": ["FactoryUpdate", "FactoryFinish"]
  },
  {
    "id": 11,
    "name":"Update Configuration & Deploy",
    "recipe": ["FactoryDeploy", "FactoryUpdate", "FactoryFinish"]
  },
  {
    "id": 12,
    "name":"Build and Update Configuration",
    "recipe": ["FactoryPreparation", "FactoryBuild", "FactoryConfigure", "FactoryUpdate", "FactoryFinish"]
  },
  {
    "id": 13,
    "name":"CleanUp",
    "recipe": ["FactoryCleanUp", "FactoryFinish"]
  },
  {
    "id": 14,
    "name":"All without visualize",
    "recipe": ["FactoryPreparation", "FactoryBuild", "FactoryConfigure", "FactoryApprove", "FactoryDeploy", "FactoryUpdate", "FactoryCleanUp", "FactoryFinish"]
  }
]
