192.168.6.223-192.168.6.213-06/Aug/2019:14:20:16 +0100-GET /js HTTP/1.1-304-0-http://192.168.6.223/home-Mozilla/5.0 (X11; Ubuntu; Linux x86_64; rv:68.0) Gecko/20100101 Firefox/68.0-80
192.168.6.223-192.168.6.213-06/Aug/2019:14:20:16 +0100-GET /js HTTP/1.1-304-0-http://192.168.6.223/home-Mozilla/5.0 (X11; Ubuntu; Linux x86_64; rv:68.0) Gecko/20100101 Firefox/68.0-80
192.168.6.223-192.168.6.213-06/Aug/2019:14:20:16 +0100-GET /js HTTP/1.1-304-0-http://192.168.6.223/home-Mozilla/5.0 (X11; Ubuntu; Linux x86_64; rv:68.0) Gecko/20100101 Firefox/68.0-80
192.168.6.223-192.168.6.213-06/Aug/2019:14:20:16 +0100-GET /js HTTP/1.1-304-0-http://192.168.6.223/home-Mozilla/5.0 (X11; Ubuntu; Linux x86_64; rv:68.0) Gecko/20100101 Firefox/68.0-80
192.168.6.223-192.168.6.213-06/Aug/2019:14:20:16 +0100-GET /js HTTP/1.1-304-0-http://192.168.6.223/home-Mozilla/5.0 (X11; Ubuntu; Linux x86_64; rv:68.0) Gecko/20100101 Firefox/68.0-80
192.168.6.223-192.168.6.213-06/Aug/2019:14:20:16 +0100-GET /js HTTP/1.1-304-0-http://192.168.6.223/home-Mozilla/5.0 (X11; Ubuntu; Linux x86_64; rv:68.0) Gecko/20100101 Firefox/68.0-80
192.168.6.223-192.168.6.213-06/Aug/2019:14:20:16 +0100-GET /js HTTP/1.1-304-0-http://192.168.6.223/home-Mozilla/5.0 (X11; Ubuntu; Linux x86_64; rv:68.0) Gecko/20100101 Firefox/68.0-80
192.168.6.223-192.168.6.213-06/Aug/2019:14:20:16 +0100-GET /js HTTP/1.1-304-0-http://192.168.6.223/home-Mozilla/5.0 (X11; Ubuntu; Linux x86_64; rv:68.0) Gecko/20100101 Firefox/68.0-80
192.168.6.223-192.168.6.213-06/Aug/2019:14:20:16 +0100-GET /js HTTP/1.1-304-0-http://192.168.6.223/home-Mozilla/5.0 (X11; Ubuntu; Linux x86_64; rv:68.0) Gecko/20100101 Firefox/68.0-80
192.168.6.223-192.168.6.213-06/Aug/2019:14:20:16 +0100-GET /js HTTP/1.1-304-0-http://192.168.6.223/home-Mozilla/5.0 (X11; Ubuntu; Linux x86_64; rv:68.0) Gecko/20100101 Firefox/68.0-80
192.168.6.223-192.168.6.213-06/Aug/2019:14:20:16 +0100-GET /js HTTP/1.1-404-0-http://192.168.6.223/home-Mozilla/5.0 (X11; Ubuntu; Linux x86_64; rv:68.0) Gecko/20100101 Firefox/68.0-80
192.168.6.223-192.168.6.213-06/Aug/2019:14:20:16 +0100-GET /js HTTP/1.1-304-0-http://192.168.6.223/home-Mozilla/5.0 (X11; Ubuntu; Linux x86_64; rv:68.0) Gecko/20100101 Firefox/68.0-80
192.168.6.223-192.168.6.213-06/Aug/2019:14:20:16 +0100-GET /home HTTP/1.1-304-0-http://192.168.6.223/home-Mozilla/5.0 (X11; Ubuntu; Linux x86_64; rv:68.0) Gecko/20100101 Firefox/68.0-80
192.168.6.223-192.168.6.213-06/Aug/2019:14:20:16 +0100-GET /home HTTP/1.1-304-0-http://192.168.6.223/home-Mozilla/5.0 (X11; Ubuntu; Linux x86_64; rv:68.0) Gecko/20100101 Firefox/68.0-80
192.168.6.223-192.168.6.213-06/Aug/2019:14:20:16 +0100-GET /js HTTP/1.1-304-0-http://192.168.6.223/home-Mozilla/5.0 (X11; Ubuntu; Linux x86_64; rv:68.0) Gecko/20100101 Firefox/68.0-80
192.168.6.223-192.168.6.213-06/Aug/2019:14:20:16 +0100-GET /home HTTP/1.1-304-0-http://192.168.6.223/home-Mozilla/5.0 (X11; Ubuntu; Linux x86_64; rv:68.0) Gecko/20100101 Firefox/68.0-80
192.168.6.223-192.168.6.213-06/Aug/2019:14:20:16 +0100-GET /js HTTP/1.1-404-0-http://192.168.6.223/home-Mozilla/5.0 (X11; Ubuntu; Linux x86_64; rv:68.0) Gecko/20100101 Firefox/68.0-80
192.168.6.223-192.168.6.213-06/Aug/2019:14:20:16 +0100-GET /home HTTP/1.1-304-0-http://192.168.6.223/home-Mozilla/5.0 (X11; Ubuntu; Linux x86_64; rv:68.0) Gecko/20100101 Firefox/68.0-80
192.168.6.223-192.168.6.213-06/Aug/2019:14:20:16 +0100-GET /home HTTP/1.1-304-0-http://192.168.6.223/home-Mozilla/5.0 (X11; Ubuntu; Linux x86_64; rv:68.0) Gecko/20100101 Firefox/68.0-80
192.168.6.223-192.168.6.213-06/Aug/2019:14:20:16 +0100-GET /js HTTP/1.1-404-0-http://192.168.6.223/home-Mozilla/5.0 (X11; Ubuntu; Linux x86_64; rv:68.0) Gecko/20100101 Firefox/68.0-80
192.168.6.223-192.168.6.213-06/Aug/2019:14:20:16 +0100-GET /home HTTP/1.1-304-0-http://192.168.6.223/home-Mozilla/5.0 (X11; Ubuntu; Linux x86_64; rv:68.0) Gecko/20100101 Firefox/68.0-80
192.168.6.223-192.168.6.213-06/Aug/2019:14:20:16 +0100-GET /js HTTP/1.1-304-0-http://192.168.6.223/home-Mozilla/5.0 (X11; Ubuntu; Linux x86_64; rv:68.0) Gecko/20100101 Firefox/68.0-80
192.168.6.223-192.168.6.213-06/Aug/2019:14:20:16 +0100-GET /js HTTP/1.1-304-0-http://192.168.6.223/home-Mozilla/5.0 (X11; Ubuntu; Linux x86_64; rv:68.0) Gecko/20100101 Firefox/68.0-80
192.168.6.223-192.168.6.213-06/Aug/2019:14:20:16 +0100-GET /home HTTP/1.1-304-0-http://192.168.6.223/home-Mozilla/5.0 (X11; Ubuntu; Linux x86_64; rv:68.0) Gecko/20100101 Firefox/68.0-80
192.168.6.223-192.168.6.213-06/Aug/2019:14:20:16 +0100-GET /js HTTP/1.1-304-0-http://192.168.6.223/home-Mozilla/5.0 (X11; Ubuntu; Linux x86_64; rv:68.0) Gecko/20100101 Firefox/68.0-80
192.168.6.223-192.168.6.213-06/Aug/2019:14:20:16 +0100-GET /js HTTP/1.1-304-0-http://192.168.6.223/home-Mozilla/5.0 (X11; Ubuntu; Linux x86_64; rv:68.0) Gecko/20100101 Firefox/68.0-80
192.168.6.223-192.168.6.213-06/Aug/2019:14:20:16 +0100-GET /home HTTP/1.1-304-0-http://192.168.6.223/home-Mozilla/5.0 (X11; Ubuntu; Linux x86_64; rv:68.0) Gecko/20100101 Firefox/68.0-80
192.168.6.223-192.168.6.213-06/Aug/2019:14:20:16 +0100-GET /js HTTP/1.1-304-0-http://192.168.6.223/home-Mozilla/5.0 (X11; Ubuntu; Linux x86_64; rv:68.0) Gecko/20100101 Firefox/68.0-80
192.168.6.223-192.168.6.213-06/Aug/2019:14:20:16 +0100-GET /js HTTP/1.1-304-0-http://192.168.6.223/home-Mozilla/5.0 (X11; Ubuntu; Linux x86_64; rv:68.0) Gecko/20100101 Firefox/68.0-80
192.168.6.223-192.168.6.213-06/Aug/2019:14:20:16 +0100-GET /home HTTP/1.1-304-0-http://192.168.6.223/home-Mozilla/5.0 (X11; Ubuntu; Linux x86_64; rv:68.0) Gecko/20100101 Firefox/68.0-80
192.168.6.223-192.168.6.213-06/Aug/2019:14:20:16 +0100-GET /js HTTP/1.1-304-0-http://192.168.6.223/home-Mozilla/5.0 (X11; Ubuntu; Linux x86_64; rv:68.0) Gecko/20100101 Firefox/68.0-80
192.168.6.223-192.168.6.213-06/Aug/2019:14:20:16 +0100-GET /home HTTP/1.1-304-0-http://192.168.6.223/home-Mozilla/5.0 (X11; Ubuntu; Linux x86_64; rv:68.0) Gecko/20100101 Firefox/68.0-80
192.168.6.223-192.168.6.213-06/Aug/2019:14:20:16 +0100-GET /js HTTP/1.1-304-0-http://192.168.6.223/home-Mozilla/5.0 (X11; Ubuntu; Linux x86_64; rv:68.0) Gecko/20100101 Firefox/68.0-80
192.168.6.223-192.168.6.213-06/Aug/2019:14:20:16 +0100-GET /js HTTP/1.1-304-0-http://192.168.6.223/home-Mozilla/5.0 (X11; Ubuntu; Linux x86_64; rv:68.0) Gecko/20100101 Firefox/68.0-80
192.168.6.223-192.168.6.213-06/Aug/2019:14:20:16 +0100-GET /home HTTP/1.1-304-0-http://192.168.6.223/home-Mozilla/5.0 (X11; Ubuntu; Linux x86_64; rv:68.0) Gecko/20100101 Firefox/68.0-80
192.168.6.223-192.168.6.213-06/Aug/2019:14:20:16 +0100-GET /js HTTP/1.1-404-0-http://192.168.6.223/home-Mozilla/5.0 (X11; Ubuntu; Linux x86_64; rv:68.0) Gecko/20100101 Firefox/68.0-80
192.168.6.223-192.168.6.213-06/Aug/2019:14:20:16 +0100-GET /js HTTP/1.1-404-0-http://192.168.6.223/home-Mozilla/5.0 (X11; Ubuntu; Linux x86_64; rv:68.0) Gecko/20100101 Firefox/68.0-80
192.168.6.223-192.168.6.213-06/Aug/2019:14:20:16 +0100-GET /js HTTP/1.1-404-0-http://192.168.6.223/home-Mozilla/5.0 (X11; Ubuntu; Linux x86_64; rv:68.0) Gecko/20100101 Firefox/68.0-80
192.168.6.223-192.168.6.213-06/Aug/2019:14:20:16 +0100-GET /js HTTP/1.1-404-0-http://192.168.6.223/home-Mozilla/5.0 (X11; Ubuntu; Linux x86_64; rv:68.0) Gecko/20100101 Firefox/68.0-80
192.168.6.223-192.168.6.213-06/Aug/2019:14:20:16 +0100-GET /js HTTP/1.1-304-0-http://192.168.6.223/home-Mozilla/5.0 (X11; Ubuntu; Linux x86_64; rv:68.0) Gecko/20100101 Firefox/68.0-80
192.168.6.223-192.168.6.213-06/Aug/2019:14:20:16 +0100-GET /js HTTP/1.1-304-0-http://192.168.6.223/home-Mozilla/5.0 (X11; Ubuntu; Linux x86_64; rv:68.0) Gecko/20100101 Firefox/68.0-80
192.168.6.223-192.168.6.213-06/Aug/2019:14:20:16 +0100-GET /home HTTP/1.1-304-0-http://192.168.6.223/home-Mozilla/5.0 (X11; Ubuntu; Linux x86_64; rv:68.0) Gecko/20100101 Firefox/68.0-80
192.168.6.223-192.168.6.213-06/Aug/2019:14:20:16 +0100-GET /js HTTP/1.1-304-0-http://192.168.6.223/home-Mozilla/5.0 (X11; Ubuntu; Linux x86_64; rv:68.0) Gecko/20100101 Firefox/68.0-80
192.168.6.223-192.168.6.213-06/Aug/2019:14:20:16 +0100-GET /home HTTP/1.1-304-0-http://192.168.6.223/home-Mozilla/5.0 (X11; Ubuntu; Linux x86_64; rv:68.0) Gecko/20100101 Firefox/68.0-80
192.168.6.223-192.168.6.213-06/Aug/2019:14:20:16 +0100-GET /js HTTP/1.1-304-0-http://192.168.6.223/home-Mozilla/5.0 (X11; Ubuntu; Linux x86_64; rv:68.0) Gecko/20100101 Firefox/68.0-80
192.168.6.223-192.168.6.213-06/Aug/2019:14:20:16 +0100-GET /js HTTP/1.1-404-0-http://192.168.6.223/home-Mozilla/5.0 (X11; Ubuntu; Linux x86_64; rv:68.0) Gecko/20100101 Firefox/68.0-80
192.168.6.223-192.168.6.213-06/Aug/2019:14:20:16 +0100-GET /home HTTP/1.1-304-0-http://192.168.6.223/home-Mozilla/5.0 (X11; Ubuntu; Linux x86_64; rv:68.0) Gecko/20100101 Firefox/68.0-80
192.168.6.223-192.168.6.213-06/Aug/2019:14:20:16 +0100-GET /js HTTP/1.1-404-0-http://192.168.6.223/home-Mozilla/5.0 (X11; Ubuntu; Linux x86_64; rv:68.0) Gecko/20100101 Firefox/68.0-80
192.168.6.223-192.168.6.213-06/Aug/2019:14:20:16 +0100-GET /js HTTP/1.1-404-0-http://192.168.6.223/home-Mozilla/5.0 (X11; Ubuntu; Linux x86_64; rv:68.0) Gecko/20100101 Firefox/68.0-80
192.168.6.223-192.168.6.213-06/Aug/2019:14:20:16 +0100-GET /js HTTP/1.1-404-0-http://192.168.6.223/home-Mozilla/5.0 (X11; Ubuntu; Linux x86_64; rv:68.0) Gecko/20100101 Firefox/68.0-80
192.168.6.223-192.168.6.213-06/Aug/2019:14:20:16 +0100-GET /home HTTP/1.1-304-0-http://192.168.6.223/home-Mozilla/5.0 (X11; Ubuntu; Linux x86_64; rv:68.0) Gecko/20100101 Firefox/68.0-80
192.168.6.223-192.168.6.213-06/Aug/2019:14:20:16 +0100-GET /js HTTP/1.1-404-0-http://192.168.6.223/home-Mozilla/5.0 (X11; Ubuntu; Linux x86_64; rv:68.0) Gecko/20100101 Firefox/68.0-80
192.168.6.223-192.168.6.213-06/Aug/2019:14:20:16 +0100-GET /js HTTP/1.1-404-0-http://192.168.6.223/home-Mozilla/5.0 (X11; Ubuntu; Linux x86_64; rv:68.0) Gecko/20100101 Firefox/68.0-80
192.168.6.223-192.168.6.213-06/Aug/2019:14:20:16 +0100-GET /js HTTP/1.1-404-0-http://192.168.6.223/home-Mozilla/5.0 (X11; Ubuntu; Linux x86_64; rv:68.0) Gecko/20100101 Firefox/68.0-80
192.168.6.223-192.168.6.213-06/Aug/2019:14:20:16 +0100-GET /home HTTP/1.1-304-0-http://192.168.6.223/home-Mozilla/5.0 (X11; Ubuntu; Linux x86_64; rv:68.0) Gecko/20100101 Firefox/68.0-80
192.168.6.223-192.168.6.213-06/Aug/2019:14:20:16 +0100-GET /js HTTP/1.1-304-0-http://192.168.6.223/home-Mozilla/5.0 (X11; Ubuntu; Linux x86_64; rv:68.0) Gecko/20100101 Firefox/68.0-80
192.168.6.223-192.168.6.213-06/Aug/2019:14:20:16 +0100-GET /js HTTP/1.1-304-0-http://192.168.6.223/home-Mozilla/5.0 (X11; Ubuntu; Linux x86_64; rv:68.0) Gecko/20100101 Firefox/68.0-80
192.168.6.223-192.168.6.213-06/Aug/2019:14:20:16 +0100-GET /js HTTP/1.1-304-0-http://192.168.6.223/home-Mozilla/5.0 (X11; Ubuntu; Linux x86_64; rv:68.0) Gecko/20100101 Firefox/68.0-80
192.168.6.223-192.168.6.213-06/Aug/2019:14:20:16 +0100-GET /js HTTP/1.1-404-0-http://192.168.6.223/home-Mozilla/5.0 (X11; Ubuntu; Linux x86_64; rv:68.0) Gecko/20100101 Firefox/68.0-80
192.168.6.223-192.168.6.213-06/Aug/2019:14:20:16 +0100-GET /home HTTP/1.1-304-0-http://192.168.6.223/home-Mozilla/5.0 (X11; Ubuntu; Linux x86_64; rv:68.0) Gecko/20100101 Firefox/68.0-80
192.168.6.223-192.168.6.213-06/Aug/2019:14:20:16 +0100-GET /js HTTP/1.1-404-0-http://192.168.6.223/home-Mozilla/5.0 (X11; Ubuntu; Linux x86_64; rv:68.0) Gecko/20100101 Firefox/68.0-80
192.168.6.223-192.168.6.213-06/Aug/2019:14:20:16 +0100-GET /js HTTP/1.1-304-0-http://192.168.6.223/home-Mozilla/5.0 (X11; Ubuntu; Linux x86_64; rv:68.0) Gecko/20100101 Firefox/68.0-80
192.168.6.223-192.168.6.213-06/Aug/2019:14:20:16 +0100-GET /js HTTP/1.1-304-0-http://192.168.6.223/home-Mozilla/5.0 (X11; Ubuntu; Linux x86_64; rv:68.0) Gecko/20100101 Firefox/68.0-80
192.168.6.223-192.168.6.213-06/Aug/2019:14:20:16 +0100-GET /js HTTP/1.1-404-0-http://192.168.6.223/home-Mozilla/5.0 (X11; Ubuntu; Linux x86_64; rv:68.0) Gecko/20100101 Firefox/68.0-80
192.168.6.223-192.168.6.213-06/Aug/2019:14:20:16 +0100-GET /js HTTP/1.1-404-0-http://192.168.6.223/home-Mozilla/5.0 (X11; Ubuntu; Linux x86_64; rv:68.0) Gecko/20100101 Firefox/68.0-80
192.168.6.223-192.168.6.213-06/Aug/2019:14:20:16 +0100-GET /js HTTP/1.1-404-0-http://192.168.6.223/home-Mozilla/5.0 (X11; Ubuntu; Linux x86_64; rv:68.0) Gecko/20100101 Firefox/68.0-80
192.168.6.223-192.168.6.213-06/Aug/2019:14:20:16 +0100-GET /js HTTP/1.1-404-0-http://192.168.6.223/home-Mozilla/5.0 (X11; Ubuntu; Linux x86_64; rv:68.0) Gecko/20100101 Firefox/68.0-80
192.168.6.223-192.168.6.213-06/Aug/2019:14:20:16 +0100-GET /js HTTP/1.1-404-0-http://192.168.6.223/home-Mozilla/5.0 (X11; Ubuntu; Linux x86_64; rv:68.0) Gecko/20100101 Firefox/68.0-80
192.168.6.223-192.168.6.213-06/Aug/2019:14:20:16 +0100-GET /home HTTP/1.1-304-0-http://192.168.6.223/home-Mozilla/5.0 (X11; Ubuntu; Linux x86_64; rv:68.0) Gecko/20100101 Firefox/68.0-80
192.168.6.223-192.168.6.213-06/Aug/2019:14:20:16 +0100-GET /home HTTP/1.1-304-0-http://192.168.6.223/home-Mozilla/5.0 (X11; Ubuntu; Linux x86_64; rv:68.0) Gecko/20100101 Firefox/68.0-80
192.168.6.223-192.168.6.213-06/Aug/2019:14:20:16 +0100-GET /home HTTP/1.1-304-0-http://192.168.6.223/home-Mozilla/5.0 (X11; Ubuntu; Linux x86_64; rv:68.0) Gecko/20100101 Firefox/68.0-80
192.168.6.223-192.168.6.213-06/Aug/2019:14:20:16 +0100-GET /home HTTP/1.1-304-0-http://192.168.6.223/home-Mozilla/5.0 (X11; Ubuntu; Linux x86_64; rv:68.0) Gecko/20100101 Firefox/68.0-80
192.168.6.223-192.168.6.213-06/Aug/2019:14:20:16 +0100-GET /js HTTP/1.1-304-0-http://192.168.6.223/home-Mozilla/5.0 (X11; Ubuntu; Linux x86_64; rv:68.0) Gecko/20100101 Firefox/68.0-80
192.168.6.223-192.168.6.213-06/Aug/2019:14:20:16 +0100-GET /js HTTP/1.1-404-0-http://192.168.6.223/home-Mozilla/5.0 (X11; Ubuntu; Linux x86_64; rv:68.0) Gecko/20100101 Firefox/68.0-80
192.168.6.223-192.168.6.213-06/Aug/2019:14:20:16 +0100-GET /home HTTP/1.1-304-0-http://192.168.6.223/home-Mozilla/5.0 (X11; Ubuntu; Linux x86_64; rv:68.0) Gecko/20100101 Firefox/68.0-80
192.168.6.223-192.168.6.213-06/Aug/2019:14:20:16 +0100-GET /home HTTP/1.1-304-0-http://192.168.6.223/home-Mozilla/5.0 (X11; Ubuntu; Linux x86_64; rv:68.0) Gecko/20100101 Firefox/68.0-80
192.168.6.223-192.168.6.213-06/Aug/2019:14:20:16 +0100-GET /home HTTP/1.1-304-0-http://192.168.6.223/home-Mozilla/5.0 (X11; Ubuntu; Linux x86_64; rv:68.0) Gecko/20100101 Firefox/68.0-80
